beam-commits mailing list archives

Site index · List index
Message view « Date » · « Thread »
Top « Date » · « Thread »
From Apache Jenkins Server <jenk...@builds.apache.org>
Subject Build failed in Jenkins: beam_PostCommit_Java_MavenInstall #5643
Date Sat, 13 Jan 2018 07:23:12 GMT
See <https://builds.apache.org/job/beam_PostCommit_Java_MavenInstall/5643/display/redirect?page=changes>

Changes:

[github] [BEAM-3336] Fix thread safety issues of MqttIOTest (#4406)

------------------------------------------
[...truncated 1.34 MB...]
2018-01-13T07:21:16.964 [INFO] Excluding org.scala-stm:scala-stm_2.11:jar:0.8 from the shaded
jar.
2018-01-13T07:21:16.965 [INFO] Excluding com.typesafe.akka:akka-slf4j_2.11:jar:2.4.16 from
the shaded jar.
2018-01-13T07:21:16.965 [INFO] Excluding com.typesafe.akka:akka-kernel_2.11:jar:2.4.16 from
the shaded jar.
2018-01-13T07:21:16.965 [INFO] Excluding com.typesafe.akka:akka-http_2.11:jar:10.0.1 from
the shaded jar.
2018-01-13T07:21:16.965 [INFO] Excluding com.typesafe.akka:akka-http-core_2.11:jar:10.0.1
from the shaded jar.
2018-01-13T07:21:16.965 [INFO] Excluding com.typesafe.akka:akka-parsing_2.11:jar:10.0.1 from
the shaded jar.
2018-01-13T07:21:16.967 [INFO] Excluding com.typesafe.akka:akka-http-spray-json_2.11:jar:10.0.1
from the shaded jar.
2018-01-13T07:21:16.967 [INFO] Excluding io.spray:spray-json_2.11:jar:1.3.2 from the shaded
jar.
2018-01-13T07:21:16.967 [INFO] Excluding org.scala-lang:scala-reflect:jar:2.11.8 from the
shaded jar.
2018-01-13T07:21:16.967 [INFO] Excluding org.apache.beam:beam-sdks-java-core:jar:2.3.0-SNAPSHOT
from the shaded jar.
2018-01-13T07:21:16.967 [INFO] Excluding com.google.protobuf:protobuf-java:jar:3.2.0 from
the shaded jar.
2018-01-13T07:21:16.968 [INFO] Excluding com.github.stephenc.findbugs:findbugs-annotations:jar:1.3.9-1
from the shaded jar.
2018-01-13T07:21:16.968 [INFO] Excluding com.fasterxml.jackson.core:jackson-core:jar:2.8.9
from the shaded jar.
2018-01-13T07:21:16.968 [INFO] Excluding net.bytebuddy:byte-buddy:jar:1.6.8 from the shaded
jar.
2018-01-13T07:21:16.968 [INFO] Excluding org.apache.avro:avro:jar:1.8.2 from the shaded jar.
2018-01-13T07:21:16.968 [INFO] Excluding org.codehaus.jackson:jackson-core-asl:jar:1.9.13
from the shaded jar.
2018-01-13T07:21:16.968 [INFO] Excluding org.codehaus.jackson:jackson-mapper-asl:jar:1.9.13
from the shaded jar.
2018-01-13T07:21:16.968 [INFO] Excluding com.thoughtworks.paranamer:paranamer:jar:2.7 from
the shaded jar.
2018-01-13T07:21:16.968 [INFO] Excluding org.tukaani:xz:jar:1.5 from the shaded jar.
2018-01-13T07:21:16.968 [INFO] Excluding org.xerial.snappy:snappy-java:jar:1.1.4 from the
shaded jar.
2018-01-13T07:21:16.969 [INFO] Excluding org.apache.commons:commons-compress:jar:1.14 from
the shaded jar.
2018-01-13T07:21:16.969 [INFO] Excluding org.apache.commons:commons-lang3:jar:3.6 from the
shaded jar.
2018-01-13T07:21:16.969 [INFO] Excluding org.apache.beam:beam-runners-core-java:jar:2.3.0-SNAPSHOT
from the shaded jar.
2018-01-13T07:21:16.969 [INFO] Excluding org.apache.beam:beam-model-pipeline:jar:2.3.0-SNAPSHOT
from the shaded jar.
2018-01-13T07:21:16.969 [INFO] Excluding org.apache.beam:beam-runners-core-construction-java:jar:2.3.0-SNAPSHOT
from the shaded jar.
2018-01-13T07:21:16.969 [INFO] Excluding org.apache.beam:beam-model-job-management:jar:2.3.0-SNAPSHOT
from the shaded jar.
2018-01-13T07:21:16.969 [INFO] Excluding io.grpc:grpc-protobuf:jar:1.2.0 from the shaded jar.
2018-01-13T07:21:16.969 [INFO] Excluding io.grpc:grpc-protobuf-lite:jar:1.2.0 from the shaded
jar.
2018-01-13T07:21:16.969 [INFO] Excluding com.google.protobuf:protobuf-java-util:jar:3.2.0
from the shaded jar.
2018-01-13T07:21:16.970 [INFO] Excluding com.google.code.gson:gson:jar:2.7 from the shaded
jar.
2018-01-13T07:21:16.970 [INFO] Excluding io.grpc:grpc-core:jar:1.2.0 from the shaded jar.
2018-01-13T07:21:16.970 [INFO] Excluding com.google.errorprone:error_prone_annotations:jar:2.0.15
from the shaded jar.
2018-01-13T07:21:16.970 [INFO] Excluding io.grpc:grpc-context:jar:1.2.0 from the shaded jar.
2018-01-13T07:21:16.970 [INFO] Excluding com.google.instrumentation:instrumentation-api:jar:0.3.0
from the shaded jar.
2018-01-13T07:21:16.970 [INFO] Excluding io.grpc:grpc-stub:jar:1.2.0 from the shaded jar.
2018-01-13T07:21:16.970 [INFO] Excluding joda-time:joda-time:jar:2.4 from the shaded jar.
2018-01-13T07:21:16.970 [INFO] Excluding com.fasterxml.jackson.core:jackson-annotations:jar:2.8.9
from the shaded jar.
2018-01-13T07:21:16.970 [INFO] Including com.google.guava:guava:jar:20.0 in the shaded jar.
2018-01-13T07:21:16.970 [INFO] Excluding com.google.code.findbugs:jsr305:jar:3.0.1 from the
shaded jar.
2018-01-13T07:21:16.971 [INFO] Excluding com.google.auto.service:auto-service:jar:1.0-rc2
from the shaded jar.
2018-01-13T07:21:16.971 [INFO] Excluding com.google.auto:auto-common:jar:0.3 from the shaded
jar.
2018-01-13T07:21:21.221 [INFO] Replacing original artifact with shaded artifact.
2018-01-13T07:21:21.222 [INFO] Replacing <https://builds.apache.org/job/beam_PostCommit_Java_MavenInstall/ws/src/runners/gearpump/target/beam-runners-gearpump-2.3.0-SNAPSHOT.jar>
with <https://builds.apache.org/job/beam_PostCommit_Java_MavenInstall/ws/src/runners/gearpump/target/beam-runners-gearpump-2.3.0-SNAPSHOT-shaded.jar>
2018-01-13T07:21:21.222 [INFO] Replacing original test artifact with shaded test artifact.
2018-01-13T07:21:21.222 [INFO] Replacing <https://builds.apache.org/job/beam_PostCommit_Java_MavenInstall/ws/src/runners/gearpump/target/beam-runners-gearpump-2.3.0-SNAPSHOT-tests.jar>
with <https://builds.apache.org/job/beam_PostCommit_Java_MavenInstall/ws/src/runners/gearpump/target/beam-runners-gearpump-2.3.0-SNAPSHOT-shaded-tests.jar>
2018-01-13T07:21:21.222 [INFO] Dependency-reduced POM written at: <https://builds.apache.org/job/beam_PostCommit_Java_MavenInstall/ws/src/runners/gearpump/dependency-reduced-pom.xml>
2018-01-13T07:21:21.475 [INFO] 
2018-01-13T07:21:21.475 [INFO] --- maven-javadoc-plugin:3.0.0-M1:jar (attach-javadocs) @ beam-runners-gearpump
---
2018-01-13T07:21:25.697 [INFO] Building jar: <https://builds.apache.org/job/beam_PostCommit_Java_MavenInstall/ws/src/runners/gearpump/target/beam-runners-gearpump-2.3.0-SNAPSHOT-javadoc.jar>
2018-01-13T07:21:25.907 [INFO] 
2018-01-13T07:21:25.907 [INFO] --- maven-source-plugin:3.0.1:jar-no-fork (attach-sources)
@ beam-runners-gearpump ---
2018-01-13T07:21:25.917 [INFO] Building jar: <https://builds.apache.org/job/beam_PostCommit_Java_MavenInstall/ws/src/runners/gearpump/target/beam-runners-gearpump-2.3.0-SNAPSHOT-sources.jar>
2018-01-13T07:21:26.073 [INFO] 
2018-01-13T07:21:26.074 [INFO] --- maven-source-plugin:3.0.1:test-jar-no-fork (attach-test-sources)
@ beam-runners-gearpump ---
2018-01-13T07:21:26.077 [INFO] Building jar: <https://builds.apache.org/job/beam_PostCommit_Java_MavenInstall/ws/src/runners/gearpump/target/beam-runners-gearpump-2.3.0-SNAPSHOT-test-sources.jar>
2018-01-13T07:21:26.245 [INFO] 
2018-01-13T07:21:26.245 [INFO] --- reproducible-build-maven-plugin:0.4:strip-jar (default)
@ beam-runners-gearpump ---
2018-01-13T07:21:26.246 [INFO] Stripping <https://builds.apache.org/job/beam_PostCommit_Java_MavenInstall/ws/src/runners/gearpump/target/beam-runners-gearpump-2.3.0-SNAPSHOT-sources.jar>
2018-01-13T07:21:26.250 [INFO] Stripping <https://builds.apache.org/job/beam_PostCommit_Java_MavenInstall/ws/src/runners/gearpump/target/beam-runners-gearpump-2.3.0-SNAPSHOT-test-sources.jar>
2018-01-13T07:21:26.253 [INFO] Stripping <https://builds.apache.org/job/beam_PostCommit_Java_MavenInstall/ws/src/runners/gearpump/target/beam-runners-gearpump-2.3.0-SNAPSHOT-tests.jar>
2018-01-13T07:21:26.256 [INFO] Stripping <https://builds.apache.org/job/beam_PostCommit_Java_MavenInstall/ws/src/runners/gearpump/target/beam-runners-gearpump-2.3.0-SNAPSHOT.jar>
2018-01-13T07:21:26.547 [INFO] Stripping <https://builds.apache.org/job/beam_PostCommit_Java_MavenInstall/ws/src/runners/gearpump/target/original-beam-runners-gearpump-2.3.0-SNAPSHOT.jar>
2018-01-13T07:21:26.553 [INFO] Stripping <https://builds.apache.org/job/beam_PostCommit_Java_MavenInstall/ws/src/runners/gearpump/target/beam-runners-gearpump-2.3.0-SNAPSHOT-javadoc.jar>
2018-01-13T07:21:26.557 [INFO] Stripping <https://builds.apache.org/job/beam_PostCommit_Java_MavenInstall/ws/src/runners/gearpump/target/original-beam-runners-gearpump-2.3.0-SNAPSHOT-tests.jar>
2018-01-13T07:21:26.667 [INFO] 
2018-01-13T07:21:26.667 [INFO] --- maven-dependency-plugin:3.0.1:analyze-only (default) @
beam-runners-gearpump ---
2018-01-13T07:21:26.982 [INFO] No dependency problems found
2018-01-13T07:21:27.091 [INFO] 
2018-01-13T07:21:27.091 [INFO] --- maven-install-plugin:2.5.2:install (default-install) @
beam-runners-gearpump ---
2018-01-13T07:21:27.093 [INFO] Installing <https://builds.apache.org/job/beam_PostCommit_Java_MavenInstall/ws/src/runners/gearpump/target/beam-runners-gearpump-2.3.0-SNAPSHOT.jar>
to <https://builds.apache.org/job/beam_PostCommit_Java_MavenInstall/ws/.repository/org/apache/beam/beam-runners-gearpump/2.3.0-SNAPSHOT/beam-runners-gearpump-2.3.0-SNAPSHOT.jar>
2018-01-13T07:21:27.113 [INFO] Installing <https://builds.apache.org/job/beam_PostCommit_Java_MavenInstall/ws/src/runners/gearpump/dependency-reduced-pom.xml>
to <https://builds.apache.org/job/beam_PostCommit_Java_MavenInstall/ws/.repository/org/apache/beam/beam-runners-gearpump/2.3.0-SNAPSHOT/beam-runners-gearpump-2.3.0-SNAPSHOT.pom>
2018-01-13T07:21:27.156 [INFO] Installing <https://builds.apache.org/job/beam_PostCommit_Java_MavenInstall/ws/src/runners/gearpump/target/beam-runners-gearpump-2.3.0-SNAPSHOT-tests.jar>
to <https://builds.apache.org/job/beam_PostCommit_Java_MavenInstall/ws/.repository/org/apache/beam/beam-runners-gearpump/2.3.0-SNAPSHOT/beam-runners-gearpump-2.3.0-SNAPSHOT-tests.jar>
2018-01-13T07:21:27.158 [INFO] Installing <https://builds.apache.org/job/beam_PostCommit_Java_MavenInstall/ws/src/runners/gearpump/target/beam-runners-gearpump-2.3.0-SNAPSHOT-tests.jar>
to <https://builds.apache.org/job/beam_PostCommit_Java_MavenInstall/ws/.repository/org/apache/beam/beam-runners-gearpump/2.3.0-SNAPSHOT/beam-runners-gearpump-2.3.0-SNAPSHOT-tests.jar>
2018-01-13T07:21:27.159 [INFO] Installing <https://builds.apache.org/job/beam_PostCommit_Java_MavenInstall/ws/src/runners/gearpump/target/beam-runners-gearpump-2.3.0-SNAPSHOT-javadoc.jar>
to <https://builds.apache.org/job/beam_PostCommit_Java_MavenInstall/ws/.repository/org/apache/beam/beam-runners-gearpump/2.3.0-SNAPSHOT/beam-runners-gearpump-2.3.0-SNAPSHOT-javadoc.jar>
2018-01-13T07:21:27.161 [INFO] Installing <https://builds.apache.org/job/beam_PostCommit_Java_MavenInstall/ws/src/runners/gearpump/target/beam-runners-gearpump-2.3.0-SNAPSHOT-sources.jar>
to <https://builds.apache.org/job/beam_PostCommit_Java_MavenInstall/ws/.repository/org/apache/beam/beam-runners-gearpump/2.3.0-SNAPSHOT/beam-runners-gearpump-2.3.0-SNAPSHOT-sources.jar>
2018-01-13T07:21:27.173 [INFO] Installing <https://builds.apache.org/job/beam_PostCommit_Java_MavenInstall/ws/src/runners/gearpump/target/beam-runners-gearpump-2.3.0-SNAPSHOT-test-sources.jar>
to <https://builds.apache.org/job/beam_PostCommit_Java_MavenInstall/ws/.repository/org/apache/beam/beam-runners-gearpump/2.3.0-SNAPSHOT/beam-runners-gearpump-2.3.0-SNAPSHOT-test-sources.jar>
[JENKINS] Archiving disabled
2018-01-13T07:21:28.723 [INFO]                                                           
             
2018-01-13T07:21:28.723 [INFO] ------------------------------------------------------------------------
2018-01-13T07:21:28.723 [INFO] Skipping Apache Beam :: SDKs :: Java :: Aggregated Javadoc
2018-01-13T07:21:28.723 [INFO] This project has been banned from the build due to previous
failures.
2018-01-13T07:21:28.723 [INFO] ------------------------------------------------------------------------
[JENKINS] Archiving disabled
[JENKINS] Archiving disabled
[JENKINS] Archiving disabled
[JENKINS] Archiving disabled
[JENKINS] Archiving disabled
[JENKINS] Archiving disabled
[JENKINS] Archiving disabled
[JENKINS] Archiving disabled
[JENKINS] Archiving disabled
[JENKINS] Archiving disabled
[JENKINS] Archiving disabled
[JENKINS] Archiving disabled
[JENKINS] Archiving disabled
[JENKINS] Archiving disabled
[JENKINS] Archiving disabled
[JENKINS] Archiving disabled
[JENKINS] Archiving disabled
[JENKINS] Archiving disabled
[JENKINS] Archiving disabled
[JENKINS] Archiving disabled
[JENKINS] Archiving disabled
[JENKINS] Archiving disabled
[JENKINS] Archiving disabled
[JENKINS] Archiving disabled
[JENKINS] Archiving disabled
[JENKINS] Archiving disabled
[JENKINS] Archiving disabled
[JENKINS] Archiving disabled
[JENKINS] Archiving disabled
[JENKINS] Archiving disabled
[JENKINS] Archiving disabled
[JENKINS] Archiving disabled
[JENKINS] Archiving disabled
[JENKINS] Archiving disabled
[JENKINS] Archiving disabled
[JENKINS] Archiving disabled
[JENKINS] Archiving disabled
[JENKINS] Archiving disabled
[JENKINS] Archiving disabled
[JENKINS] Archiving disabled
[JENKINS] Archiving disabled
[JENKINS] Archiving disabled
[JENKINS] Archiving disabled
[JENKINS] Archiving disabled
[JENKINS] Archiving disabled
[JENKINS] Archiving disabled
[JENKINS] Archiving disabled
[JENKINS] Archiving disabled
[JENKINS] Archiving disabled
[JENKINS] Archiving disabled
[JENKINS] Archiving disabled
[JENKINS] Archiving disabled
[JENKINS] Archiving disabled
[JENKINS] Archiving disabled
[JENKINS] Archiving disabled
[JENKINS] Archiving disabled
[JENKINS] Archiving disabled
[JENKINS] Archiving disabled
[JENKINS] Archiving disabled
[JENKINS] Archiving disabled
[JENKINS] Archiving disabled
[JENKINS] Archiving disabled
[JENKINS] Archiving disabled
[JENKINS] Archiving disabled
[JENKINS] Archiving disabled
[JENKINS] Archiving disabled
[JENKINS] Archiving disabled
2018-01-13T07:22:31.840 [INFO] ------------------------------------------------------------------------
2018-01-13T07:22:31.840 [INFO] Reactor Summary:
2018-01-13T07:22:31.840 [INFO] 
2018-01-13T07:22:31.841 [INFO] Apache Beam :: Parent .............................. SUCCESS
[ 20.666 s]
2018-01-13T07:22:31.841 [INFO] Apache Beam :: SDKs :: Java :: Build Tools ......... SUCCESS
[ 13.129 s]
2018-01-13T07:22:31.841 [INFO] Apache Beam :: Model ............................... SUCCESS
[  2.166 s]
2018-01-13T07:22:31.841 [INFO] Apache Beam :: Model :: Pipeline ................... SUCCESS
[ 36.165 s]
2018-01-13T07:22:31.841 [INFO] Apache Beam :: Model :: Job Management ............. SUCCESS
[ 20.768 s]
2018-01-13T07:22:31.841 [INFO] Apache Beam :: Model :: Fn Execution ............... SUCCESS
[ 28.307 s]
2018-01-13T07:22:31.841 [INFO] Apache Beam :: SDKs ................................ SUCCESS
[  3.560 s]
2018-01-13T07:22:31.841 [INFO] Apache Beam :: SDKs :: Java ........................ SUCCESS
[  3.263 s]
2018-01-13T07:22:31.841 [INFO] Apache Beam :: SDKs :: Java :: Core ................ SUCCESS
[04:14 min]
2018-01-13T07:22:31.841 [INFO] Apache Beam :: Runners ............................. SUCCESS
[  3.225 s]
2018-01-13T07:22:31.841 [INFO] Apache Beam :: Runners :: Local Java Core .......... SUCCESS
[ 19.367 s]
2018-01-13T07:22:31.841 [INFO] Apache Beam :: Runners :: Core Construction Java ... SUCCESS
[ 40.517 s]
2018-01-13T07:22:31.841 [INFO] Apache Beam :: Runners :: Core Java ................ SUCCESS
[01:00 min]
2018-01-13T07:22:31.841 [INFO] Apache Beam :: Runners :: Direct Java .............. SUCCESS
[06:20 min]
2018-01-13T07:22:31.841 [INFO] Apache Beam :: SDKs :: Java :: IO :: AMQP .......... SUCCESS
[ 37.486 s]
2018-01-13T07:22:31.841 [INFO] Apache Beam :: SDKs :: Java :: IO :: Common ........ SUCCESS
[  8.730 s]
2018-01-13T07:22:31.841 [INFO] Apache Beam :: SDKs :: Java :: IO :: Cassandra ..... SUCCESS
[ 33.697 s]
2018-01-13T07:22:31.841 [INFO] Apache Beam :: SDKs :: Java :: IO :: Elasticsearch . SUCCESS
[ 17.996 s]
2018-01-13T07:22:31.841 [INFO] Apache Beam :: SDKs :: Java :: IO :: Elasticsearch-Tests SUCCESS
[  4.567 s]
2018-01-13T07:22:31.841 [INFO] Apache Beam :: SDKs :: Java :: IO :: Elasticsearch-Tests ::
Common SUCCESS [  5.548 s]
2018-01-13T07:22:31.841 [INFO] Apache Beam :: SDKs :: Java :: IO :: Elasticsearch-Tests ::
2.x SUCCESS [ 34.079 s]
2018-01-13T07:22:31.841 [INFO] Apache Beam :: SDKs :: Java :: IO :: Elasticsearch-Tests ::
5.x SUCCESS [ 54.196 s]
2018-01-13T07:22:31.841 [INFO] Apache Beam :: SDKs :: Java :: Extensions :: Google Cloud Platform
Core SUCCESS [ 38.244 s]
2018-01-13T07:22:31.841 [INFO] Apache Beam :: SDKs :: Java :: Extensions :: Protobuf SUCCESS
[ 28.179 s]
2018-01-13T07:22:31.841 [INFO] Apache Beam :: SDKs :: Java :: IO :: Google Cloud Platform
SUCCESS [02:14 min]
2018-01-13T07:22:31.841 [INFO] Apache Beam :: Runners :: Google Cloud Dataflow .... SUCCESS
[08:02 min]
2018-01-13T07:22:31.841 [INFO] Apache Beam :: SDKs :: Java :: IO :: File-based-io-tests SUCCESS
[  9.060 s]
2018-01-13T07:22:31.841 [INFO] Apache Beam :: SDKs :: Java :: IO :: Hadoop Common . SUCCESS
[ 24.873 s]
2018-01-13T07:22:31.841 [INFO] Apache Beam :: SDKs :: Java :: IO :: Hadoop File System SUCCESS
[ 56.347 s]
2018-01-13T07:22:31.841 [INFO] Apache Beam :: SDKs :: Java :: IO :: Hadoop ........ SUCCESS
[  7.386 s]
2018-01-13T07:22:31.841 [INFO] Apache Beam :: SDKs :: Java :: IO :: Hadoop :: input-format
SUCCESS [ 31.616 s]
2018-01-13T07:22:31.841 [INFO] Apache Beam :: SDKs :: Java :: IO :: Hadoop :: jdk1.8-tests
SUCCESS [01:31 min]
2018-01-13T07:22:31.841 [INFO] Apache Beam :: SDKs :: Java :: IO :: HBase ......... SUCCESS
[02:04 min]
2018-01-13T07:22:31.841 [INFO] Apache Beam :: SDKs :: Java :: IO :: HCatalog ...... SUCCESS
[01:15 min]
2018-01-13T07:22:31.841 [INFO] Apache Beam :: SDKs :: Java :: IO :: JDBC .......... SUCCESS
[ 58.165 s]
2018-01-13T07:22:31.841 [INFO] Apache Beam :: SDKs :: Java :: IO :: JMS ........... SUCCESS
[ 31.611 s]
2018-01-13T07:22:31.841 [INFO] Apache Beam :: SDKs :: Java :: IO :: Kafka ......... SUCCESS
[ 31.774 s]
2018-01-13T07:22:31.841 [INFO] Apache Beam :: SDKs :: Java :: IO :: Kinesis ....... SUCCESS
[ 33.030 s]
2018-01-13T07:22:31.841 [INFO] Apache Beam :: SDKs :: Java :: IO :: MongoDB ....... SUCCESS
[ 32.758 s]
2018-01-13T07:22:31.841 [INFO] Apache Beam :: SDKs :: Java :: IO :: MQTT .......... SUCCESS
[ 23.942 s]
2018-01-13T07:22:31.841 [INFO] Apache Beam :: SDKs :: Java :: IO :: Redis ......... SUCCESS
[ 16.671 s]
2018-01-13T07:22:31.841 [INFO] Apache Beam :: SDKs :: Java :: IO :: Solr .......... SUCCESS
[ 33.110 s]
2018-01-13T07:22:31.841 [INFO] Apache Beam :: SDKs :: Java :: IO :: Tika .......... SUCCESS
[ 48.707 s]
2018-01-13T07:22:31.842 [INFO] Apache Beam :: SDKs :: Java :: IO :: XML ........... SUCCESS
[ 42.442 s]
2018-01-13T07:22:31.842 [INFO] Apache Beam :: SDKs :: Java :: Maven Archetypes :: Starter
SUCCESS [ 19.766 s]
2018-01-13T07:22:31.842 [INFO] Apache Beam :: Examples :: Java .................... SUCCESS
[06:44 min]
2018-01-13T07:22:31.842 [INFO] Apache Beam :: SDKs :: Java :: Maven Archetypes :: Examples
SUCCESS [ 30.800 s]
2018-01-13T07:22:31.842 [INFO] Apache Beam :: Examples :: Java 8 .................. SUCCESS
[ 39.327 s]
2018-01-13T07:22:31.842 [INFO] Apache Beam :: SDKs :: Java :: Maven Archetypes :: Examples
- Java 8 SUCCESS [ 42.780 s]
2018-01-13T07:22:31.842 [INFO] Apache Beam :: SDKs :: Java :: Extensions :: Jackson SUCCESS
[ 18.232 s]
2018-01-13T07:22:31.842 [INFO] Apache Beam :: SDKs :: Java :: Extensions :: Join library SUCCESS
[ 29.775 s]
2018-01-13T07:22:31.842 [INFO] Apache Beam :: SDKs :: Java :: Extensions :: Sketching SUCCESS
[ 33.868 s]
2018-01-13T07:22:31.842 [INFO] Apache Beam :: SDKs :: Java :: Extensions :: Sorter  SUCCESS
[ 47.420 s]
2018-01-13T07:22:31.842 [INFO] Apache Beam :: SDKs :: Java :: Extensions :: SQL ... SUCCESS
[02:15 min]
2018-01-13T07:22:31.842 [INFO] Apache Beam :: SDKs :: Java :: Fn Execution ........ SUCCESS
[ 35.497 s]
2018-01-13T07:22:31.842 [INFO] Apache Beam :: SDKs :: Java :: Nexmark ............. SUCCESS
[01:54 min]
2018-01-13T07:22:31.842 [INFO] Apache Beam :: SDKs :: Java :: Harness ............. SUCCESS
[ 48.456 s]
2018-01-13T07:22:31.842 [INFO] Apache Beam :: SDKs :: Java :: Java 8 Tests ........ SUCCESS
[ 21.149 s]
2018-01-13T07:22:31.842 [INFO] Apache Beam :: Runners :: Java Fn Execution ........ FAILURE
[ 18.321 s]
2018-01-13T07:22:31.842 [INFO] Apache Beam :: Runners :: Java Local Artifact Service SKIPPED
2018-01-13T07:22:31.842 [INFO] Apache Beam :: Runners :: Reference :: Java ........ SUCCESS
[ 13.708 s]
2018-01-13T07:22:31.842 [INFO] Apache Beam :: Runners :: Reference :: Job Orchestrator SKIPPED
2018-01-13T07:22:31.842 [INFO] Apache Beam :: Runners :: Flink .................... FAILURE
[  8.792 s]
2018-01-13T07:22:31.842 [INFO] Apache Beam :: Runners :: Spark .................... SUCCESS
[02:14 min]
2018-01-13T07:22:31.842 [INFO] Apache Beam :: Runners :: Apex ..................... SUCCESS
[01:06 min]
2018-01-13T07:22:31.842 [INFO] Apache Beam :: Runners :: Gearpump ................. SUCCESS
[ 40.806 s]
2018-01-13T07:22:31.842 [INFO] Apache Beam :: SDKs :: Java :: Aggregated Javadoc .. SKIPPED
2018-01-13T07:22:31.842 [INFO] ------------------------------------------------------------------------
2018-01-13T07:22:31.842 [INFO] BUILD FAILURE
2018-01-13T07:22:31.842 [INFO] ------------------------------------------------------------------------
2018-01-13T07:22:31.842 [INFO] Total time: 01:06 h
2018-01-13T07:22:31.842 [INFO] Finished at: 2018-01-13T07:22:31+00:00
2018-01-13T07:22:32.464 [INFO] Final Memory: 401M/1660M
2018-01-13T07:22:32.465 [INFO] ------------------------------------------------------------------------
Waiting for Jenkins to finish collecting data
2018-01-13T07:22:38.115 [ERROR] Failed to execute goal org.apache.maven.plugins:maven-dependency-plugin:3.0.1:analyze-only
(default) on project beam-runners-java-fn-execution: Dependency problems found -> [Help
1]
2018-01-13T07:22:38.116 [ERROR] Failed to execute goal org.apache.maven.plugins:maven-checkstyle-plugin:2.17:check
(default) on project beam-runners-flink_2.11: You have 1 Checkstyle violation. -> [Help
2]
2018-01-13T07:22:38.116 [ERROR] 
2018-01-13T07:22:38.116 [ERROR] To see the full stack trace of the errors, re-run Maven with
the -e switch.
2018-01-13T07:22:38.116 [ERROR] Re-run Maven using the -X switch to enable full debug logging.
2018-01-13T07:22:38.116 [ERROR] 
2018-01-13T07:22:38.116 [ERROR] For more information about the errors and possible solutions,
please read the following articles:
2018-01-13T07:22:38.116 [ERROR] [Help 1] http://cwiki.apache.org/confluence/display/MAVEN/MojoExecutionException
2018-01-13T07:22:38.116 [ERROR] [Help 2] http://cwiki.apache.org/confluence/display/MAVEN/MojoFailureException
2018-01-13T07:22:38.116 [ERROR] 
2018-01-13T07:22:38.116 [ERROR] After correcting the problems, you can resume the build with
the command
2018-01-13T07:22:38.116 [ERROR]   mvn <goals> -rf :beam-runners-java-fn-execution
channel stopped
Not sending mail to unregistered user sidhom@google.com
Not sending mail to unregistered user swegner@google.com
Not sending mail to unregistered user arostami@google.com
Not sending mail to unregistered user github@alasdairhodge.co.uk
Not sending mail to unregistered user ankurgoenka@gmail.com
Not sending mail to unregistered user ehudm@google.com
Not sending mail to unregistered user batbat@batbat-linuxworkstation.sea.corp.google.com
Not sending mail to unregistered user dariusz.aniszewski@polidea.com
Not sending mail to unregistered user jb@nanthrax.net

Mime
View raw message