beam-commits mailing list archives

Site index · List index
Message view « Date » · « Thread »
Top « Date » · « Thread »
From Apache Jenkins Server <jenk...@builds.apache.org>
Subject Build failed in Jenkins: beam_PostCommit_Java_MavenInstall #5641
Date Sat, 13 Jan 2018 06:27:30 GMT
See <https://builds.apache.org/job/beam_PostCommit_Java_MavenInstall/5641/display/redirect?page=changes>

Changes:

[github] [BEAM-3436] Fix RetryHttpRequestInitializerTest to use fake

------------------------------------------
[...truncated 1.34 MB...]
2018-01-13T06:25:26.330 [INFO] Excluding com.typesafe.akka:akka-agent_2.11:jar:2.4.16 from
the shaded jar.
2018-01-13T06:25:26.330 [INFO] Excluding org.scala-stm:scala-stm_2.11:jar:0.8 from the shaded
jar.
2018-01-13T06:25:26.331 [INFO] Excluding com.typesafe.akka:akka-slf4j_2.11:jar:2.4.16 from
the shaded jar.
2018-01-13T06:25:26.331 [INFO] Excluding com.typesafe.akka:akka-kernel_2.11:jar:2.4.16 from
the shaded jar.
2018-01-13T06:25:26.331 [INFO] Excluding com.typesafe.akka:akka-http_2.11:jar:10.0.1 from
the shaded jar.
2018-01-13T06:25:26.331 [INFO] Excluding com.typesafe.akka:akka-http-core_2.11:jar:10.0.1
from the shaded jar.
2018-01-13T06:25:26.331 [INFO] Excluding com.typesafe.akka:akka-parsing_2.11:jar:10.0.1 from
the shaded jar.
2018-01-13T06:25:26.331 [INFO] Excluding com.typesafe.akka:akka-http-spray-json_2.11:jar:10.0.1
from the shaded jar.
2018-01-13T06:25:26.331 [INFO] Excluding io.spray:spray-json_2.11:jar:1.3.2 from the shaded
jar.
2018-01-13T06:25:26.332 [INFO] Excluding org.scala-lang:scala-reflect:jar:2.11.8 from the
shaded jar.
2018-01-13T06:25:26.332 [INFO] Excluding org.apache.beam:beam-sdks-java-core:jar:2.3.0-SNAPSHOT
from the shaded jar.
2018-01-13T06:25:26.332 [INFO] Excluding com.google.protobuf:protobuf-java:jar:3.2.0 from
the shaded jar.
2018-01-13T06:25:26.332 [INFO] Excluding com.github.stephenc.findbugs:findbugs-annotations:jar:1.3.9-1
from the shaded jar.
2018-01-13T06:25:26.332 [INFO] Excluding com.fasterxml.jackson.core:jackson-core:jar:2.8.9
from the shaded jar.
2018-01-13T06:25:26.332 [INFO] Excluding net.bytebuddy:byte-buddy:jar:1.6.8 from the shaded
jar.
2018-01-13T06:25:26.332 [INFO] Excluding org.apache.avro:avro:jar:1.8.2 from the shaded jar.
2018-01-13T06:25:26.332 [INFO] Excluding org.codehaus.jackson:jackson-core-asl:jar:1.9.13
from the shaded jar.
2018-01-13T06:25:26.332 [INFO] Excluding org.codehaus.jackson:jackson-mapper-asl:jar:1.9.13
from the shaded jar.
2018-01-13T06:25:26.332 [INFO] Excluding com.thoughtworks.paranamer:paranamer:jar:2.7 from
the shaded jar.
2018-01-13T06:25:26.332 [INFO] Excluding org.tukaani:xz:jar:1.5 from the shaded jar.
2018-01-13T06:25:26.332 [INFO] Excluding org.xerial.snappy:snappy-java:jar:1.1.4 from the
shaded jar.
2018-01-13T06:25:26.332 [INFO] Excluding org.apache.commons:commons-compress:jar:1.14 from
the shaded jar.
2018-01-13T06:25:26.332 [INFO] Excluding org.apache.commons:commons-lang3:jar:3.6 from the
shaded jar.
2018-01-13T06:25:26.332 [INFO] Excluding org.apache.beam:beam-runners-core-java:jar:2.3.0-SNAPSHOT
from the shaded jar.
2018-01-13T06:25:26.332 [INFO] Excluding org.apache.beam:beam-model-pipeline:jar:2.3.0-SNAPSHOT
from the shaded jar.
2018-01-13T06:25:26.332 [INFO] Excluding org.apache.beam:beam-runners-core-construction-java:jar:2.3.0-SNAPSHOT
from the shaded jar.
2018-01-13T06:25:26.332 [INFO] Excluding org.apache.beam:beam-model-job-management:jar:2.3.0-SNAPSHOT
from the shaded jar.
2018-01-13T06:25:26.332 [INFO] Excluding io.grpc:grpc-protobuf:jar:1.2.0 from the shaded jar.
2018-01-13T06:25:26.332 [INFO] Excluding io.grpc:grpc-protobuf-lite:jar:1.2.0 from the shaded
jar.
2018-01-13T06:25:26.332 [INFO] Excluding com.google.protobuf:protobuf-java-util:jar:3.2.0
from the shaded jar.
2018-01-13T06:25:26.332 [INFO] Excluding com.google.code.gson:gson:jar:2.7 from the shaded
jar.
2018-01-13T06:25:26.332 [INFO] Excluding io.grpc:grpc-core:jar:1.2.0 from the shaded jar.
2018-01-13T06:25:26.332 [INFO] Excluding com.google.errorprone:error_prone_annotations:jar:2.0.15
from the shaded jar.
2018-01-13T06:25:26.332 [INFO] Excluding io.grpc:grpc-context:jar:1.2.0 from the shaded jar.
2018-01-13T06:25:26.332 [INFO] Excluding com.google.instrumentation:instrumentation-api:jar:0.3.0
from the shaded jar.
2018-01-13T06:25:26.332 [INFO] Excluding io.grpc:grpc-stub:jar:1.2.0 from the shaded jar.
2018-01-13T06:25:26.332 [INFO] Excluding joda-time:joda-time:jar:2.4 from the shaded jar.
2018-01-13T06:25:26.332 [INFO] Excluding com.fasterxml.jackson.core:jackson-annotations:jar:2.8.9
from the shaded jar.
2018-01-13T06:25:26.332 [INFO] Including com.google.guava:guava:jar:20.0 in the shaded jar.
2018-01-13T06:25:26.332 [INFO] Excluding com.google.code.findbugs:jsr305:jar:3.0.1 from the
shaded jar.
2018-01-13T06:25:26.332 [INFO] Excluding com.google.auto.service:auto-service:jar:1.0-rc2
from the shaded jar.
2018-01-13T06:25:26.332 [INFO] Excluding com.google.auto:auto-common:jar:0.3 from the shaded
jar.
2018-01-13T06:25:28.792 [INFO] Replacing original artifact with shaded artifact.
2018-01-13T06:25:28.792 [INFO] Replacing <https://builds.apache.org/job/beam_PostCommit_Java_MavenInstall/ws/src/runners/gearpump/target/beam-runners-gearpump-2.3.0-SNAPSHOT.jar>
with <https://builds.apache.org/job/beam_PostCommit_Java_MavenInstall/ws/src/runners/gearpump/target/beam-runners-gearpump-2.3.0-SNAPSHOT-shaded.jar>
2018-01-13T06:25:28.792 [INFO] Replacing original test artifact with shaded test artifact.
2018-01-13T06:25:28.792 [INFO] Replacing <https://builds.apache.org/job/beam_PostCommit_Java_MavenInstall/ws/src/runners/gearpump/target/beam-runners-gearpump-2.3.0-SNAPSHOT-tests.jar>
with <https://builds.apache.org/job/beam_PostCommit_Java_MavenInstall/ws/src/runners/gearpump/target/beam-runners-gearpump-2.3.0-SNAPSHOT-shaded-tests.jar>
2018-01-13T06:25:28.792 [INFO] Dependency-reduced POM written at: <https://builds.apache.org/job/beam_PostCommit_Java_MavenInstall/ws/src/runners/gearpump/dependency-reduced-pom.xml>
2018-01-13T06:25:28.999 [INFO] 
2018-01-13T06:25:28.999 [INFO] --- maven-javadoc-plugin:3.0.0-M1:jar (attach-javadocs) @ beam-runners-gearpump
---
2018-01-13T06:25:32.666 [INFO] Building jar: <https://builds.apache.org/job/beam_PostCommit_Java_MavenInstall/ws/src/runners/gearpump/target/beam-runners-gearpump-2.3.0-SNAPSHOT-javadoc.jar>
2018-01-13T06:25:32.875 [INFO] 
2018-01-13T06:25:32.875 [INFO] --- maven-source-plugin:3.0.1:jar-no-fork (attach-sources)
@ beam-runners-gearpump ---
2018-01-13T06:25:32.879 [INFO] Building jar: <https://builds.apache.org/job/beam_PostCommit_Java_MavenInstall/ws/src/runners/gearpump/target/beam-runners-gearpump-2.3.0-SNAPSHOT-sources.jar>
2018-01-13T06:25:33.080 [INFO] 
2018-01-13T06:25:33.080 [INFO] --- maven-source-plugin:3.0.1:test-jar-no-fork (attach-test-sources)
@ beam-runners-gearpump ---
2018-01-13T06:25:33.083 [INFO] Building jar: <https://builds.apache.org/job/beam_PostCommit_Java_MavenInstall/ws/src/runners/gearpump/target/beam-runners-gearpump-2.3.0-SNAPSHOT-test-sources.jar>
2018-01-13T06:25:33.201 [INFO] 
2018-01-13T06:25:33.201 [INFO] --- reproducible-build-maven-plugin:0.4:strip-jar (default)
@ beam-runners-gearpump ---
2018-01-13T06:25:33.202 [INFO] Stripping <https://builds.apache.org/job/beam_PostCommit_Java_MavenInstall/ws/src/runners/gearpump/target/beam-runners-gearpump-2.3.0-SNAPSHOT-sources.jar>
2018-01-13T06:25:33.206 [INFO] Stripping <https://builds.apache.org/job/beam_PostCommit_Java_MavenInstall/ws/src/runners/gearpump/target/beam-runners-gearpump-2.3.0-SNAPSHOT-test-sources.jar>
2018-01-13T06:25:33.229 [INFO] Stripping <https://builds.apache.org/job/beam_PostCommit_Java_MavenInstall/ws/src/runners/gearpump/target/beam-runners-gearpump-2.3.0-SNAPSHOT-tests.jar>
2018-01-13T06:25:33.233 [INFO] Stripping <https://builds.apache.org/job/beam_PostCommit_Java_MavenInstall/ws/src/runners/gearpump/target/beam-runners-gearpump-2.3.0-SNAPSHOT.jar>
2018-01-13T06:25:33.359 [INFO] Stripping <https://builds.apache.org/job/beam_PostCommit_Java_MavenInstall/ws/src/runners/gearpump/target/original-beam-runners-gearpump-2.3.0-SNAPSHOT.jar>
2018-01-13T06:25:33.364 [INFO] Stripping <https://builds.apache.org/job/beam_PostCommit_Java_MavenInstall/ws/src/runners/gearpump/target/beam-runners-gearpump-2.3.0-SNAPSHOT-javadoc.jar>
2018-01-13T06:25:33.369 [INFO] Stripping <https://builds.apache.org/job/beam_PostCommit_Java_MavenInstall/ws/src/runners/gearpump/target/original-beam-runners-gearpump-2.3.0-SNAPSHOT-tests.jar>
2018-01-13T06:25:33.479 [INFO] 
2018-01-13T06:25:33.479 [INFO] --- maven-dependency-plugin:3.0.1:analyze-only (default) @
beam-runners-gearpump ---
2018-01-13T06:25:33.684 [INFO] No dependency problems found
2018-01-13T06:25:33.791 [INFO] 
2018-01-13T06:25:33.791 [INFO] --- maven-install-plugin:2.5.2:install (default-install) @
beam-runners-gearpump ---
2018-01-13T06:25:33.792 [INFO] Installing <https://builds.apache.org/job/beam_PostCommit_Java_MavenInstall/ws/src/runners/gearpump/target/beam-runners-gearpump-2.3.0-SNAPSHOT.jar>
to <https://builds.apache.org/job/beam_PostCommit_Java_MavenInstall/ws/.repository/org/apache/beam/beam-runners-gearpump/2.3.0-SNAPSHOT/beam-runners-gearpump-2.3.0-SNAPSHOT.jar>
2018-01-13T06:25:33.859 [INFO] Installing <https://builds.apache.org/job/beam_PostCommit_Java_MavenInstall/ws/src/runners/gearpump/dependency-reduced-pom.xml>
to <https://builds.apache.org/job/beam_PostCommit_Java_MavenInstall/ws/.repository/org/apache/beam/beam-runners-gearpump/2.3.0-SNAPSHOT/beam-runners-gearpump-2.3.0-SNAPSHOT.pom>
2018-01-13T06:25:33.920 [INFO] Installing <https://builds.apache.org/job/beam_PostCommit_Java_MavenInstall/ws/src/runners/gearpump/target/beam-runners-gearpump-2.3.0-SNAPSHOT-tests.jar>
to <https://builds.apache.org/job/beam_PostCommit_Java_MavenInstall/ws/.repository/org/apache/beam/beam-runners-gearpump/2.3.0-SNAPSHOT/beam-runners-gearpump-2.3.0-SNAPSHOT-tests.jar>
2018-01-13T06:25:33.922 [INFO] Installing <https://builds.apache.org/job/beam_PostCommit_Java_MavenInstall/ws/src/runners/gearpump/target/beam-runners-gearpump-2.3.0-SNAPSHOT-tests.jar>
to <https://builds.apache.org/job/beam_PostCommit_Java_MavenInstall/ws/.repository/org/apache/beam/beam-runners-gearpump/2.3.0-SNAPSHOT/beam-runners-gearpump-2.3.0-SNAPSHOT-tests.jar>
2018-01-13T06:25:33.924 [INFO] Installing <https://builds.apache.org/job/beam_PostCommit_Java_MavenInstall/ws/src/runners/gearpump/target/beam-runners-gearpump-2.3.0-SNAPSHOT-javadoc.jar>
to <https://builds.apache.org/job/beam_PostCommit_Java_MavenInstall/ws/.repository/org/apache/beam/beam-runners-gearpump/2.3.0-SNAPSHOT/beam-runners-gearpump-2.3.0-SNAPSHOT-javadoc.jar>
2018-01-13T06:25:33.925 [INFO] Installing <https://builds.apache.org/job/beam_PostCommit_Java_MavenInstall/ws/src/runners/gearpump/target/beam-runners-gearpump-2.3.0-SNAPSHOT-sources.jar>
to <https://builds.apache.org/job/beam_PostCommit_Java_MavenInstall/ws/.repository/org/apache/beam/beam-runners-gearpump/2.3.0-SNAPSHOT/beam-runners-gearpump-2.3.0-SNAPSHOT-sources.jar>
2018-01-13T06:25:33.927 [INFO] Installing <https://builds.apache.org/job/beam_PostCommit_Java_MavenInstall/ws/src/runners/gearpump/target/beam-runners-gearpump-2.3.0-SNAPSHOT-test-sources.jar>
to <https://builds.apache.org/job/beam_PostCommit_Java_MavenInstall/ws/.repository/org/apache/beam/beam-runners-gearpump/2.3.0-SNAPSHOT/beam-runners-gearpump-2.3.0-SNAPSHOT-test-sources.jar>
[JENKINS] Archiving disabled
2018-01-13T06:25:35.470 [INFO]                                                           
             
2018-01-13T06:25:35.470 [INFO] ------------------------------------------------------------------------
2018-01-13T06:25:35.470 [INFO] Skipping Apache Beam :: SDKs :: Java :: Aggregated Javadoc
2018-01-13T06:25:35.470 [INFO] This project has been banned from the build due to previous
failures.
2018-01-13T06:25:35.470 [INFO] ------------------------------------------------------------------------
[JENKINS] Archiving disabled
[JENKINS] Archiving disabled
[JENKINS] Archiving disabled
[JENKINS] Archiving disabled
[JENKINS] Archiving disabled
[JENKINS] Archiving disabled
[JENKINS] Archiving disabled
[JENKINS] Archiving disabled
[JENKINS] Archiving disabled
[JENKINS] Archiving disabled
[JENKINS] Archiving disabled
[JENKINS] Archiving disabled
[JENKINS] Archiving disabled
[JENKINS] Archiving disabled
[JENKINS] Archiving disabled
[JENKINS] Archiving disabled
[JENKINS] Archiving disabled
[JENKINS] Archiving disabled
[JENKINS] Archiving disabled
[JENKINS] Archiving disabled
[JENKINS] Archiving disabled
[JENKINS] Archiving disabled
[JENKINS] Archiving disabled
[JENKINS] Archiving disabled
[JENKINS] Archiving disabled
[JENKINS] Archiving disabled
[JENKINS] Archiving disabled
[JENKINS] Archiving disabled
[JENKINS] Archiving disabled
[JENKINS] Archiving disabled
[JENKINS] Archiving disabled
[JENKINS] Archiving disabled
[JENKINS] Archiving disabled
[JENKINS] Archiving disabled
[JENKINS] Archiving disabled
[JENKINS] Archiving disabled
[JENKINS] Archiving disabled
[JENKINS] Archiving disabled
[JENKINS] Archiving disabled
[JENKINS] Archiving disabled
[JENKINS] Archiving disabled
[JENKINS] Archiving disabled
[JENKINS] Archiving disabled
[JENKINS] Archiving disabled
[JENKINS] Archiving disabled
[JENKINS] Archiving disabled
[JENKINS] Archiving disabled
[JENKINS] Archiving disabled
[JENKINS] Archiving disabled
[JENKINS] Archiving disabled
[JENKINS] Archiving disabled
[JENKINS] Archiving disabled
[JENKINS] Archiving disabled
[JENKINS] Archiving disabled
[JENKINS] Archiving disabled
[JENKINS] Archiving disabled
[JENKINS] Archiving disabled
[JENKINS] Archiving disabled
[JENKINS] Archiving disabled
[JENKINS] Archiving disabled
[JENKINS] Archiving disabled
[JENKINS] Archiving disabled
[JENKINS] Archiving disabled
[JENKINS] Archiving disabled
[JENKINS] Archiving disabled
[JENKINS] Archiving disabled
[JENKINS] Archiving disabled
2018-01-13T06:26:42.142 [INFO] ------------------------------------------------------------------------
2018-01-13T06:26:42.142 [INFO] Reactor Summary:
2018-01-13T06:26:42.142 [INFO] 
2018-01-13T06:26:42.142 [INFO] Apache Beam :: Parent .............................. SUCCESS
[ 17.504 s]
2018-01-13T06:26:42.142 [INFO] Apache Beam :: SDKs :: Java :: Build Tools ......... SUCCESS
[ 10.251 s]
2018-01-13T06:26:42.142 [INFO] Apache Beam :: Model ............................... SUCCESS
[  2.400 s]
2018-01-13T06:26:42.142 [INFO] Apache Beam :: Model :: Pipeline ................... SUCCESS
[ 33.131 s]
2018-01-13T06:26:42.142 [INFO] Apache Beam :: Model :: Job Management ............. SUCCESS
[ 18.126 s]
2018-01-13T06:26:42.142 [INFO] Apache Beam :: Model :: Fn Execution ............... SUCCESS
[ 25.045 s]
2018-01-13T06:26:42.142 [INFO] Apache Beam :: SDKs ................................ SUCCESS
[  3.934 s]
2018-01-13T06:26:42.142 [INFO] Apache Beam :: SDKs :: Java ........................ SUCCESS
[  3.280 s]
2018-01-13T06:26:42.142 [INFO] Apache Beam :: SDKs :: Java :: Core ................ SUCCESS
[03:41 min]
2018-01-13T06:26:42.142 [INFO] Apache Beam :: Runners ............................. SUCCESS
[  3.623 s]
2018-01-13T06:26:42.142 [INFO] Apache Beam :: Runners :: Local Java Core .......... SUCCESS
[ 17.438 s]
2018-01-13T06:26:42.142 [INFO] Apache Beam :: Runners :: Core Construction Java ... SUCCESS
[ 47.324 s]
2018-01-13T06:26:42.142 [INFO] Apache Beam :: Runners :: Core Java ................ SUCCESS
[01:00 min]
2018-01-13T06:26:42.142 [INFO] Apache Beam :: Runners :: Direct Java .............. SUCCESS
[07:02 min]
2018-01-13T06:26:42.142 [INFO] Apache Beam :: SDKs :: Java :: IO :: AMQP .......... SUCCESS
[ 44.281 s]
2018-01-13T06:26:42.142 [INFO] Apache Beam :: SDKs :: Java :: IO :: Common ........ SUCCESS
[  8.130 s]
2018-01-13T06:26:42.142 [INFO] Apache Beam :: SDKs :: Java :: IO :: Cassandra ..... SUCCESS
[ 41.926 s]
2018-01-13T06:26:42.142 [INFO] Apache Beam :: SDKs :: Java :: IO :: Elasticsearch . SUCCESS
[ 23.502 s]
2018-01-13T06:26:42.142 [INFO] Apache Beam :: SDKs :: Java :: IO :: Elasticsearch-Tests SUCCESS
[  4.533 s]
2018-01-13T06:26:42.142 [INFO] Apache Beam :: SDKs :: Java :: IO :: Elasticsearch-Tests ::
Common SUCCESS [  5.550 s]
2018-01-13T06:26:42.142 [INFO] Apache Beam :: SDKs :: Java :: IO :: Elasticsearch-Tests ::
2.x SUCCESS [ 32.238 s]
2018-01-13T06:26:42.142 [INFO] Apache Beam :: SDKs :: Java :: IO :: Elasticsearch-Tests ::
5.x SUCCESS [ 44.477 s]
2018-01-13T06:26:42.142 [INFO] Apache Beam :: SDKs :: Java :: Extensions :: Google Cloud Platform
Core SUCCESS [ 42.256 s]
2018-01-13T06:26:42.142 [INFO] Apache Beam :: SDKs :: Java :: Extensions :: Protobuf SUCCESS
[ 27.145 s]
2018-01-13T06:26:42.142 [INFO] Apache Beam :: SDKs :: Java :: IO :: Google Cloud Platform
SUCCESS [02:17 min]
2018-01-13T06:26:42.142 [INFO] Apache Beam :: Runners :: Google Cloud Dataflow .... SUCCESS
[08:28 min]
2018-01-13T06:26:42.142 [INFO] Apache Beam :: SDKs :: Java :: IO :: File-based-io-tests SUCCESS
[  9.716 s]
2018-01-13T06:26:42.142 [INFO] Apache Beam :: SDKs :: Java :: IO :: Hadoop Common . SUCCESS
[ 54.877 s]
2018-01-13T06:26:42.142 [INFO] Apache Beam :: SDKs :: Java :: IO :: Hadoop File System SUCCESS
[ 59.369 s]
2018-01-13T06:26:42.142 [INFO] Apache Beam :: SDKs :: Java :: IO :: Hadoop ........ SUCCESS
[  6.474 s]
2018-01-13T06:26:42.142 [INFO] Apache Beam :: SDKs :: Java :: IO :: Hadoop :: input-format
SUCCESS [ 34.112 s]
2018-01-13T06:26:42.143 [INFO] Apache Beam :: SDKs :: Java :: IO :: Hadoop :: jdk1.8-tests
SUCCESS [01:34 min]
2018-01-13T06:26:42.143 [INFO] Apache Beam :: SDKs :: Java :: IO :: HBase ......... SUCCESS
[01:54 min]
2018-01-13T06:26:42.143 [INFO] Apache Beam :: SDKs :: Java :: IO :: HCatalog ...... SUCCESS
[01:23 min]
2018-01-13T06:26:42.143 [INFO] Apache Beam :: SDKs :: Java :: IO :: JDBC .......... SUCCESS
[01:02 min]
2018-01-13T06:26:42.143 [INFO] Apache Beam :: SDKs :: Java :: IO :: JMS ........... SUCCESS
[ 32.633 s]
2018-01-13T06:26:42.143 [INFO] Apache Beam :: SDKs :: Java :: IO :: Kafka ......... SUCCESS
[ 56.334 s]
2018-01-13T06:26:42.143 [INFO] Apache Beam :: SDKs :: Java :: IO :: Kinesis ....... SUCCESS
[ 56.537 s]
2018-01-13T06:26:42.143 [INFO] Apache Beam :: SDKs :: Java :: IO :: MongoDB ....... SUCCESS
[01:02 min]
2018-01-13T06:26:42.143 [INFO] Apache Beam :: SDKs :: Java :: IO :: MQTT .......... SUCCESS
[ 36.315 s]
2018-01-13T06:26:42.143 [INFO] Apache Beam :: SDKs :: Java :: IO :: Redis ......... SUCCESS
[ 30.539 s]
2018-01-13T06:26:42.143 [INFO] Apache Beam :: SDKs :: Java :: IO :: Solr .......... SUCCESS
[ 59.038 s]
2018-01-13T06:26:42.143 [INFO] Apache Beam :: SDKs :: Java :: IO :: Tika .......... SUCCESS
[ 38.044 s]
2018-01-13T06:26:42.143 [INFO] Apache Beam :: SDKs :: Java :: IO :: XML ........... SUCCESS
[01:16 min]
2018-01-13T06:26:42.143 [INFO] Apache Beam :: SDKs :: Java :: Maven Archetypes :: Starter
SUCCESS [ 30.943 s]
2018-01-13T06:26:42.143 [INFO] Apache Beam :: Examples :: Java .................... SUCCESS
[06:01 min]
2018-01-13T06:26:42.143 [INFO] Apache Beam :: SDKs :: Java :: Maven Archetypes :: Examples
SUCCESS [ 40.548 s]
2018-01-13T06:26:42.143 [INFO] Apache Beam :: Examples :: Java 8 .................. SUCCESS
[ 57.776 s]
2018-01-13T06:26:42.143 [INFO] Apache Beam :: SDKs :: Java :: Maven Archetypes :: Examples
- Java 8 SUCCESS [ 38.020 s]
2018-01-13T06:26:42.143 [INFO] Apache Beam :: SDKs :: Java :: Extensions :: Jackson SUCCESS
[ 23.927 s]
2018-01-13T06:26:42.143 [INFO] Apache Beam :: SDKs :: Java :: Extensions :: Join library SUCCESS
[ 27.019 s]
2018-01-13T06:26:42.143 [INFO] Apache Beam :: SDKs :: Java :: Extensions :: Sketching SUCCESS
[ 30.700 s]
2018-01-13T06:26:42.143 [INFO] Apache Beam :: SDKs :: Java :: Extensions :: Sorter  SUCCESS
[ 45.078 s]
2018-01-13T06:26:42.143 [INFO] Apache Beam :: SDKs :: Java :: Extensions :: SQL ... SUCCESS
[02:21 min]
2018-01-13T06:26:42.143 [INFO] Apache Beam :: SDKs :: Java :: Fn Execution ........ SUCCESS
[ 38.309 s]
2018-01-13T06:26:42.143 [INFO] Apache Beam :: SDKs :: Java :: Nexmark ............. SUCCESS
[02:37 min]
2018-01-13T06:26:42.143 [INFO] Apache Beam :: SDKs :: Java :: Harness ............. SUCCESS
[ 49.738 s]
2018-01-13T06:26:42.143 [INFO] Apache Beam :: SDKs :: Java :: Java 8 Tests ........ SUCCESS
[ 25.082 s]
2018-01-13T06:26:42.143 [INFO] Apache Beam :: Runners :: Java Fn Execution ........ FAILURE
[ 24.882 s]
2018-01-13T06:26:42.143 [INFO] Apache Beam :: Runners :: Java Local Artifact Service SKIPPED
2018-01-13T06:26:42.143 [INFO] Apache Beam :: Runners :: Reference :: Java ........ SUCCESS
[ 14.465 s]
2018-01-13T06:26:42.143 [INFO] Apache Beam :: Runners :: Reference :: Job Orchestrator SKIPPED
2018-01-13T06:26:42.143 [INFO] Apache Beam :: Runners :: Flink .................... FAILURE
[ 12.557 s]
2018-01-13T06:26:42.143 [INFO] Apache Beam :: Runners :: Spark .................... SUCCESS
[02:42 min]
2018-01-13T06:26:42.143 [INFO] Apache Beam :: Runners :: Apex ..................... SUCCESS
[01:23 min]
2018-01-13T06:26:42.143 [INFO] Apache Beam :: Runners :: Gearpump ................. SUCCESS
[ 38.722 s]
2018-01-13T06:26:42.143 [INFO] Apache Beam :: SDKs :: Java :: Aggregated Javadoc .. SKIPPED
2018-01-13T06:26:42.143 [INFO] ------------------------------------------------------------------------
2018-01-13T06:26:42.143 [INFO] BUILD FAILURE
2018-01-13T06:26:42.143 [INFO] ------------------------------------------------------------------------
2018-01-13T06:26:42.143 [INFO] Total time: 01:12 h
2018-01-13T06:26:42.144 [INFO] Finished at: 2018-01-13T06:26:42+00:00
2018-01-13T06:26:44.165 [INFO] Final Memory: 389M/1922M
2018-01-13T06:26:44.165 [INFO] ------------------------------------------------------------------------
2018-01-13T06:26:44.193 [ERROR] Failed to execute goal org.apache.maven.plugins:maven-dependency-plugin:3.0.1:analyze-only
(default) on project beam-runners-java-fn-execution: Dependency problems found -> [Help
1]
2018-01-13T06:26:44.193 [ERROR] Failed to execute goal org.apache.maven.plugins:maven-checkstyle-plugin:2.17:check
(default) on project beam-runners-flink_2.11: You have 1 Checkstyle violation. -> [Help
2]
2018-01-13T06:26:44.193 [ERROR] 
2018-01-13T06:26:44.193 [ERROR] To see the full stack trace of the errors, re-run Maven with
the -e switch.
2018-01-13T06:26:44.193 [ERROR] Re-run Maven using the -X switch to enable full debug logging.
2018-01-13T06:26:44.193 [ERROR] 
2018-01-13T06:26:44.193 [ERROR] For more information about the errors and possible solutions,
please read the following articles:
2018-01-13T06:26:44.193 [ERROR] [Help 1] http://cwiki.apache.org/confluence/display/MAVEN/MojoExecutionException
2018-01-13T06:26:44.193 [ERROR] [Help 2] http://cwiki.apache.org/confluence/display/MAVEN/MojoFailureException
2018-01-13T06:26:44.194 [ERROR] 
2018-01-13T06:26:44.194 [ERROR] After correcting the problems, you can resume the build with
the command
2018-01-13T06:26:44.194 [ERROR]   mvn <goals> -rf :beam-runners-java-fn-execution
channel stopped
Not sending mail to unregistered user sidhom@google.com
Not sending mail to unregistered user swegner@google.com
Not sending mail to unregistered user arostami@google.com
Not sending mail to unregistered user github@alasdairhodge.co.uk
Not sending mail to unregistered user ankurgoenka@gmail.com
Not sending mail to unregistered user ehudm@google.com
Not sending mail to unregistered user batbat@batbat-linuxworkstation.sea.corp.google.com
Not sending mail to unregistered user dariusz.aniszewski@polidea.com
Not sending mail to unregistered user jb@nanthrax.net

Mime
View raw message