beam-commits mailing list archives

Site index · List index
Message view « Date » · « Thread »
Top « Date » · « Thread »
From Apache Jenkins Server <jenk...@builds.apache.org>
Subject Build failed in Jenkins: beam_PostCommit_Java_MavenInstall #5769
Date Fri, 26 Jan 2018 19:46:44 GMT
See <https://builds.apache.org/job/beam_PostCommit_Java_MavenInstall/5769/display/redirect?page=changes>

Changes:

[zoy] Increasing BatchElements's max_batch_size to 10K

[XuMingmin] [BEAM-3526] KakfaIO support for finalizeCheckpoint() (#4481)

------------------------------------------
[...truncated 2.14 MB...]
2018-01-26T19:44:48.632 [INFO] Excluding commons-lang:commons-lang:jar:2.6 from the shaded
jar.
2018-01-26T19:44:48.632 [INFO] Excluding commons-cli:commons-cli:jar:1.2 from the shaded jar.
2018-01-26T19:44:48.632 [INFO] Excluding log4j:log4j:jar:1.2.17 from the shaded jar.
2018-01-26T19:44:48.632 [INFO] Excluding org.apache.hadoop:hadoop-annotations:jar:2.6.0 from
the shaded jar.
2018-01-26T19:44:48.632 [INFO] Excluding org.apache.hadoop:hadoop-yarn-api:jar:2.6.0 from
the shaded jar.
2018-01-26T19:44:48.632 [INFO] Excluding org.apache.hadoop:hadoop-yarn-common:jar:2.6.0 from
the shaded jar.
2018-01-26T19:44:48.632 [INFO] Excluding javax.xml.bind:jaxb-api:jar:2.2.2 from the shaded
jar.
2018-01-26T19:44:48.632 [INFO] Excluding javax.xml.stream:stax-api:jar:1.0-2 from the shaded
jar.
2018-01-26T19:44:48.632 [INFO] Excluding com.google.inject.extensions:guice-servlet:jar:3.0
from the shaded jar.
2018-01-26T19:44:48.632 [INFO] Excluding com.google.inject:guice:jar:3.0 from the shaded jar.
2018-01-26T19:44:48.632 [INFO] Excluding javax.inject:javax.inject:jar:1 from the shaded jar.
2018-01-26T19:44:48.632 [INFO] Excluding aopalliance:aopalliance:jar:1.0 from the shaded jar.
2018-01-26T19:44:48.632 [INFO] Excluding com.sun.jersey:jersey-server:jar:1.9 from the shaded
jar.
2018-01-26T19:44:48.632 [INFO] Excluding asm:asm:jar:3.1 from the shaded jar.
2018-01-26T19:44:48.632 [INFO] Excluding com.sun.jersey.contribs:jersey-guice:jar:1.9 from
the shaded jar.
2018-01-26T19:44:48.632 [INFO] Excluding jline:jline:jar:2.11 from the shaded jar.
2018-01-26T19:44:48.632 [INFO] Excluding org.apache.ant:ant:jar:1.9.2 from the shaded jar.
2018-01-26T19:44:48.632 [INFO] Excluding org.apache.ant:ant-launcher:jar:1.9.2 from the shaded
jar.
2018-01-26T19:44:48.632 [INFO] Excluding net.engio:mbassador:jar:1.1.9 from the shaded jar.
2018-01-26T19:44:48.632 [INFO] Excluding net.lingala.zip4j:zip4j:jar:1.3.2 from the shaded
jar.
2018-01-26T19:44:48.632 [INFO] Excluding commons-codec:commons-codec:jar:1.10 from the shaded
jar.
2018-01-26T19:44:48.632 [INFO] Excluding org.apache.xbean:xbean-asm5-shaded:jar:4.3 from the
shaded jar.
2018-01-26T19:44:48.632 [INFO] Excluding org.jctools:jctools-core:jar:1.1 from the shaded
jar.
2018-01-26T19:44:48.632 [INFO] Excluding org.apache.beam:beam-model-pipeline:jar:2.3.0-SNAPSHOT
from the shaded jar.
2018-01-26T19:44:48.632 [INFO] Excluding com.google.protobuf:protobuf-java:jar:3.2.0 from
the shaded jar.
2018-01-26T19:44:48.632 [INFO] Excluding org.apache.beam:beam-sdks-java-core:jar:2.3.0-SNAPSHOT
from the shaded jar.
2018-01-26T19:44:48.632 [INFO] Including com.google.guava:guava:jar:20.0 in the shaded jar.
2018-01-26T19:44:48.632 [INFO] Excluding com.github.stephenc.findbugs:findbugs-annotations:jar:1.3.9-1
from the shaded jar.
2018-01-26T19:44:48.632 [INFO] Excluding com.fasterxml.jackson.core:jackson-core:jar:2.8.9
from the shaded jar.
2018-01-26T19:44:48.632 [INFO] Excluding com.fasterxml.jackson.core:jackson-annotations:jar:2.8.9
from the shaded jar.
2018-01-26T19:44:48.632 [INFO] Excluding com.fasterxml.jackson.core:jackson-databind:jar:2.8.9
from the shaded jar.
2018-01-26T19:44:48.632 [INFO] Excluding net.bytebuddy:byte-buddy:jar:1.6.8 from the shaded
jar.
2018-01-26T19:44:48.632 [INFO] Excluding org.apache.avro:avro:jar:1.8.2 from the shaded jar.
2018-01-26T19:44:48.632 [INFO] Excluding com.thoughtworks.paranamer:paranamer:jar:2.7 from
the shaded jar.
2018-01-26T19:44:48.632 [INFO] Excluding org.tukaani:xz:jar:1.5 from the shaded jar.
2018-01-26T19:44:48.632 [INFO] Excluding org.xerial.snappy:snappy-java:jar:1.1.4 from the
shaded jar.
2018-01-26T19:44:48.632 [INFO] Excluding org.apache.commons:commons-compress:jar:1.14 from
the shaded jar.
2018-01-26T19:44:48.632 [INFO] Excluding org.apache.beam:beam-runners-core-construction-java:jar:2.3.0-SNAPSHOT
from the shaded jar.
2018-01-26T19:44:48.632 [INFO] Excluding org.apache.beam:beam-model-job-management:jar:2.3.0-SNAPSHOT
from the shaded jar.
2018-01-26T19:44:48.632 [INFO] Excluding com.google.protobuf:protobuf-java-util:jar:3.2.0
from the shaded jar.
2018-01-26T19:44:48.632 [INFO] Excluding com.google.code.gson:gson:jar:2.7 from the shaded
jar.
2018-01-26T19:44:48.632 [INFO] Excluding io.grpc:grpc-core:jar:1.2.0 from the shaded jar.
2018-01-26T19:44:48.632 [INFO] Excluding com.google.errorprone:error_prone_annotations:jar:2.0.15
from the shaded jar.
2018-01-26T19:44:48.632 [INFO] Excluding io.grpc:grpc-context:jar:1.2.0 from the shaded jar.
2018-01-26T19:44:48.632 [INFO] Excluding com.google.instrumentation:instrumentation-api:jar:0.3.0
from the shaded jar.
2018-01-26T19:44:48.632 [INFO] Excluding io.grpc:grpc-stub:jar:1.2.0 from the shaded jar.
2018-01-26T19:44:48.632 [INFO] Excluding org.apache.beam:beam-runners-core-java:jar:2.3.0-SNAPSHOT
from the shaded jar.
2018-01-26T19:44:48.632 [INFO] Excluding org.apache.commons:commons-lang3:jar:3.6 from the
shaded jar.
2018-01-26T19:44:48.632 [INFO] Excluding com.google.code.findbugs:jsr305:jar:3.0.1 from the
shaded jar.
2018-01-26T19:44:48.632 [INFO] Excluding com.google.auto.service:auto-service:jar:1.0-rc2
from the shaded jar.
2018-01-26T19:44:48.632 [INFO] Excluding com.google.auto:auto-common:jar:0.3 from the shaded
jar.
2018-01-26T19:44:48.632 [INFO] Excluding io.grpc:grpc-protobuf:jar:1.2.0 from the shaded jar.
2018-01-26T19:44:48.632 [INFO] Excluding io.grpc:grpc-protobuf-lite:jar:1.2.0 from the shaded
jar.
2018-01-26T19:44:50.470 [INFO] Replacing original artifact with shaded artifact.
2018-01-26T19:44:50.470 [INFO] Replacing <https://builds.apache.org/job/beam_PostCommit_Java_MavenInstall/ws/src/runners/apex/target/beam-runners-apex-2.3.0-SNAPSHOT.jar>
with <https://builds.apache.org/job/beam_PostCommit_Java_MavenInstall/ws/src/runners/apex/target/beam-runners-apex-2.3.0-SNAPSHOT-shaded.jar>
2018-01-26T19:44:50.470 [INFO] Replacing original test artifact with shaded test artifact.
2018-01-26T19:44:50.470 [INFO] Replacing <https://builds.apache.org/job/beam_PostCommit_Java_MavenInstall/ws/src/runners/apex/target/beam-runners-apex-2.3.0-SNAPSHOT-tests.jar>
with <https://builds.apache.org/job/beam_PostCommit_Java_MavenInstall/ws/src/runners/apex/target/beam-runners-apex-2.3.0-SNAPSHOT-shaded-tests.jar>
2018-01-26T19:44:50.677 [INFO] 
2018-01-26T19:44:50.677 [INFO] --- maven-javadoc-plugin:3.0.0-M1:jar (attach-javadocs) @ beam-runners-apex
---
2018-01-26T19:44:52.350 [INFO] 
2 warnings
2018-01-26T19:44:52.350 [WARNING] Javadoc Warnings
2018-01-26T19:44:52.350 [WARNING] <https://builds.apache.org/job/beam_PostCommit_Java_MavenInstall/ws/src/runners/apex/src/main/java/org/apache/beam/runners/apex/translation/utils/StateInternalsProxy.java>:33:
warning: no description for @param
2018-01-26T19:44:52.350 [WARNING] * @param <K>
2018-01-26T19:44:52.350 [WARNING] ^
2018-01-26T19:44:52.350 [WARNING] <https://builds.apache.org/job/beam_PostCommit_Java_MavenInstall/ws/src/runners/apex/src/main/java/org/apache/beam/runners/apex/translation/operators/ApexTimerInternals.java>:48:
warning: no description for @param
2018-01-26T19:44:52.350 [WARNING] * @param <K>
2018-01-26T19:44:52.350 [WARNING] ^
2018-01-26T19:44:52.358 [INFO] Building jar: <https://builds.apache.org/job/beam_PostCommit_Java_MavenInstall/ws/src/runners/apex/target/beam-runners-apex-2.3.0-SNAPSHOT-javadoc.jar>
2018-01-26T19:44:52.765 [INFO] 
2018-01-26T19:44:52.765 [INFO] --- maven-source-plugin:3.0.1:jar-no-fork (attach-sources)
@ beam-runners-apex ---
2018-01-26T19:44:52.768 [INFO] Building jar: <https://builds.apache.org/job/beam_PostCommit_Java_MavenInstall/ws/src/runners/apex/target/beam-runners-apex-2.3.0-SNAPSHOT-sources.jar>
2018-01-26T19:44:52.971 [INFO] 
2018-01-26T19:44:52.971 [INFO] --- maven-source-plugin:3.0.1:test-jar-no-fork (attach-test-sources)
@ beam-runners-apex ---
2018-01-26T19:44:52.974 [INFO] Building jar: <https://builds.apache.org/job/beam_PostCommit_Java_MavenInstall/ws/src/runners/apex/target/beam-runners-apex-2.3.0-SNAPSHOT-test-sources.jar>
2018-01-26T19:44:53.128 [INFO] 
2018-01-26T19:44:53.128 [INFO] --- reproducible-build-maven-plugin:0.4:strip-jar (default)
@ beam-runners-apex ---
2018-01-26T19:44:53.129 [INFO] Stripping <https://builds.apache.org/job/beam_PostCommit_Java_MavenInstall/ws/src/runners/apex/target/beam-runners-apex-2.3.0-SNAPSHOT.jar>
2018-01-26T19:44:53.210 [INFO] Stripping <https://builds.apache.org/job/beam_PostCommit_Java_MavenInstall/ws/src/runners/apex/target/beam-runners-apex-2.3.0-SNAPSHOT-test-sources.jar>
2018-01-26T19:44:53.213 [INFO] Stripping <https://builds.apache.org/job/beam_PostCommit_Java_MavenInstall/ws/src/runners/apex/target/beam-runners-apex-2.3.0-SNAPSHOT-sources.jar>
2018-01-26T19:44:53.215 [INFO] Stripping <https://builds.apache.org/job/beam_PostCommit_Java_MavenInstall/ws/src/runners/apex/target/original-beam-runners-apex-2.3.0-SNAPSHOT.jar>
2018-01-26T19:44:53.220 [INFO] Stripping <https://builds.apache.org/job/beam_PostCommit_Java_MavenInstall/ws/src/runners/apex/target/beam-runners-apex-2.3.0-SNAPSHOT-javadoc.jar>
2018-01-26T19:44:53.223 [INFO] Stripping <https://builds.apache.org/job/beam_PostCommit_Java_MavenInstall/ws/src/runners/apex/target/original-beam-runners-apex-2.3.0-SNAPSHOT-tests.jar>
2018-01-26T19:44:53.227 [INFO] Stripping <https://builds.apache.org/job/beam_PostCommit_Java_MavenInstall/ws/src/runners/apex/target/beam-runners-apex-2.3.0-SNAPSHOT-tests.jar>
2018-01-26T19:44:53.336 [INFO] 
2018-01-26T19:44:53.336 [INFO] --- maven-surefire-plugin:2.20:test (validates-runner-tests)
@ beam-runners-apex ---
2018-01-26T19:44:53.340 [INFO] Tests are skipped.
2018-01-26T19:44:53.447 [INFO] 
2018-01-26T19:44:53.447 [INFO] --- maven-dependency-plugin:3.0.1:analyze-only (default) @
beam-runners-apex ---
2018-01-26T19:44:53.599 [INFO] No dependency problems found
2018-01-26T19:44:53.991 [INFO] 
2018-01-26T19:44:53.991 [INFO] --- maven-install-plugin:2.5.2:install (default-install) @
beam-runners-apex ---
2018-01-26T19:44:53.993 [INFO] Installing <https://builds.apache.org/job/beam_PostCommit_Java_MavenInstall/ws/src/runners/apex/target/beam-runners-apex-2.3.0-SNAPSHOT.jar>
to <https://builds.apache.org/job/beam_PostCommit_Java_MavenInstall/ws/.repository/org/apache/beam/beam-runners-apex/2.3.0-SNAPSHOT/beam-runners-apex-2.3.0-SNAPSHOT.jar>
2018-01-26T19:44:53.997 [INFO] Installing <https://builds.apache.org/job/beam_PostCommit_Java_MavenInstall/ws/src/runners/apex/pom.xml>
to <https://builds.apache.org/job/beam_PostCommit_Java_MavenInstall/ws/.repository/org/apache/beam/beam-runners-apex/2.3.0-SNAPSHOT/beam-runners-apex-2.3.0-SNAPSHOT.pom>
2018-01-26T19:44:53.998 [INFO] Installing <https://builds.apache.org/job/beam_PostCommit_Java_MavenInstall/ws/src/runners/apex/target/beam-runners-apex-2.3.0-SNAPSHOT-tests.jar>
to <https://builds.apache.org/job/beam_PostCommit_Java_MavenInstall/ws/.repository/org/apache/beam/beam-runners-apex/2.3.0-SNAPSHOT/beam-runners-apex-2.3.0-SNAPSHOT-tests.jar>
2018-01-26T19:44:53.999 [INFO] Installing <https://builds.apache.org/job/beam_PostCommit_Java_MavenInstall/ws/src/runners/apex/target/beam-runners-apex-2.3.0-SNAPSHOT-tests.jar>
to <https://builds.apache.org/job/beam_PostCommit_Java_MavenInstall/ws/.repository/org/apache/beam/beam-runners-apex/2.3.0-SNAPSHOT/beam-runners-apex-2.3.0-SNAPSHOT-tests.jar>
2018-01-26T19:44:54.003 [INFO] Installing <https://builds.apache.org/job/beam_PostCommit_Java_MavenInstall/ws/src/runners/apex/target/beam-runners-apex-2.3.0-SNAPSHOT-javadoc.jar>
to <https://builds.apache.org/job/beam_PostCommit_Java_MavenInstall/ws/.repository/org/apache/beam/beam-runners-apex/2.3.0-SNAPSHOT/beam-runners-apex-2.3.0-SNAPSHOT-javadoc.jar>
2018-01-26T19:44:54.005 [INFO] Installing <https://builds.apache.org/job/beam_PostCommit_Java_MavenInstall/ws/src/runners/apex/target/beam-runners-apex-2.3.0-SNAPSHOT-sources.jar>
to <https://builds.apache.org/job/beam_PostCommit_Java_MavenInstall/ws/.repository/org/apache/beam/beam-runners-apex/2.3.0-SNAPSHOT/beam-runners-apex-2.3.0-SNAPSHOT-sources.jar>
2018-01-26T19:44:54.025 [INFO] Installing <https://builds.apache.org/job/beam_PostCommit_Java_MavenInstall/ws/src/runners/apex/target/beam-runners-apex-2.3.0-SNAPSHOT-test-sources.jar>
to <https://builds.apache.org/job/beam_PostCommit_Java_MavenInstall/ws/.repository/org/apache/beam/beam-runners-apex/2.3.0-SNAPSHOT/beam-runners-apex-2.3.0-SNAPSHOT-test-sources.jar>
[JENKINS] Archiving disabled
2018-01-26T19:44:57.104 [INFO] 
2018-01-26T19:44:57.104 [INFO] ------------------------------------------------------------------------
2018-01-26T19:44:57.104 [INFO] Skipping Apache Beam :: SDKs :: Java :: Aggregated Javadoc
2018-01-26T19:44:57.104 [INFO] This project has been banned from the build due to previous
failures.
2018-01-26T19:44:57.104 [INFO] ------------------------------------------------------------------------
[JENKINS] Archiving disabled
[JENKINS] Archiving disabled
[JENKINS] Archiving disabled
[JENKINS] Archiving disabled
[JENKINS] Archiving disabled
[JENKINS] Archiving disabled
[JENKINS] Archiving disabled
[JENKINS] Archiving disabled
[JENKINS] Archiving disabled
[JENKINS] Archiving disabled
[JENKINS] Archiving disabled
[JENKINS] Archiving disabled
[JENKINS] Archiving disabled
[JENKINS] Archiving disabled
[JENKINS] Archiving disabled
[JENKINS] Archiving disabled
[JENKINS] Archiving disabled
[JENKINS] Archiving disabled
[JENKINS] Archiving disabled
[JENKINS] Archiving disabled
[JENKINS] Archiving disabled
[JENKINS] Archiving disabled
[JENKINS] Archiving disabled
[JENKINS] Archiving disabled
[JENKINS] Archiving disabled
[JENKINS] Archiving disabled
[JENKINS] Archiving disabled
[JENKINS] Archiving disabled
[JENKINS] Archiving disabled
[JENKINS] Archiving disabled
[JENKINS] Archiving disabled
[JENKINS] Archiving disabled
[JENKINS] Archiving disabled
[JENKINS] Archiving disabled
[JENKINS] Archiving disabled
[JENKINS] Archiving disabled
[JENKINS] Archiving disabled
[JENKINS] Archiving disabled
[JENKINS] Archiving disabled
[JENKINS] Archiving disabled
[JENKINS] Archiving disabled
[JENKINS] Archiving disabled
[JENKINS] Archiving disabled
[JENKINS] Archiving disabled
[JENKINS] Archiving disabled
[JENKINS] Archiving disabled
[JENKINS] Archiving disabled
[JENKINS] Archiving disabled
[JENKINS] Archiving disabled
[JENKINS] Archiving disabled
[JENKINS] Archiving disabled
[JENKINS] Archiving disabled
[JENKINS] Archiving disabled
[JENKINS] Archiving disabled
[JENKINS] Archiving disabled
[JENKINS] Archiving disabled
[JENKINS] Archiving disabled
[JENKINS] Archiving disabled
[JENKINS] Archiving disabled
[JENKINS] Archiving disabled
2018-01-26T19:46:18.040 [INFO] ------------------------------------------------------------------------
2018-01-26T19:46:18.040 [INFO] Reactor Summary:
2018-01-26T19:46:18.040 [INFO] 
2018-01-26T19:46:18.040 [INFO] Apache Beam :: Parent .............................. SUCCESS
[ 33.640 s]
2018-01-26T19:46:18.040 [INFO] Apache Beam :: SDKs :: Java :: Build Tools ......... SUCCESS
[ 12.434 s]
2018-01-26T19:46:18.040 [INFO] Apache Beam :: Model ............................... SUCCESS
[  4.150 s]
2018-01-26T19:46:18.040 [INFO] Apache Beam :: Model :: Pipeline ................... SUCCESS
[ 33.920 s]
2018-01-26T19:46:18.040 [INFO] Apache Beam :: Model :: Job Management ............. SUCCESS
[ 23.243 s]
2018-01-26T19:46:18.040 [INFO] Apache Beam :: Model :: Fn Execution ............... SUCCESS
[ 28.549 s]
2018-01-26T19:46:18.040 [INFO] Apache Beam :: SDKs ................................ SUCCESS
[  8.348 s]
2018-01-26T19:46:18.040 [INFO] Apache Beam :: SDKs :: Java ........................ SUCCESS
[  6.549 s]
2018-01-26T19:46:18.040 [INFO] Apache Beam :: SDKs :: Java :: Core ................ SUCCESS
[04:34 min]
2018-01-26T19:46:18.040 [INFO] Apache Beam :: Runners ............................. SUCCESS
[  7.210 s]
2018-01-26T19:46:18.040 [INFO] Apache Beam :: Runners :: Local Java Core .......... SUCCESS
[ 21.870 s]
2018-01-26T19:46:18.040 [INFO] Apache Beam :: Runners :: Core Construction Java ... SUCCESS
[01:05 min]
2018-01-26T19:46:18.040 [INFO] Apache Beam :: Runners :: Core Java ................ SUCCESS
[ 50.645 s]
2018-01-26T19:46:18.040 [INFO] Apache Beam :: Runners :: Direct Java .............. SUCCESS
[05:00 min]
2018-01-26T19:46:18.040 [INFO] Apache Beam :: SDKs :: Java :: IO :: AMQP .......... SUCCESS
[ 31.591 s]
2018-01-26T19:46:18.041 [INFO] Apache Beam :: SDKs :: Java :: IO :: Common ........ SUCCESS
[ 12.159 s]
2018-01-26T19:46:18.041 [INFO] Apache Beam :: SDKs :: Java :: IO :: Cassandra ..... SUCCESS
[ 29.485 s]
2018-01-26T19:46:18.041 [INFO] Apache Beam :: SDKs :: Java :: IO :: Elasticsearch . SUCCESS
[ 20.605 s]
2018-01-26T19:46:18.041 [INFO] Apache Beam :: SDKs :: Java :: IO :: Elasticsearch-Tests SUCCESS
[ 12.293 s]
2018-01-26T19:46:18.041 [INFO] Apache Beam :: SDKs :: Java :: IO :: Elasticsearch-Tests ::
Common SUCCESS [ 10.538 s]
2018-01-26T19:46:18.041 [INFO] Apache Beam :: SDKs :: Java :: IO :: Elasticsearch-Tests ::
2.x SUCCESS [ 36.801 s]
2018-01-26T19:46:18.041 [INFO] Apache Beam :: SDKs :: Java :: IO :: Elasticsearch-Tests ::
5.x SUCCESS [ 41.229 s]
2018-01-26T19:46:18.041 [INFO] Apache Beam :: SDKs :: Java :: Extensions :: Google Cloud Platform
Core SUCCESS [ 42.239 s]
2018-01-26T19:46:18.041 [INFO] Apache Beam :: SDKs :: Java :: Extensions :: Protobuf SUCCESS
[ 32.325 s]
2018-01-26T19:46:18.041 [INFO] Apache Beam :: SDKs :: Java :: IO :: Google Cloud Platform
SUCCESS [02:22 min]
2018-01-26T19:46:18.041 [INFO] Apache Beam :: Runners :: Google Cloud Dataflow .... SUCCESS
[08:38 min]
2018-01-26T19:46:18.041 [INFO] Apache Beam :: SDKs :: Java :: IO :: File-based-io-tests SUCCESS
[ 19.576 s]
2018-01-26T19:46:18.041 [INFO] Apache Beam :: SDKs :: Java :: IO :: Hadoop Common . SUCCESS
[ 26.237 s]
2018-01-26T19:46:18.041 [INFO] Apache Beam :: SDKs :: Java :: IO :: Hadoop File System SUCCESS
[ 45.937 s]
2018-01-26T19:46:18.041 [INFO] Apache Beam :: SDKs :: Java :: IO :: JDBC .......... SUCCESS
[ 47.961 s]
2018-01-26T19:46:18.041 [INFO] Apache Beam :: SDKs :: Java :: IO :: Hadoop Input Format SUCCESS
[01:22 min]
2018-01-26T19:46:18.041 [INFO] Apache Beam :: SDKs :: Java :: IO :: HBase ......... SUCCESS
[01:37 min]
2018-01-26T19:46:18.041 [INFO] Apache Beam :: SDKs :: Java :: IO :: HCatalog ...... SUCCESS
[01:04 min]
2018-01-26T19:46:18.041 [INFO] Apache Beam :: SDKs :: Java :: IO :: JMS ........... SUCCESS
[ 25.305 s]
2018-01-26T19:46:18.041 [INFO] Apache Beam :: SDKs :: Java :: IO :: Kafka ......... FAILURE
[ 39.380 s]
2018-01-26T19:46:18.041 [INFO] Apache Beam :: SDKs :: Java :: IO :: Kinesis ....... SUCCESS
[ 38.867 s]
2018-01-26T19:46:18.041 [INFO] Apache Beam :: SDKs :: Java :: IO :: MongoDB ....... SUCCESS
[ 40.574 s]
2018-01-26T19:46:18.041 [INFO] Apache Beam :: SDKs :: Java :: IO :: MQTT .......... SUCCESS
[ 28.575 s]
2018-01-26T19:46:18.041 [INFO] Apache Beam :: SDKs :: Java :: IO :: Redis ......... SUCCESS
[ 19.691 s]
2018-01-26T19:46:18.041 [INFO] Apache Beam :: SDKs :: Java :: IO :: Solr .......... SUCCESS
[ 38.778 s]
2018-01-26T19:46:18.041 [INFO] Apache Beam :: SDKs :: Java :: IO :: Tika .......... SUCCESS
[ 28.088 s]
2018-01-26T19:46:18.041 [INFO] Apache Beam :: SDKs :: Java :: IO :: XML ........... SUCCESS
[ 28.711 s]
2018-01-26T19:46:18.041 [INFO] Apache Beam :: SDKs :: Java :: Maven Archetypes :: Starter
SUCCESS [ 16.232 s]
2018-01-26T19:46:18.041 [INFO] Apache Beam :: Examples :: Java .................... SUCCESS
[07:03 min]
2018-01-26T19:46:18.041 [INFO] Apache Beam :: SDKs :: Java :: Maven Archetypes :: Examples
SUCCESS [ 32.945 s]
2018-01-26T19:46:18.041 [INFO] Apache Beam :: SDKs :: Java :: Extensions :: Jackson SUCCESS
[ 20.083 s]
2018-01-26T19:46:18.041 [INFO] Apache Beam :: SDKs :: Java :: Extensions :: Join library SUCCESS
[ 21.388 s]
2018-01-26T19:46:18.041 [INFO] Apache Beam :: SDKs :: Java :: Extensions :: Sketching SUCCESS
[ 30.728 s]
2018-01-26T19:46:18.041 [INFO] Apache Beam :: SDKs :: Java :: Extensions :: Sorter  SUCCESS
[ 31.430 s]
2018-01-26T19:46:18.041 [INFO] Apache Beam :: SDKs :: Java :: Extensions :: SQL ... SKIPPED
2018-01-26T19:46:18.041 [INFO] Apache Beam :: SDKs :: Java :: Fn Execution ........ SUCCESS
[ 33.793 s]
2018-01-26T19:46:18.041 [INFO] Apache Beam :: SDKs :: Java :: Nexmark ............. SKIPPED
2018-01-26T19:46:18.041 [INFO] Apache Beam :: Runners :: Java Fn Execution ........ SUCCESS
[ 21.025 s]
2018-01-26T19:46:18.041 [INFO] Apache Beam :: Runners :: Java Local Artifact Service SUCCESS
[ 17.656 s]
2018-01-26T19:46:18.041 [INFO] Apache Beam :: Runners :: Reference :: Java ........ SUCCESS
[ 14.069 s]
2018-01-26T19:46:18.041 [INFO] Apache Beam :: Runners :: Reference :: Job Orchestrator SUCCESS
[ 17.397 s]
2018-01-26T19:46:18.041 [INFO] Apache Beam :: Runners :: Flink .................... SUCCESS
[ 43.628 s]
2018-01-26T19:46:18.041 [INFO] Apache Beam :: Runners :: Spark .................... SKIPPED
2018-01-26T19:46:18.041 [INFO] Apache Beam :: Runners :: Apex ..................... SUCCESS
[01:09 min]
2018-01-26T19:46:18.041 [INFO] Apache Beam :: SDKs :: Java :: Aggregated Javadoc .. SKIPPED
2018-01-26T19:46:18.042 [INFO] ------------------------------------------------------------------------
2018-01-26T19:46:18.042 [INFO] BUILD FAILURE
2018-01-26T19:46:18.042 [INFO] ------------------------------------------------------------------------
2018-01-26T19:46:18.042 [INFO] Total time: 59:44 min
2018-01-26T19:46:18.042 [INFO] Finished at: 2018-01-26T19:46:18Z
2018-01-26T19:46:18.892 [INFO] Final Memory: 350M/1800M
2018-01-26T19:46:18.892 [INFO] ------------------------------------------------------------------------
Waiting for Jenkins to finish collecting data
2018-01-26T19:46:20.158 [ERROR] Failed to execute goal org.apache.maven.plugins:maven-dependency-plugin:3.0.1:analyze-only
(default) on project beam-sdks-java-io-kafka: Dependency problems found -> [Help 1]
2018-01-26T19:46:20.159 [ERROR] 
2018-01-26T19:46:20.159 [ERROR] To see the full stack trace of the errors, re-run Maven with
the -e switch.
2018-01-26T19:46:20.159 [ERROR] Re-run Maven using the -X switch to enable full debug logging.
2018-01-26T19:46:20.159 [ERROR] 
2018-01-26T19:46:20.159 [ERROR] For more information about the errors and possible solutions,
please read the following articles:
2018-01-26T19:46:20.159 [ERROR] [Help 1] http://cwiki.apache.org/confluence/display/MAVEN/MojoExecutionException
2018-01-26T19:46:20.159 [ERROR] 
2018-01-26T19:46:20.159 [ERROR] After correcting the problems, you can resume the build with
the command
2018-01-26T19:46:20.159 [ERROR]   mvn <goals> -rf :beam-sdks-java-io-kafka
channel stopped
Not sending mail to unregistered user zoy@giggles.nyc.corp.google.com
Not sending mail to unregistered user XuMingmin@users.noreply.github.com

Mime
View raw message