beam-commits mailing list archives

Site index · List index
Message view « Date » · « Thread »
Top « Date » · « Thread »
From Apache Jenkins Server <jenk...@builds.apache.org>
Subject Build failed in Jenkins: beam_PerformanceTests_Python #857
Date Wed, 31 Jan 2018 12:06:49 GMT
See <https://builds.apache.org/job/beam_PerformanceTests_Python/857/display/redirect>

------------------------------------------
[...truncated 722.49 KB...]
[INFO] 
[INFO] --- maven-compiler-plugin:3.7.0:testCompile (default-testCompile) @ beam-sdks-java-extensions-sql
---
[INFO] Compiling 90 source files to /tmp/perfkitbenchmarker/runs/799ac185/beam/sdks/java/extensions/sql/target/test-classes
[INFO] /tmp/perfkitbenchmarker/runs/799ac185/beam/sdks/java/extensions/sql/src/test/java/org/apache/beam/sdk/extensions/sql/impl/interpreter/operator/date/BeamSqlTimestampMinusTimestampExpressionTest.java:
Some input files use or override a deprecated API.
[INFO] /tmp/perfkitbenchmarker/runs/799ac185/beam/sdks/java/extensions/sql/src/test/java/org/apache/beam/sdk/extensions/sql/impl/interpreter/operator/date/BeamSqlTimestampMinusTimestampExpressionTest.java:
Recompile with -Xlint:deprecation for details.
[INFO] /tmp/perfkitbenchmarker/runs/799ac185/beam/sdks/java/extensions/sql/src/test/java/org/apache/beam/sdk/extensions/sql/TestUtils.java:
Some input files use unchecked or unsafe operations.
[INFO] /tmp/perfkitbenchmarker/runs/799ac185/beam/sdks/java/extensions/sql/src/test/java/org/apache/beam/sdk/extensions/sql/TestUtils.java:
Recompile with -Xlint:unchecked for details.
[INFO] 
[INFO] --- maven-checkstyle-plugin:2.17:check (default) @ beam-sdks-java-extensions-sql ---
[INFO] 
[INFO] --- maven-surefire-plugin:2.20.1:test (default-test) @ beam-sdks-java-extensions-sql
---
[INFO] Tests are skipped.
[INFO] 
[INFO] --- build-helper-maven-plugin:3.0.0:regex-properties (render-artifact-id) @ beam-sdks-java-extensions-sql
---
[INFO] 
[INFO] --- jacoco-maven-plugin:0.7.9:report (report) @ beam-sdks-java-extensions-sql ---
[INFO] Skipping JaCoCo execution due to missing execution data file.
[INFO] 
[INFO] --- maven-jar-plugin:3.0.2:jar (default-jar) @ beam-sdks-java-extensions-sql ---
[INFO] Building jar: /tmp/perfkitbenchmarker/runs/799ac185/beam/sdks/java/extensions/sql/target/beam-sdks-java-extensions-sql-2.4.0-SNAPSHOT.jar
[INFO] 
[INFO] --- maven-site-plugin:3.7:attach-descriptor (attach-descriptor) @ beam-sdks-java-extensions-sql
---
[INFO] Skipping because packaging 'jar' is not pom.
[INFO] 
[INFO] --- maven-jar-plugin:3.0.2:test-jar (default-test-jar) @ beam-sdks-java-extensions-sql
---
[INFO] Building jar: /tmp/perfkitbenchmarker/runs/799ac185/beam/sdks/java/extensions/sql/target/beam-sdks-java-extensions-sql-2.4.0-SNAPSHOT-tests.jar
[INFO] 
[INFO] --- maven-shade-plugin:3.1.0:shade (bundle-and-repackage) @ beam-sdks-java-extensions-sql
---
[INFO] Including org.apache.calcite:calcite-core:jar:1.13.0 in the shaded jar.
[INFO] Excluding commons-dbcp:commons-dbcp:jar:1.4 from the shaded jar.
[INFO] Excluding commons-pool:commons-pool:jar:1.5.4 from the shaded jar.
[INFO] Excluding org.apache.commons:commons-lang3:jar:3.6 from the shaded jar.
[INFO] Excluding com.fasterxml.jackson.core:jackson-core:jar:2.8.9 from the shaded jar.
[INFO] Excluding com.fasterxml.jackson.core:jackson-annotations:jar:2.8.9 from the shaded
jar.
[INFO] Excluding com.fasterxml.jackson.core:jackson-databind:jar:2.8.9 from the shaded jar.
[INFO] Excluding net.hydromatic:aggdesigner-algorithm:jar:6.0 from the shaded jar.
[INFO] Excluding commons-lang:commons-lang:jar:2.4 from the shaded jar.
[INFO] Excluding commons-logging:commons-logging:jar:1.1.3 from the shaded jar.
[INFO] Including org.codehaus.janino:janino:jar:2.7.6 in the shaded jar.
[INFO] Including org.codehaus.janino:commons-compiler:jar:2.7.6 in the shaded jar.
[INFO] Including org.apache.calcite:calcite-linq4j:jar:1.13.0 in the shaded jar.
[INFO] Including org.apache.calcite.avatica:avatica-core:jar:1.10.0 in the shaded jar.
[INFO] Including org.apache.calcite.avatica:avatica-metrics:jar:1.10.0 in the shaded jar.
[INFO] Including com.google.protobuf:protobuf-java:jar:3.2.0 in the shaded jar.
[INFO] Excluding org.apache.httpcomponents:httpclient:jar:4.5.2 from the shaded jar.
[INFO] Excluding commons-codec:commons-codec:jar:1.9 from the shaded jar.
[INFO] Excluding org.apache.httpcomponents:httpcore:jar:4.4.4 from the shaded jar.
[INFO] Excluding org.apache.beam:beam-sdks-java-core:jar:2.4.0-SNAPSHOT from the shaded jar.
[INFO] Excluding com.github.stephenc.findbugs:findbugs-annotations:jar:1.3.9-1 from the shaded
jar.
[INFO] Excluding net.bytebuddy:byte-buddy:jar:1.6.8 from the shaded jar.
[INFO] Excluding org.apache.avro:avro:jar:1.8.2 from the shaded jar.
[INFO] Excluding org.codehaus.jackson:jackson-core-asl:jar:1.9.13 from the shaded jar.
[INFO] Excluding org.codehaus.jackson:jackson-mapper-asl:jar:1.9.13 from the shaded jar.
[INFO] Excluding com.thoughtworks.paranamer:paranamer:jar:2.7 from the shaded jar.
[INFO] Excluding org.tukaani:xz:jar:1.5 from the shaded jar.
[INFO] Excluding org.xerial.snappy:snappy-java:jar:1.1.4 from the shaded jar.
[INFO] Excluding org.apache.commons:commons-compress:jar:1.14 from the shaded jar.
[INFO] Excluding com.google.code.findbugs:jsr305:jar:3.0.1 from the shaded jar.
[INFO] Including com.google.guava:guava:jar:20.0 in the shaded jar.
[INFO] Excluding org.slf4j:slf4j-api:jar:1.7.25 from the shaded jar.
[INFO] Excluding org.apache.commons:commons-csv:jar:1.4 from the shaded jar.
[INFO] Excluding joda-time:joda-time:jar:2.4 from the shaded jar.
[INFO] Excluding org.apache.beam:beam-sdks-java-extensions-join-library:jar:2.4.0-SNAPSHOT
from the shaded jar.
[INFO] Excluding com.alibaba:fastjson:jar:1.2.12 from the shaded jar.
[INFO] Excluding org.apache.beam:beam-runners-direct-java:jar:2.4.0-SNAPSHOT from the shaded
jar.
[INFO] Excluding org.apache.beam:beam-model-pipeline:jar:2.4.0-SNAPSHOT from the shaded jar.
[INFO] Excluding org.apache.beam:beam-runners-local-java-core:jar:2.4.0-SNAPSHOT from the
shaded jar.
[INFO] Excluding org.apache.beam:beam-runners-core-construction-java:jar:2.4.0-SNAPSHOT from
the shaded jar.
[INFO] Excluding org.apache.beam:beam-model-job-management:jar:2.4.0-SNAPSHOT from the shaded
jar.
[INFO] Excluding io.grpc:grpc-protobuf:jar:1.2.0 from the shaded jar.
[INFO] Excluding io.grpc:grpc-protobuf-lite:jar:1.2.0 from the shaded jar.
[INFO] Including com.google.protobuf:protobuf-java-util:jar:3.2.0 in the shaded jar.
[INFO] Excluding com.google.code.gson:gson:jar:2.7 from the shaded jar.
[INFO] Excluding io.grpc:grpc-core:jar:1.2.0 from the shaded jar.
[INFO] Excluding com.google.errorprone:error_prone_annotations:jar:2.0.15 from the shaded
jar.
[INFO] Excluding io.grpc:grpc-context:jar:1.2.0 from the shaded jar.
[INFO] Excluding com.google.instrumentation:instrumentation-api:jar:0.3.0 from the shaded
jar.
[INFO] Excluding io.grpc:grpc-stub:jar:1.2.0 from the shaded jar.
[INFO] Excluding org.apache.beam:beam-runners-core-java:jar:2.4.0-SNAPSHOT from the shaded
jar.
[INFO] Replacing original artifact with shaded artifact.
[INFO] Replacing /tmp/perfkitbenchmarker/runs/799ac185/beam/sdks/java/extensions/sql/target/beam-sdks-java-extensions-sql-2.4.0-SNAPSHOT.jar
with /tmp/perfkitbenchmarker/runs/799ac185/beam/sdks/java/extensions/sql/target/beam-sdks-java-extensions-sql-2.4.0-SNAPSHOT-shaded.jar
[INFO] Replacing original test artifact with shaded test artifact.
[INFO] Replacing /tmp/perfkitbenchmarker/runs/799ac185/beam/sdks/java/extensions/sql/target/beam-sdks-java-extensions-sql-2.4.0-SNAPSHOT-tests.jar
with /tmp/perfkitbenchmarker/runs/799ac185/beam/sdks/java/extensions/sql/target/beam-sdks-java-extensions-sql-2.4.0-SNAPSHOT-shaded-tests.jar
[INFO] Dependency-reduced POM written at: /tmp/perfkitbenchmarker/runs/799ac185/beam/sdks/java/extensions/sql/dependency-reduced-pom.xml
[INFO] 
[INFO] --- maven-dependency-plugin:3.0.2:analyze-only (default) @ beam-sdks-java-extensions-sql
---
[WARNING] Used undeclared dependencies found:
[WARNING]    com.github.stephenc.findbugs:findbugs-annotations:jar:1.3.9-1:compile
[INFO] ------------------------------------------------------------------------
[INFO] Reactor Summary:
[INFO] 
[INFO] Apache Beam :: Parent .............................. SUCCESS [ 11.977 s]
[INFO] Apache Beam :: SDKs :: Java :: Build Tools ......... SUCCESS [  6.063 s]
[INFO] Apache Beam :: Model ............................... SUCCESS [  0.094 s]
[INFO] Apache Beam :: Model :: Pipeline ................... SUCCESS [  9.912 s]
[INFO] Apache Beam :: Model :: Job Management ............. SUCCESS [  4.097 s]
[INFO] Apache Beam :: Model :: Fn Execution ............... SUCCESS [  4.962 s]
[INFO] Apache Beam :: SDKs ................................ SUCCESS [  0.188 s]
[INFO] Apache Beam :: SDKs :: Go .......................... SUCCESS [  9.296 s]
[INFO] Apache Beam :: SDKs :: Java ........................ SUCCESS [  0.121 s]
[INFO] Apache Beam :: SDKs :: Java :: Core ................ SUCCESS [ 31.721 s]
[INFO] Apache Beam :: SDKs :: Java :: Fn Execution ........ SUCCESS [  3.840 s]
[INFO] Apache Beam :: SDKs :: Java :: Extensions .......... SUCCESS [  0.079 s]
[INFO] Apache Beam :: SDKs :: Java :: Extensions :: Google Cloud Platform Core SUCCESS [ 
4.141 s]
[INFO] Apache Beam :: Runners ............................. SUCCESS [  0.084 s]
[INFO] Apache Beam :: Runners :: Core Construction Java ... SUCCESS [  4.722 s]
[INFO] Apache Beam :: Runners :: Core Java ................ SUCCESS [  5.196 s]
[INFO] Apache Beam :: SDKs :: Java :: Harness ............. SUCCESS [ 10.281 s]
[INFO] Apache Beam :: SDKs :: Java :: Container ........... SUCCESS [  4.487 s]
[INFO] Apache Beam :: SDKs :: Java :: IO .................. SUCCESS [  0.079 s]
[INFO] Apache Beam :: SDKs :: Java :: IO :: Amazon Web Services SUCCESS [  3.668 s]
[INFO] Apache Beam :: Runners :: Local Java Core .......... SUCCESS [  1.969 s]
[INFO] Apache Beam :: Runners :: Direct Java .............. SUCCESS [ 12.562 s]
[INFO] Apache Beam :: SDKs :: Java :: IO :: AMQP .......... SUCCESS [  2.907 s]
[INFO] Apache Beam :: SDKs :: Java :: IO :: Common ........ SUCCESS [  2.359 s]
[INFO] Apache Beam :: SDKs :: Java :: IO :: Cassandra ..... SUCCESS [  3.351 s]
[INFO] Apache Beam :: SDKs :: Java :: IO :: Elasticsearch . SUCCESS [  2.705 s]
[INFO] Apache Beam :: SDKs :: Java :: IO :: Elasticsearch-Tests SUCCESS [  0.741 s]
[INFO] Apache Beam :: SDKs :: Java :: IO :: Elasticsearch-Tests :: Common SUCCESS [  0.636
s]
[INFO] Apache Beam :: SDKs :: Java :: IO :: Elasticsearch-Tests :: 2.x SUCCESS [  2.951 s]
[INFO] Apache Beam :: SDKs :: Java :: IO :: Elasticsearch-Tests :: 5.x SUCCESS [  2.246 s]
[INFO] Apache Beam :: SDKs :: Java :: Extensions :: Protobuf SUCCESS [  2.756 s]
[INFO] Apache Beam :: SDKs :: Java :: IO :: Google Cloud Platform SUCCESS [  5.704 s]
[INFO] Apache Beam :: Runners :: Google Cloud Dataflow .... SUCCESS [  9.179 s]
[INFO] Apache Beam :: SDKs :: Java :: IO :: File-based-io-tests SUCCESS [  2.101 s]
[INFO] Apache Beam :: SDKs :: Java :: IO :: Hadoop Common . SUCCESS [  5.522 s]
[INFO] Apache Beam :: SDKs :: Java :: IO :: Hadoop File System SUCCESS [  3.905 s]
[INFO] Apache Beam :: SDKs :: Java :: IO :: JDBC .......... SUCCESS [  3.485 s]
[INFO] Apache Beam :: SDKs :: Java :: IO :: Hadoop Input Format SUCCESS [ 13.662 s]
[INFO] Apache Beam :: SDKs :: Java :: IO :: HBase ......... SUCCESS [  6.859 s]
[INFO] Apache Beam :: SDKs :: Java :: IO :: HCatalog ...... SUCCESS [  9.406 s]
[INFO] Apache Beam :: SDKs :: Java :: IO :: JMS ........... SUCCESS [  2.558 s]
[INFO] Apache Beam :: SDKs :: Java :: IO :: Kafka ......... SUCCESS [  3.025 s]
[INFO] Apache Beam :: SDKs :: Java :: IO :: Kinesis ....... SUCCESS [  3.021 s]
[INFO] Apache Beam :: SDKs :: Java :: IO :: MongoDB ....... SUCCESS [  2.642 s]
[INFO] Apache Beam :: SDKs :: Java :: IO :: MQTT .......... SUCCESS [  2.926 s]
[INFO] Apache Beam :: SDKs :: Java :: IO :: Redis ......... SUCCESS [  2.372 s]
[INFO] Apache Beam :: SDKs :: Java :: IO :: Solr .......... SUCCESS [  5.388 s]
[INFO] Apache Beam :: SDKs :: Java :: IO :: Tika .......... SUCCESS [  4.829 s]
[INFO] Apache Beam :: SDKs :: Java :: IO :: XML ........... SUCCESS [  2.839 s]
[INFO] Apache Beam :: SDKs :: Java :: Java 8 Tests ........ SUCCESS [  0.631 s]
[INFO] Apache Beam :: SDKs :: Java :: Maven Archetypes .... SUCCESS [  0.045 s]
[INFO] Apache Beam :: SDKs :: Java :: Maven Archetypes :: Starter SUCCESS [ 10.304 s]
[INFO] Apache Beam :: Examples ............................ SUCCESS [  0.063 s]
[INFO] Apache Beam :: Examples :: Java .................... SUCCESS [  3.904 s]
[INFO] Apache Beam :: SDKs :: Java :: Maven Archetypes :: Examples SUCCESS [ 28.895 s]
[INFO] Apache Beam :: SDKs :: Java :: Extensions :: Jackson SUCCESS [  2.512 s]
[INFO] Apache Beam :: SDKs :: Java :: Extensions :: Join library SUCCESS [  2.253 s]
[INFO] Apache Beam :: SDKs :: Java :: Extensions :: Sketching SUCCESS [  2.918 s]
[INFO] Apache Beam :: SDKs :: Java :: Extensions :: Sorter  SUCCESS [  2.934 s]
[INFO] Apache Beam :: SDKs :: Java :: Extensions :: SQL ... FAILURE [ 17.371 s]
[INFO] Apache Beam :: SDKs :: Java :: Nexmark ............. SKIPPED
[INFO] Apache Beam :: SDKs :: Python ...................... SKIPPED
[INFO] Apache Beam :: SDKs :: Python :: Container ......... SKIPPED
[INFO] Apache Beam :: Runners :: Java Fn Execution ........ SKIPPED
[INFO] Apache Beam :: Runners :: Java Local Artifact Service SKIPPED
[INFO] Apache Beam :: Runners :: Reference ................ SKIPPED
[INFO] Apache Beam :: Runners :: Reference :: Java ........ SKIPPED
[INFO] Apache Beam :: Runners :: Reference :: Job Orchestrator SKIPPED
[INFO] Apache Beam :: Runners :: Flink .................... SKIPPED
[INFO] Apache Beam :: Runners :: Gearpump ................. SKIPPED
[INFO] Apache Beam :: Runners :: Spark .................... SKIPPED
[INFO] Apache Beam :: Runners :: Apex ..................... SKIPPED
[INFO] Apache Beam :: Runners :: Google Cloud Platform .... SKIPPED
[INFO] Apache Beam :: Runners :: Google Cloud Platform :: GCE metadata provisioning SKIPPED
[INFO] Apache Beam :: Runners :: Google Cloud Platform :: GCS artifact proxy SKIPPED
[INFO] Apache Beam :: SDKs :: Java :: Aggregated Javadoc .. SKIPPED
[INFO] ------------------------------------------------------------------------
[INFO] BUILD FAILURE
[INFO] ------------------------------------------------------------------------
[INFO] Total time: 05:16 min
[INFO] Finished at: 2018-01-31T12:05:59Z
[INFO] Final Memory: 331M/1855M
[INFO] ------------------------------------------------------------------------
[ERROR] Failed to execute goal org.apache.maven.plugins:maven-dependency-plugin:3.0.2:analyze-only
(default) on project beam-sdks-java-extensions-sql: Dependency problems found -> [Help
1]
[ERROR] 
[ERROR] To see the full stack trace of the errors, re-run Maven with the -e switch.
[ERROR] Re-run Maven using the -X switch to enable full debug logging.
[ERROR] 
[ERROR] For more information about the errors and possible solutions, please read the following
articles:
[ERROR] [Help 1] http://cwiki.apache.org/confluence/display/MAVEN/MojoExecutionException
[ERROR] 
[ERROR] After correcting the problems, you can resume the build with the command
[ERROR]   mvn <goals> -rf :beam-sdks-java-extensions-sql

STDERR: log4j:WARN No appenders could be found for logger (freemarker.cache).
log4j:WARN Please initialize the log4j system properly.
Warning: Lookahead adequacy checking not being performed since option LOOKAHEAD is more than
1.  Set option FORCE_LA_CHECK to true to force checking.

2018-01-31 12:06:00,809 799ac185 MainThread beam_integration_benchmark(1/1) INFO     Running
benchmark beam_integration_benchmark
2018-01-31 12:06:00,818 799ac185 MainThread beam_integration_benchmark(1/1) ERROR    Error
during benchmark beam_integration_benchmark
Traceback (most recent call last):
  File "<https://builds.apache.org/job/beam_PerformanceTests_Python/ws/PerfKitBenchmarker/perfkitbenchmarker/pkb.py",>
line 601, in RunBenchmark
    DoRunPhase(spec, collector, detailed_timer)
  File "<https://builds.apache.org/job/beam_PerformanceTests_Python/ws/PerfKitBenchmarker/perfkitbenchmarker/pkb.py",>
line 504, in DoRunPhase
    samples = spec.BenchmarkRun(spec)
  File "<https://builds.apache.org/job/beam_PerformanceTests_Python/ws/PerfKitBenchmarker/perfkitbenchmarker/linux_benchmarks/beam_integration_benchmark.py",>
line 159, in Run
    job_type=job_type)
  File "<https://builds.apache.org/job/beam_PerformanceTests_Python/ws/PerfKitBenchmarker/perfkitbenchmarker/providers/gcp/gcp_dpb_dataflow.py",>
line 87, in SubmitJob
    self.spec, classname, job_arguments)
  File "<https://builds.apache.org/job/beam_PerformanceTests_Python/ws/PerfKitBenchmarker/perfkitbenchmarker/beam_benchmark_helper.py",>
line 175, in BuildBeamCommand
    cmd = _BuildPythonCommand(benchmark_spec, classname, job_arguments)
  File "<https://builds.apache.org/job/beam_PerformanceTests_Python/ws/PerfKitBenchmarker/perfkitbenchmarker/beam_benchmark_helper.py",>
line 265, in _BuildPythonCommand
    'apache-beam*.tar.gz')
  File "<https://builds.apache.org/job/beam_PerformanceTests_Python/ws/PerfKitBenchmarker/perfkitbenchmarker/beam_benchmark_helper.py",>
line 290, in _FindFiles
    raise RuntimeError('No such directory: %s' % base_path)
RuntimeError: No such directory: /tmp/perfkitbenchmarker/runs/799ac185/beam/sdks/python/target
2018-01-31 12:06:00,820 799ac185 MainThread beam_integration_benchmark(1/1) INFO     Cleaning
up benchmark beam_integration_benchmark
2018-01-31 12:06:00,822 799ac185 MainThread beam_integration_benchmark(1/1) ERROR    Benchmark
1/1 beam_integration_benchmark (UID: beam_integration_benchmark0) failed. Execution will continue.
2018-01-31 12:06:00,864 799ac185 MainThread INFO     Benchmark run statuses:
---------------------------------------------------------------
Name                        UID                          Status
---------------------------------------------------------------
beam_integration_benchmark  beam_integration_benchmark0  FAILED
---------------------------------------------------------------
Success rate: 0.00% (0/1)
2018-01-31 12:06:00,865 799ac185 MainThread INFO     Complete logs can be found at: /tmp/perfkitbenchmarker/runs/799ac185/pkb.log
2018-01-31 12:06:00,865 799ac185 MainThread INFO     Completion statuses can be found at:
/tmp/perfkitbenchmarker/runs/799ac185/completion_statuses.json
Build step 'Execute shell' marked build as failure
Not sending mail to unregistered user ankurgoenka@gmail.com
Not sending mail to unregistered user markliu@google.com
Not sending mail to unregistered user kedin@google.com
Not sending mail to unregistered user zoy@giggles.nyc.corp.google.com
Not sending mail to unregistered user sduskis@google.com
Not sending mail to unregistered user samuelw@google.com
Not sending mail to unregistered user melissapa@google.com
Not sending mail to unregistered user XuMingmin@users.noreply.github.com
Not sending mail to unregistered user holdenkarau@google.com
Not sending mail to unregistered user aromanenko.dev@gmail.com
Not sending mail to unregistered user daniel.o.programmer@gmail.com
Not sending mail to unregistered user jb@nanthrax.net
Not sending mail to unregistered user robert@frantil.com
Not sending mail to unregistered user mariagh@mariagh.svl.corp.google.com
Not sending mail to unregistered user dariusz.aniszewski@polidea.com
Not sending mail to unregistered user joey.baruch@gmail.com
Not sending mail to unregistered user arostami@google.com
Not sending mail to unregistered user github@alasdairhodge.co.uk
Not sending mail to unregistered user Mottyg1@gmail.com
Not sending mail to unregistered user swegner@google.com
Not sending mail to unregistered user niemo@google.com
Not sending mail to unregistered user ehudm@google.com
Not sending mail to unregistered user kirpichov@google.com
Not sending mail to unregistered user klk@google.com
Not sending mail to unregistered user sidhom@google.com
Not sending mail to unregistered user batbat@batbat-linuxworkstation.sea.corp.google.com
Not sending mail to unregistered user ekirpichov@gmail.com
Not sending mail to unregistered user zhouhai02@meituan.com
Not sending mail to unregistered user pawel.pk.kaczmarczyk@gmail.com
Not sending mail to unregistered user rober@frantil.com

Mime
View raw message