beam-commits mailing list archives

Site index · List index
Message view « Date » · « Thread »
Top « Date » · « Thread »
From Apache Jenkins Server <jenk...@builds.apache.org>
Subject Build failed in Jenkins: beam_PostCommit_Java_MavenInstall #5799
Date Mon, 29 Jan 2018 21:57:56 GMT
See <https://builds.apache.org/job/beam_PostCommit_Java_MavenInstall/5799/display/redirect?page=changes>

Changes:

[iemejia] Fix dependency order error, harness must be built before container

------------------------------------------
[...truncated 2.57 MB...]
2018-01-29T21:54:37.509 [INFO] Excluding commons-beanutils:commons-beanutils-core:jar:1.8.0
from the shaded jar.
2018-01-29T21:54:37.509 [INFO] Excluding org.apache.hadoop:hadoop-auth:jar:2.7.3 from the
shaded jar.
2018-01-29T21:54:37.509 [INFO] Excluding org.apache.directory.server:apacheds-kerberos-codec:jar:2.0.0-M15
from the shaded jar.
2018-01-29T21:54:37.509 [INFO] Excluding org.apache.directory.server:apacheds-i18n:jar:2.0.0-M15
from the shaded jar.
2018-01-29T21:54:37.509 [INFO] Excluding org.apache.directory.api:api-asn1-api:jar:1.0.0-M20
from the shaded jar.
2018-01-29T21:54:37.509 [INFO] Excluding org.apache.directory.api:api-util:jar:1.0.0-M20 from
the shaded jar.
2018-01-29T21:54:37.509 [INFO] Excluding org.apache.curator:curator-client:jar:2.7.1 from
the shaded jar.
2018-01-29T21:54:37.509 [INFO] Excluding org.mortbay.jetty:jetty-util:jar:6.1.26 from the
shaded jar.
2018-01-29T21:54:37.509 [INFO] Excluding org.apache.hadoop:hadoop-mapreduce-client-app:jar:2.7.3
from the shaded jar.
2018-01-29T21:54:37.509 [INFO] Excluding org.apache.hadoop:hadoop-mapreduce-client-common:jar:2.7.3
from the shaded jar.
2018-01-29T21:54:37.509 [INFO] Excluding org.apache.hadoop:hadoop-yarn-server-common:jar:2.7.3
from the shaded jar.
2018-01-29T21:54:37.509 [INFO] Excluding org.apache.hadoop:hadoop-mapreduce-client-shuffle:jar:2.7.3
from the shaded jar.
2018-01-29T21:54:37.509 [INFO] Excluding org.apache.hadoop:hadoop-yarn-api:jar:2.7.3 from
the shaded jar.
2018-01-29T21:54:37.509 [INFO] Excluding org.apache.hadoop:hadoop-mapreduce-client-core:jar:2.7.3
from the shaded jar.
2018-01-29T21:54:37.509 [INFO] Excluding org.apache.hadoop:hadoop-mapreduce-client-jobclient:jar:2.7.3
from the shaded jar.
2018-01-29T21:54:37.509 [INFO] Excluding org.apache.hadoop:hadoop-annotations:jar:2.7.3 from
the shaded jar.
2018-01-29T21:54:37.509 [INFO] Excluding org.apache.spark:spark-launcher_2.11:jar:2.2.1 from
the shaded jar.
2018-01-29T21:54:37.509 [INFO] Excluding org.apache.spark:spark-network-common_2.11:jar:2.2.1
from the shaded jar.
2018-01-29T21:54:37.509 [INFO] Excluding org.fusesource.leveldbjni:leveldbjni-all:jar:1.8
from the shaded jar.
2018-01-29T21:54:37.509 [INFO] Excluding org.apache.spark:spark-network-shuffle_2.11:jar:2.2.1
from the shaded jar.
2018-01-29T21:54:37.509 [INFO] Excluding org.apache.spark:spark-unsafe_2.11:jar:2.2.1 from
the shaded jar.
2018-01-29T21:54:37.509 [INFO] Excluding net.java.dev.jets3t:jets3t:jar:0.9.3 from the shaded
jar.
2018-01-29T21:54:37.509 [INFO] Excluding javax.activation:activation:jar:1.1.1 from the shaded
jar.
2018-01-29T21:54:37.509 [INFO] Excluding mx4j:mx4j:jar:3.0.2 from the shaded jar.
2018-01-29T21:54:37.509 [INFO] Excluding javax.mail:mail:jar:1.4.7 from the shaded jar.
2018-01-29T21:54:37.509 [INFO] Excluding org.bouncycastle:bcprov-jdk15on:jar:1.51 from the
shaded jar.
2018-01-29T21:54:37.509 [INFO] Excluding com.jamesmurty.utils:java-xmlbuilder:jar:1.0 from
the shaded jar.
2018-01-29T21:54:37.509 [INFO] Excluding net.iharder:base64:jar:2.3.8 from the shaded jar.
2018-01-29T21:54:37.509 [INFO] Excluding org.apache.curator:curator-recipes:jar:2.6.0 from
the shaded jar.
2018-01-29T21:54:37.509 [INFO] Excluding org.apache.curator:curator-framework:jar:2.6.0 from
the shaded jar.
2018-01-29T21:54:37.509 [INFO] Excluding javax.servlet:javax.servlet-api:jar:3.1.0 from the
shaded jar.
2018-01-29T21:54:37.509 [INFO] Excluding org.apache.commons:commons-math3:jar:3.4.1 from the
shaded jar.
2018-01-29T21:54:37.509 [INFO] Excluding org.slf4j:jul-to-slf4j:jar:1.7.16 from the shaded
jar.
2018-01-29T21:54:37.509 [INFO] Excluding org.slf4j:jcl-over-slf4j:jar:1.7.16 from the shaded
jar.
2018-01-29T21:54:37.509 [INFO] Excluding log4j:log4j:jar:1.2.17 from the shaded jar.
2018-01-29T21:54:37.509 [INFO] Excluding org.slf4j:slf4j-log4j12:jar:1.7.16 from the shaded
jar.
2018-01-29T21:54:37.509 [INFO] Excluding com.ning:compress-lzf:jar:1.0.3 from the shaded jar.
2018-01-29T21:54:37.509 [INFO] Excluding net.jpountz.lz4:lz4:jar:1.3.0 from the shaded jar.
2018-01-29T21:54:37.509 [INFO] Excluding org.roaringbitmap:RoaringBitmap:jar:0.5.11 from the
shaded jar.
2018-01-29T21:54:37.509 [INFO] Excluding commons-net:commons-net:jar:2.2 from the shaded jar.
2018-01-29T21:54:37.509 [INFO] Excluding org.scala-lang:scala-library:jar:2.11.8 from the
shaded jar.
2018-01-29T21:54:37.509 [INFO] Excluding org.json4s:json4s-jackson_2.11:jar:3.2.11 from the
shaded jar.
2018-01-29T21:54:37.509 [INFO] Excluding org.json4s:json4s-core_2.11:jar:3.2.11 from the shaded
jar.
2018-01-29T21:54:37.509 [INFO] Excluding org.json4s:json4s-ast_2.11:jar:3.2.11 from the shaded
jar.
2018-01-29T21:54:37.509 [INFO] Excluding org.scala-lang:scalap:jar:2.11.0 from the shaded
jar.
2018-01-29T21:54:37.509 [INFO] Excluding org.scala-lang:scala-compiler:jar:2.11.0 from the
shaded jar.
2018-01-29T21:54:37.509 [INFO] Excluding org.scala-lang.modules:scala-xml_2.11:jar:1.0.1 from
the shaded jar.
2018-01-29T21:54:37.509 [INFO] Excluding org.glassfish.jersey.core:jersey-client:jar:2.22.2
from the shaded jar.
2018-01-29T21:54:37.509 [INFO] Excluding javax.ws.rs:javax.ws.rs-api:jar:2.0.1 from the shaded
jar.
2018-01-29T21:54:37.509 [INFO] Excluding org.glassfish.hk2:hk2-api:jar:2.4.0-b34 from the
shaded jar.
2018-01-29T21:54:37.509 [INFO] Excluding org.glassfish.hk2:hk2-utils:jar:2.4.0-b34 from the
shaded jar.
2018-01-29T21:54:37.509 [INFO] Excluding org.glassfish.hk2.external:aopalliance-repackaged:jar:2.4.0-b34
from the shaded jar.
2018-01-29T21:54:37.509 [INFO] Excluding org.glassfish.hk2.external:javax.inject:jar:2.4.0-b34
from the shaded jar.
2018-01-29T21:54:37.509 [INFO] Excluding org.glassfish.hk2:hk2-locator:jar:2.4.0-b34 from
the shaded jar.
2018-01-29T21:54:37.509 [INFO] Excluding org.glassfish.jersey.core:jersey-common:jar:2.22.2
from the shaded jar.
2018-01-29T21:54:37.509 [INFO] Excluding javax.annotation:javax.annotation-api:jar:1.2 from
the shaded jar.
2018-01-29T21:54:37.509 [INFO] Excluding org.glassfish.jersey.bundles.repackaged:jersey-guava:jar:2.22.2
from the shaded jar.
2018-01-29T21:54:37.509 [INFO] Excluding org.glassfish.hk2:osgi-resource-locator:jar:1.0.1
from the shaded jar.
2018-01-29T21:54:37.509 [INFO] Excluding org.glassfish.jersey.core:jersey-server:jar:2.22.2
from the shaded jar.
2018-01-29T21:54:37.509 [INFO] Excluding org.glassfish.jersey.media:jersey-media-jaxb:jar:2.22.2
from the shaded jar.
2018-01-29T21:54:37.509 [INFO] Excluding org.glassfish.jersey.containers:jersey-container-servlet:jar:2.22.2
from the shaded jar.
2018-01-29T21:54:37.509 [INFO] Excluding org.glassfish.jersey.containers:jersey-container-servlet-core:jar:2.22.2
from the shaded jar.
2018-01-29T21:54:37.509 [INFO] Excluding io.netty:netty-all:jar:4.0.43.Final from the shaded
jar.
2018-01-29T21:54:37.509 [INFO] Excluding io.netty:netty:jar:3.9.9.Final from the shaded jar.
2018-01-29T21:54:37.509 [INFO] Excluding io.dropwizard.metrics:metrics-jvm:jar:3.1.2 from
the shaded jar.
2018-01-29T21:54:37.509 [INFO] Excluding io.dropwizard.metrics:metrics-json:jar:3.1.2 from
the shaded jar.
2018-01-29T21:54:37.509 [INFO] Excluding io.dropwizard.metrics:metrics-graphite:jar:3.1.2
from the shaded jar.
2018-01-29T21:54:37.510 [INFO] Excluding org.apache.ivy:ivy:jar:2.4.0 from the shaded jar.
2018-01-29T21:54:37.510 [INFO] Excluding oro:oro:jar:2.0.8 from the shaded jar.
2018-01-29T21:54:37.510 [INFO] Excluding net.razorvine:pyrolite:jar:4.13 from the shaded jar.
2018-01-29T21:54:37.510 [INFO] Excluding net.sf.py4j:py4j:jar:0.10.4 from the shaded jar.
2018-01-29T21:54:37.510 [INFO] Excluding org.apache.spark:spark-tags_2.11:jar:2.2.1 from the
shaded jar.
2018-01-29T21:54:37.510 [INFO] Excluding org.apache.commons:commons-crypto:jar:1.0.0 from
the shaded jar.
2018-01-29T21:54:37.510 [INFO] Excluding org.spark-project.spark:unused:jar:1.0.0 from the
shaded jar.
2018-01-29T21:54:37.510 [INFO] Excluding org.apache.spark:spark-streaming_2.11:jar:2.2.1 from
the shaded jar.
2018-01-29T21:54:40.331 [INFO] Replacing original artifact with shaded artifact.
2018-01-29T21:54:40.652 [INFO] 
2018-01-29T21:54:40.652 [INFO] --- maven-assembly-plugin:3.0.0:single (source-release-assembly)
@ beam-sdks-java-javadoc ---
2018-01-29T21:54:40.656 [INFO] Skipping the assembly in this project because it's not the
Execution Root
2018-01-29T21:54:40.769 [INFO] 
2018-01-29T21:54:40.769 [INFO] --- maven-source-plugin:3.0.1:jar-no-fork (attach-sources)
@ beam-sdks-java-javadoc ---
2018-01-29T21:54:41.039 [INFO] 
2018-01-29T21:54:41.039 [INFO] --- maven-source-plugin:3.0.1:test-jar-no-fork (attach-test-sources)
@ beam-sdks-java-javadoc ---
2018-01-29T21:54:41.147 [INFO] 
2018-01-29T21:54:41.147 [INFO] --- maven-javadoc-plugin:3.0.0-M1:jar (attach-javadocs) @ beam-sdks-java-javadoc
---
2018-01-29T21:54:41.150 [INFO] Not executing Javadoc as the project is not a Java classpath-capable
package
2018-01-29T21:54:41.604 [INFO] 
2018-01-29T21:54:41.604 [INFO] --- reproducible-build-maven-plugin:0.4:strip-jar (default)
@ beam-sdks-java-javadoc ---
2018-01-29T21:54:41.605 [INFO] Stripping <https://builds.apache.org/job/beam_PostCommit_Java_MavenInstall/ws/src/sdks/java/javadoc/target/javadoc.jar>
2018-01-29T21:54:42.004 [INFO] 
2018-01-29T21:54:42.004 [INFO] --- maven-dependency-plugin:3.0.1:analyze-only (default) @
beam-sdks-java-javadoc ---
2018-01-29T21:54:42.005 [INFO] Skipping plugin execution
2018-01-29T21:54:42.113 [INFO] 
2018-01-29T21:54:42.113 [INFO] --- maven-install-plugin:2.5.2:install (default-install) @
beam-sdks-java-javadoc ---
2018-01-29T21:54:42.114 [INFO] Installing <https://builds.apache.org/job/beam_PostCommit_Java_MavenInstall/ws/src/sdks/java/javadoc/pom.xml>
to <https://builds.apache.org/job/beam_PostCommit_Java_MavenInstall/ws/.repository/org/apache/beam/beam-sdks-java-javadoc/2.4.0-SNAPSHOT/beam-sdks-java-javadoc-2.4.0-SNAPSHOT.pom>
2018-01-29T21:54:42.116 [INFO] Installing <https://builds.apache.org/job/beam_PostCommit_Java_MavenInstall/ws/src/sdks/java/javadoc/target/javadoc.jar>
to <https://builds.apache.org/job/beam_PostCommit_Java_MavenInstall/ws/.repository/org/apache/beam/beam-sdks-java-javadoc/2.4.0-SNAPSHOT/beam-sdks-java-javadoc-2.4.0-SNAPSHOT.jar>
[JENKINS] Archiving disabled
[JENKINS] Archiving disabled
[JENKINS] Archiving disabled
[JENKINS] Archiving disabled
[JENKINS] Archiving disabled
[JENKINS] Archiving disabled
[JENKINS] Archiving disabled
[JENKINS] Archiving disabled
[JENKINS] Archiving disabled
[JENKINS] Archiving disabled
[JENKINS] Archiving disabled
[JENKINS] Archiving disabled
[JENKINS] Archiving disabled
[JENKINS] Archiving disabled
[JENKINS] Archiving disabled
[JENKINS] Archiving disabled
[JENKINS] Archiving disabled
[JENKINS] Archiving disabled
[JENKINS] Archiving disabled
[JENKINS] Archiving disabled
[JENKINS] Archiving disabled
[JENKINS] Archiving disabled
[JENKINS] Archiving disabled
[JENKINS] Archiving disabled
[JENKINS] Archiving disabled
[JENKINS] Archiving disabled
[JENKINS] Archiving disabled
[JENKINS] Archiving disabled
[JENKINS] Archiving disabled
[JENKINS] Archiving disabled
[JENKINS] Archiving disabled
[JENKINS] Archiving disabled
[JENKINS] Archiving disabled
[JENKINS] Archiving disabled
[JENKINS] Archiving disabled
[JENKINS] Archiving disabled
[JENKINS] Archiving disabled
[JENKINS] Archiving disabled
[JENKINS] Archiving disabled
[JENKINS] Archiving disabled
[JENKINS] Archiving disabled
[JENKINS] Archiving disabled
[JENKINS] Archiving disabled
[JENKINS] Archiving disabled
[JENKINS] Archiving disabled
[JENKINS] Archiving disabled
[JENKINS] Archiving disabled
[JENKINS] Archiving disabled
[JENKINS] Archiving disabled
[JENKINS] Archiving disabled
[JENKINS] Archiving disabled
[JENKINS] Archiving disabled
[JENKINS] Archiving disabled
[JENKINS] Archiving disabled
[JENKINS] Archiving disabled
[JENKINS] Archiving disabled
[JENKINS] Archiving disabled
[JENKINS] Archiving disabled
[JENKINS] Archiving disabled
[JENKINS] Archiving disabled
[JENKINS] Archiving disabled
[JENKINS] Archiving disabled
[JENKINS] Archiving disabled
[JENKINS] Archiving disabled
2018-01-29T21:56:46.295 [INFO] ------------------------------------------------------------------------
2018-01-29T21:56:46.295 [INFO] Reactor Summary:
2018-01-29T21:56:46.295 [INFO] 
2018-01-29T21:56:46.296 [INFO] Apache Beam :: Parent .............................. SUCCESS
[ 34.054 s]
2018-01-29T21:56:46.296 [INFO] Apache Beam :: SDKs :: Java :: Build Tools ......... SUCCESS
[ 15.235 s]
2018-01-29T21:56:46.296 [INFO] Apache Beam :: Model ............................... SUCCESS
[  5.596 s]
2018-01-29T21:56:46.296 [INFO] Apache Beam :: Model :: Pipeline ................... SUCCESS
[ 31.212 s]
2018-01-29T21:56:46.296 [INFO] Apache Beam :: Model :: Job Management ............. SUCCESS
[ 18.434 s]
2018-01-29T21:56:46.296 [INFO] Apache Beam :: Model :: Fn Execution ............... SUCCESS
[ 26.126 s]
2018-01-29T21:56:46.296 [INFO] Apache Beam :: SDKs ................................ SUCCESS
[  5.637 s]
2018-01-29T21:56:46.296 [INFO] Apache Beam :: SDKs :: Java ........................ SUCCESS
[  5.118 s]
2018-01-29T21:56:46.296 [INFO] Apache Beam :: SDKs :: Java :: Core ................ SUCCESS
[03:52 min]
2018-01-29T21:56:46.296 [INFO] Apache Beam :: SDKs :: Java :: Fn Execution ........ SUCCESS
[ 37.348 s]
2018-01-29T21:56:46.296 [INFO] Apache Beam :: SDKs :: Java :: Extensions :: Google Cloud Platform
Core SUCCESS [ 33.773 s]
2018-01-29T21:56:46.296 [INFO] Apache Beam :: Runners ............................. SUCCESS
[  6.823 s]
2018-01-29T21:56:46.296 [INFO] Apache Beam :: Runners :: Core Construction Java ... SUCCESS
[ 35.576 s]
2018-01-29T21:56:46.296 [INFO] Apache Beam :: Runners :: Core Java ................ SUCCESS
[ 48.006 s]
2018-01-29T21:56:46.296 [INFO] Apache Beam :: SDKs :: Java :: Harness ............. SUCCESS
[ 46.401 s]
2018-01-29T21:56:46.296 [INFO] Apache Beam :: SDKs :: Java :: IO :: Amazon Web Services SUCCESS
[ 26.276 s]
2018-01-29T21:56:46.296 [INFO] Apache Beam :: Runners :: Local Java Core .......... SUCCESS
[ 16.186 s]
2018-01-29T21:56:46.296 [INFO] Apache Beam :: Runners :: Direct Java .............. SUCCESS
[04:54 min]
2018-01-29T21:56:46.296 [INFO] Apache Beam :: SDKs :: Java :: IO :: AMQP .......... SUCCESS
[ 34.288 s]
2018-01-29T21:56:46.296 [INFO] Apache Beam :: SDKs :: Java :: IO :: Common ........ SUCCESS
[ 10.295 s]
2018-01-29T21:56:46.296 [INFO] Apache Beam :: SDKs :: Java :: IO :: Cassandra ..... SUCCESS
[ 31.173 s]
2018-01-29T21:56:46.296 [INFO] Apache Beam :: SDKs :: Java :: IO :: Elasticsearch . SUCCESS
[ 19.059 s]
2018-01-29T21:56:46.296 [INFO] Apache Beam :: SDKs :: Java :: IO :: Elasticsearch-Tests SUCCESS
[  8.654 s]
2018-01-29T21:56:46.296 [INFO] Apache Beam :: SDKs :: Java :: IO :: Elasticsearch-Tests ::
Common SUCCESS [ 10.429 s]
2018-01-29T21:56:46.296 [INFO] Apache Beam :: SDKs :: Java :: IO :: Elasticsearch-Tests ::
2.x SUCCESS [ 30.813 s]
2018-01-29T21:56:46.296 [INFO] Apache Beam :: SDKs :: Java :: IO :: Elasticsearch-Tests ::
5.x SUCCESS [ 34.368 s]
2018-01-29T21:56:46.296 [INFO] Apache Beam :: SDKs :: Java :: Extensions :: Protobuf SUCCESS
[ 25.239 s]
2018-01-29T21:56:46.296 [INFO] Apache Beam :: SDKs :: Java :: IO :: Google Cloud Platform
SUCCESS [01:54 min]
2018-01-29T21:56:46.297 [INFO] Apache Beam :: Runners :: Google Cloud Dataflow .... SUCCESS
[07:49 min]
2018-01-29T21:56:46.297 [INFO] Apache Beam :: SDKs :: Java :: IO :: File-based-io-tests SUCCESS
[ 11.937 s]
2018-01-29T21:56:46.297 [INFO] Apache Beam :: SDKs :: Java :: IO :: Hadoop Common . SUCCESS
[ 25.595 s]
2018-01-29T21:56:46.297 [INFO] Apache Beam :: SDKs :: Java :: IO :: Hadoop File System SUCCESS
[ 45.148 s]
2018-01-29T21:56:46.297 [INFO] Apache Beam :: SDKs :: Java :: IO :: JDBC .......... SUCCESS
[ 46.863 s]
2018-01-29T21:56:46.297 [INFO] Apache Beam :: SDKs :: Java :: IO :: Hadoop Input Format SUCCESS
[01:32 min]
2018-01-29T21:56:46.297 [INFO] Apache Beam :: SDKs :: Java :: IO :: HBase ......... SUCCESS
[01:41 min]
2018-01-29T21:56:46.297 [INFO] Apache Beam :: SDKs :: Java :: IO :: HCatalog ...... SUCCESS
[01:23 min]
2018-01-29T21:56:46.297 [INFO] Apache Beam :: SDKs :: Java :: IO :: JMS ........... SUCCESS
[ 29.538 s]
2018-01-29T21:56:46.297 [INFO] Apache Beam :: SDKs :: Java :: IO :: Kafka ......... SUCCESS
[ 41.934 s]
2018-01-29T21:56:46.297 [INFO] Apache Beam :: SDKs :: Java :: IO :: Kinesis ....... SUCCESS
[ 40.193 s]
2018-01-29T21:56:46.297 [INFO] Apache Beam :: SDKs :: Java :: IO :: MongoDB ....... SUCCESS
[ 47.126 s]
2018-01-29T21:56:46.297 [INFO] Apache Beam :: SDKs :: Java :: IO :: MQTT .......... SUCCESS
[ 33.339 s]
2018-01-29T21:56:46.297 [INFO] Apache Beam :: SDKs :: Java :: IO :: Redis ......... SUCCESS
[ 28.428 s]
2018-01-29T21:56:46.297 [INFO] Apache Beam :: SDKs :: Java :: IO :: Solr .......... SUCCESS
[ 46.275 s]
2018-01-29T21:56:46.297 [INFO] Apache Beam :: SDKs :: Java :: IO :: Tika .......... SUCCESS
[ 35.454 s]
2018-01-29T21:56:46.297 [INFO] Apache Beam :: SDKs :: Java :: IO :: XML ........... SUCCESS
[ 40.245 s]
2018-01-29T21:56:46.297 [INFO] Apache Beam :: SDKs :: Java :: Java 8 Tests ........ SUCCESS
[ 22.289 s]
2018-01-29T21:56:46.297 [INFO] Apache Beam :: SDKs :: Java :: Maven Archetypes :: Starter
SUCCESS [ 20.159 s]
2018-01-29T21:56:46.297 [INFO] Apache Beam :: Examples :: Java .................... SUCCESS
[05:01 min]
2018-01-29T21:56:46.297 [INFO] Apache Beam :: SDKs :: Java :: Maven Archetypes :: Examples
FAILURE [ 16.994 s]
2018-01-29T21:56:46.297 [INFO] Apache Beam :: SDKs :: Java :: Extensions :: Jackson SUCCESS
[ 25.902 s]
2018-01-29T21:56:46.297 [INFO] Apache Beam :: SDKs :: Java :: Extensions :: Join library SUCCESS
[ 30.275 s]
2018-01-29T21:56:46.297 [INFO] Apache Beam :: SDKs :: Java :: Extensions :: Sketching SUCCESS
[ 37.691 s]
2018-01-29T21:56:46.297 [INFO] Apache Beam :: SDKs :: Java :: Extensions :: Sorter  SUCCESS
[01:34 min]
2018-01-29T21:56:46.297 [INFO] Apache Beam :: SDKs :: Java :: Extensions :: SQL ... SUCCESS
[02:06 min]
2018-01-29T21:56:46.297 [INFO] Apache Beam :: SDKs :: Java :: Nexmark ............. SUCCESS
[01:45 min]
2018-01-29T21:56:46.297 [INFO] Apache Beam :: Runners :: Java Fn Execution ........ SUCCESS
[ 23.700 s]
2018-01-29T21:56:46.297 [INFO] Apache Beam :: Runners :: Java Local Artifact Service SUCCESS
[ 19.657 s]
2018-01-29T21:56:46.297 [INFO] Apache Beam :: Runners :: Reference :: Java ........ SUCCESS
[ 18.394 s]
2018-01-29T21:56:46.297 [INFO] Apache Beam :: Runners :: Reference :: Job Orchestrator SUCCESS
[ 21.304 s]
2018-01-29T21:56:46.297 [INFO] Apache Beam :: Runners :: Flink .................... SUCCESS
[ 47.221 s]
2018-01-29T21:56:46.297 [INFO] Apache Beam :: Runners :: Gearpump ................. SUCCESS
[ 40.688 s]
2018-01-29T21:56:46.297 [INFO] Apache Beam :: Runners :: Spark .................... SUCCESS
[02:00 min]
2018-01-29T21:56:46.297 [INFO] Apache Beam :: Runners :: Apex ..................... SUCCESS
[01:14 min]
2018-01-29T21:56:46.297 [INFO] Apache Beam :: SDKs :: Java :: Aggregated Javadoc .. SUCCESS
[ 41.258 s]
2018-01-29T21:56:46.297 [INFO] ------------------------------------------------------------------------
2018-01-29T21:56:46.297 [INFO] BUILD FAILURE
2018-01-29T21:56:46.297 [INFO] ------------------------------------------------------------------------
2018-01-29T21:56:46.298 [INFO] Total time: 01:08 h
2018-01-29T21:56:46.298 [INFO] Finished at: 2018-01-29T21:56:46Z
[JENKINS] Archiving disabled
2018-01-29T21:56:47.404 [INFO] Final Memory: 393M/1520M
2018-01-29T21:56:47.404 [INFO] ------------------------------------------------------------------------
Waiting for Jenkins to finish collecting data
2018-01-29T21:56:51.740 [ERROR] Failed to execute goal org.apache.maven.plugins:maven-archetype-plugin:2.4:integration-test
(default-integration-test) on project beam-sdks-java-maven-archetypes-examples:
2018-01-29T21:56:51.740 [ERROR] Archetype IT 'basic' failed: Execution failure: exit code
= 1
2018-01-29T21:56:51.740 [ERROR] -> [Help 1]
2018-01-29T21:56:51.740 [ERROR] 
2018-01-29T21:56:51.740 [ERROR] To see the full stack trace of the errors, re-run Maven with
the -e switch.
2018-01-29T21:56:51.740 [ERROR] Re-run Maven using the -X switch to enable full debug logging.
2018-01-29T21:56:51.740 [ERROR] 
2018-01-29T21:56:51.740 [ERROR] For more information about the errors and possible solutions,
please read the following articles:
2018-01-29T21:56:51.741 [ERROR] [Help 1] http://cwiki.apache.org/confluence/display/MAVEN/MojoExecutionException
2018-01-29T21:56:51.741 [ERROR] 
2018-01-29T21:56:51.741 [ERROR] After correcting the problems, you can resume the build with
the command
2018-01-29T21:56:51.741 [ERROR]   mvn <goals> -rf :beam-sdks-java-maven-archetypes-examples
channel stopped

Mime
View raw message