beam-commits mailing list archives

Site index · List index
Message view « Date » · « Thread »
Top « Date » · « Thread »
From Apache Jenkins Server <jenk...@builds.apache.org>
Subject Build failed in Jenkins: beam_PostCommit_Java_MavenInstall #5819
Date Wed, 31 Jan 2018 05:01:29 GMT
See <https://builds.apache.org/job/beam_PostCommit_Java_MavenInstall/5819/display/redirect?page=changes>

Changes:

[kedin] [SQL] Refactor Variance

------------------------------------------
[...truncated 1.27 MB...]
2018-01-31T05:00:07.910 [INFO] Excluding com.google.inject:guice:jar:3.0 from the shaded jar.
2018-01-31T05:00:07.910 [INFO] Excluding javax.inject:javax.inject:jar:1 from the shaded jar.
2018-01-31T05:00:07.910 [INFO] Excluding aopalliance:aopalliance:jar:1.0 from the shaded jar.
2018-01-31T05:00:07.910 [INFO] Excluding com.sun.jersey:jersey-server:jar:1.9 from the shaded
jar.
2018-01-31T05:00:07.910 [INFO] Excluding asm:asm:jar:3.1 from the shaded jar.
2018-01-31T05:00:07.910 [INFO] Excluding com.sun.jersey.contribs:jersey-guice:jar:1.9 from
the shaded jar.
2018-01-31T05:00:07.910 [INFO] Excluding jline:jline:jar:2.11 from the shaded jar.
2018-01-31T05:00:07.910 [INFO] Excluding org.apache.ant:ant:jar:1.9.2 from the shaded jar.
2018-01-31T05:00:07.910 [INFO] Excluding org.apache.ant:ant-launcher:jar:1.9.2 from the shaded
jar.
2018-01-31T05:00:07.910 [INFO] Excluding net.engio:mbassador:jar:1.1.9 from the shaded jar.
2018-01-31T05:00:07.910 [INFO] Excluding net.lingala.zip4j:zip4j:jar:1.3.2 from the shaded
jar.
2018-01-31T05:00:07.910 [INFO] Excluding commons-codec:commons-codec:jar:1.10 from the shaded
jar.
2018-01-31T05:00:07.910 [INFO] Excluding org.apache.xbean:xbean-asm5-shaded:jar:4.3 from the
shaded jar.
2018-01-31T05:00:07.910 [INFO] Excluding org.jctools:jctools-core:jar:1.1 from the shaded
jar.
2018-01-31T05:00:07.910 [INFO] Excluding org.apache.beam:beam-model-pipeline:jar:2.4.0-SNAPSHOT
from the shaded jar.
2018-01-31T05:00:07.910 [INFO] Excluding com.google.protobuf:protobuf-java:jar:3.2.0 from
the shaded jar.
2018-01-31T05:00:07.910 [INFO] Excluding org.apache.beam:beam-sdks-java-core:jar:2.4.0-SNAPSHOT
from the shaded jar.
2018-01-31T05:00:07.910 [INFO] Including com.google.guava:guava:jar:20.0 in the shaded jar.
2018-01-31T05:00:07.910 [INFO] Excluding com.github.stephenc.findbugs:findbugs-annotations:jar:1.3.9-1
from the shaded jar.
2018-01-31T05:00:07.910 [INFO] Excluding com.fasterxml.jackson.core:jackson-core:jar:2.8.9
from the shaded jar.
2018-01-31T05:00:07.910 [INFO] Excluding com.fasterxml.jackson.core:jackson-annotations:jar:2.8.9
from the shaded jar.
2018-01-31T05:00:07.910 [INFO] Excluding com.fasterxml.jackson.core:jackson-databind:jar:2.8.9
from the shaded jar.
2018-01-31T05:00:07.910 [INFO] Excluding net.bytebuddy:byte-buddy:jar:1.6.8 from the shaded
jar.
2018-01-31T05:00:07.910 [INFO] Excluding org.apache.avro:avro:jar:1.8.2 from the shaded jar.
2018-01-31T05:00:07.910 [INFO] Excluding com.thoughtworks.paranamer:paranamer:jar:2.7 from
the shaded jar.
2018-01-31T05:00:07.910 [INFO] Excluding org.tukaani:xz:jar:1.5 from the shaded jar.
2018-01-31T05:00:07.910 [INFO] Excluding org.xerial.snappy:snappy-java:jar:1.1.4 from the
shaded jar.
2018-01-31T05:00:07.911 [INFO] Excluding org.apache.commons:commons-compress:jar:1.14 from
the shaded jar.
2018-01-31T05:00:07.911 [INFO] Excluding org.apache.beam:beam-runners-core-construction-java:jar:2.4.0-SNAPSHOT
from the shaded jar.
2018-01-31T05:00:07.911 [INFO] Excluding org.apache.beam:beam-model-job-management:jar:2.4.0-SNAPSHOT
from the shaded jar.
2018-01-31T05:00:07.911 [INFO] Excluding com.google.protobuf:protobuf-java-util:jar:3.2.0
from the shaded jar.
2018-01-31T05:00:07.911 [INFO] Excluding com.google.code.gson:gson:jar:2.7 from the shaded
jar.
2018-01-31T05:00:07.911 [INFO] Excluding io.grpc:grpc-core:jar:1.2.0 from the shaded jar.
2018-01-31T05:00:07.911 [INFO] Excluding com.google.errorprone:error_prone_annotations:jar:2.0.15
from the shaded jar.
2018-01-31T05:00:07.911 [INFO] Excluding io.grpc:grpc-context:jar:1.2.0 from the shaded jar.
2018-01-31T05:00:07.911 [INFO] Excluding com.google.instrumentation:instrumentation-api:jar:0.3.0
from the shaded jar.
2018-01-31T05:00:07.911 [INFO] Excluding io.grpc:grpc-stub:jar:1.2.0 from the shaded jar.
2018-01-31T05:00:07.911 [INFO] Excluding org.apache.beam:beam-runners-core-java:jar:2.4.0-SNAPSHOT
from the shaded jar.
2018-01-31T05:00:07.911 [INFO] Excluding org.apache.commons:commons-lang3:jar:3.6 from the
shaded jar.
2018-01-31T05:00:07.911 [INFO] Excluding com.google.code.findbugs:jsr305:jar:3.0.1 from the
shaded jar.
2018-01-31T05:00:07.911 [INFO] Excluding com.google.auto.service:auto-service:jar:1.0-rc2
from the shaded jar.
2018-01-31T05:00:07.911 [INFO] Excluding com.google.auto:auto-common:jar:0.3 from the shaded
jar.
2018-01-31T05:00:07.911 [INFO] Excluding io.grpc:grpc-protobuf:jar:1.2.0 from the shaded jar.
2018-01-31T05:00:07.911 [INFO] Excluding io.grpc:grpc-protobuf-lite:jar:1.2.0 from the shaded
jar.
2018-01-31T05:00:09.874 [INFO] Replacing original artifact with shaded artifact.
2018-01-31T05:00:09.874 [INFO] Replacing <https://builds.apache.org/job/beam_PostCommit_Java_MavenInstall/ws/src/runners/apex/target/beam-runners-apex-2.4.0-SNAPSHOT.jar>
with <https://builds.apache.org/job/beam_PostCommit_Java_MavenInstall/ws/src/runners/apex/target/beam-runners-apex-2.4.0-SNAPSHOT-shaded.jar>
2018-01-31T05:00:09.874 [INFO] Replacing original test artifact with shaded test artifact.
2018-01-31T05:00:09.874 [INFO] Replacing <https://builds.apache.org/job/beam_PostCommit_Java_MavenInstall/ws/src/runners/apex/target/beam-runners-apex-2.4.0-SNAPSHOT-tests.jar>
with <https://builds.apache.org/job/beam_PostCommit_Java_MavenInstall/ws/src/runners/apex/target/beam-runners-apex-2.4.0-SNAPSHOT-shaded-tests.jar>
2018-01-31T05:00:10.083 [INFO] 
2018-01-31T05:00:10.083 [INFO] --- maven-assembly-plugin:3.1.0:single (source-release-assembly)
@ beam-runners-apex ---
2018-01-31T05:00:10.087 [INFO] Skipping the assembly in this project because it's not the
Execution Root
2018-01-31T05:00:10.195 [INFO] 
2018-01-31T05:00:10.196 [INFO] --- maven-source-plugin:3.0.1:jar-no-fork (attach-sources)
@ beam-runners-apex ---
2018-01-31T05:00:10.199 [INFO] Building jar: <https://builds.apache.org/job/beam_PostCommit_Java_MavenInstall/ws/src/runners/apex/target/beam-runners-apex-2.4.0-SNAPSHOT-sources.jar>
2018-01-31T05:00:10.321 [INFO] 
2018-01-31T05:00:10.321 [INFO] --- maven-source-plugin:3.0.1:test-jar-no-fork (attach-test-sources)
@ beam-runners-apex ---
2018-01-31T05:00:10.324 [INFO] Building jar: <https://builds.apache.org/job/beam_PostCommit_Java_MavenInstall/ws/src/runners/apex/target/beam-runners-apex-2.4.0-SNAPSHOT-test-sources.jar>
2018-01-31T05:00:10.445 [INFO] 
2018-01-31T05:00:10.445 [INFO] --- maven-javadoc-plugin:3.0.0-M1:jar (attach-javadocs) @ beam-runners-apex
---
2018-01-31T05:00:13.147 [INFO] 
2 warnings
2018-01-31T05:00:13.147 [WARNING] Javadoc Warnings
2018-01-31T05:00:13.147 [WARNING] <https://builds.apache.org/job/beam_PostCommit_Java_MavenInstall/ws/src/runners/apex/src/main/java/org/apache/beam/runners/apex/translation/utils/StateInternalsProxy.java>:33:
warning: no description for @param
2018-01-31T05:00:13.148 [WARNING] * @param <K>
2018-01-31T05:00:13.148 [WARNING] ^
2018-01-31T05:00:13.148 [WARNING] <https://builds.apache.org/job/beam_PostCommit_Java_MavenInstall/ws/src/runners/apex/src/main/java/org/apache/beam/runners/apex/translation/operators/ApexTimerInternals.java>:48:
warning: no description for @param
2018-01-31T05:00:13.148 [WARNING] * @param <K>
2018-01-31T05:00:13.148 [WARNING] ^
2018-01-31T05:00:13.154 [INFO] Building jar: <https://builds.apache.org/job/beam_PostCommit_Java_MavenInstall/ws/src/runners/apex/target/beam-runners-apex-2.4.0-SNAPSHOT-javadoc.jar>
2018-01-31T05:00:13.358 [INFO] 
2018-01-31T05:00:13.358 [INFO] --- reproducible-build-maven-plugin:0.4:strip-jar (default)
@ beam-runners-apex ---
2018-01-31T05:00:13.359 [INFO] Stripping <https://builds.apache.org/job/beam_PostCommit_Java_MavenInstall/ws/src/runners/apex/target/beam-runners-apex-2.4.0-SNAPSHOT-test-sources.jar>
2018-01-31T05:00:13.361 [INFO] Stripping <https://builds.apache.org/job/beam_PostCommit_Java_MavenInstall/ws/src/runners/apex/target/original-beam-runners-apex-2.4.0-SNAPSHOT-tests.jar>
2018-01-31T05:00:13.364 [INFO] Stripping <https://builds.apache.org/job/beam_PostCommit_Java_MavenInstall/ws/src/runners/apex/target/original-beam-runners-apex-2.4.0-SNAPSHOT.jar>
2018-01-31T05:00:13.370 [INFO] Stripping <https://builds.apache.org/job/beam_PostCommit_Java_MavenInstall/ws/src/runners/apex/target/beam-runners-apex-2.4.0-SNAPSHOT-javadoc.jar>
2018-01-31T05:00:13.374 [INFO] Stripping <https://builds.apache.org/job/beam_PostCommit_Java_MavenInstall/ws/src/runners/apex/target/beam-runners-apex-2.4.0-SNAPSHOT-sources.jar>
2018-01-31T05:00:13.377 [INFO] Stripping <https://builds.apache.org/job/beam_PostCommit_Java_MavenInstall/ws/src/runners/apex/target/beam-runners-apex-2.4.0-SNAPSHOT.jar>
2018-01-31T05:00:13.452 [INFO] Stripping <https://builds.apache.org/job/beam_PostCommit_Java_MavenInstall/ws/src/runners/apex/target/beam-runners-apex-2.4.0-SNAPSHOT-tests.jar>
2018-01-31T05:00:13.564 [INFO] 
2018-01-31T05:00:13.564 [INFO] --- maven-surefire-plugin:2.20.1:test (validates-runner-tests)
@ beam-runners-apex ---
2018-01-31T05:00:13.569 [INFO] Tests are skipped.
2018-01-31T05:00:13.676 [INFO] 
2018-01-31T05:00:13.676 [INFO] --- maven-dependency-plugin:3.0.2:analyze-only (default) @
beam-runners-apex ---
2018-01-31T05:00:13.793 [INFO] No dependency problems found
2018-01-31T05:00:13.902 [INFO] 
2018-01-31T05:00:13.902 [INFO] --- maven-install-plugin:2.5.2:install (default-install) @
beam-runners-apex ---
2018-01-31T05:00:13.904 [INFO] Installing <https://builds.apache.org/job/beam_PostCommit_Java_MavenInstall/ws/src/runners/apex/target/beam-runners-apex-2.4.0-SNAPSHOT.jar>
to <https://builds.apache.org/job/beam_PostCommit_Java_MavenInstall/ws/.repository/org/apache/beam/beam-runners-apex/2.4.0-SNAPSHOT/beam-runners-apex-2.4.0-SNAPSHOT.jar>
2018-01-31T05:00:13.938 [INFO] Installing <https://builds.apache.org/job/beam_PostCommit_Java_MavenInstall/ws/src/runners/apex/pom.xml>
to <https://builds.apache.org/job/beam_PostCommit_Java_MavenInstall/ws/.repository/org/apache/beam/beam-runners-apex/2.4.0-SNAPSHOT/beam-runners-apex-2.4.0-SNAPSHOT.pom>
2018-01-31T05:00:13.977 [INFO] Installing <https://builds.apache.org/job/beam_PostCommit_Java_MavenInstall/ws/src/runners/apex/target/beam-runners-apex-2.4.0-SNAPSHOT-tests.jar>
to <https://builds.apache.org/job/beam_PostCommit_Java_MavenInstall/ws/.repository/org/apache/beam/beam-runners-apex/2.4.0-SNAPSHOT/beam-runners-apex-2.4.0-SNAPSHOT-tests.jar>
2018-01-31T05:00:13.979 [INFO] Installing <https://builds.apache.org/job/beam_PostCommit_Java_MavenInstall/ws/src/runners/apex/target/beam-runners-apex-2.4.0-SNAPSHOT-tests.jar>
to <https://builds.apache.org/job/beam_PostCommit_Java_MavenInstall/ws/.repository/org/apache/beam/beam-runners-apex/2.4.0-SNAPSHOT/beam-runners-apex-2.4.0-SNAPSHOT-tests.jar>
2018-01-31T05:00:13.980 [INFO] Installing <https://builds.apache.org/job/beam_PostCommit_Java_MavenInstall/ws/src/runners/apex/target/beam-runners-apex-2.4.0-SNAPSHOT-sources.jar>
to <https://builds.apache.org/job/beam_PostCommit_Java_MavenInstall/ws/.repository/org/apache/beam/beam-runners-apex/2.4.0-SNAPSHOT/beam-runners-apex-2.4.0-SNAPSHOT-sources.jar>
2018-01-31T05:00:13.981 [INFO] Installing <https://builds.apache.org/job/beam_PostCommit_Java_MavenInstall/ws/src/runners/apex/target/beam-runners-apex-2.4.0-SNAPSHOT-test-sources.jar>
to <https://builds.apache.org/job/beam_PostCommit_Java_MavenInstall/ws/.repository/org/apache/beam/beam-runners-apex/2.4.0-SNAPSHOT/beam-runners-apex-2.4.0-SNAPSHOT-test-sources.jar>
2018-01-31T05:00:13.982 [INFO] Installing <https://builds.apache.org/job/beam_PostCommit_Java_MavenInstall/ws/src/runners/apex/target/beam-runners-apex-2.4.0-SNAPSHOT-javadoc.jar>
to <https://builds.apache.org/job/beam_PostCommit_Java_MavenInstall/ws/.repository/org/apache/beam/beam-runners-apex/2.4.0-SNAPSHOT/beam-runners-apex-2.4.0-SNAPSHOT-javadoc.jar>
[JENKINS] Archiving disabled
2018-01-31T05:00:15.712 [INFO] 
2018-01-31T05:00:15.713 [INFO] ------------------------------------------------------------------------
2018-01-31T05:00:15.713 [INFO] Skipping Apache Beam :: SDKs :: Java :: Aggregated Javadoc
2018-01-31T05:00:15.713 [INFO] This project has been banned from the build due to previous
failures.
2018-01-31T05:00:15.713 [INFO] ------------------------------------------------------------------------
[JENKINS] Archiving disabled
[JENKINS] Archiving disabled
[JENKINS] Archiving disabled
[JENKINS] Archiving disabled
[JENKINS] Archiving disabled
[JENKINS] Archiving disabled
[JENKINS] Archiving disabled
[JENKINS] Archiving disabled
[JENKINS] Archiving disabled
[JENKINS] Archiving disabled
[JENKINS] Archiving disabled
[JENKINS] Archiving disabled
[JENKINS] Archiving disabled
[JENKINS] Archiving disabled
[JENKINS] Archiving disabled
[JENKINS] Archiving disabled
[JENKINS] Archiving disabled
[JENKINS] Archiving disabled
[JENKINS] Archiving disabled
[JENKINS] Archiving disabled
[JENKINS] Archiving disabled
[JENKINS] Archiving disabled
[JENKINS] Archiving disabled
[JENKINS] Archiving disabled
[JENKINS] Archiving disabled
[JENKINS] Archiving disabled
[JENKINS] Archiving disabled
[JENKINS] Archiving disabled
[JENKINS] Archiving disabled
[JENKINS] Archiving disabled
[JENKINS] Archiving disabled
[JENKINS] Archiving disabled
[JENKINS] Archiving disabled
[JENKINS] Archiving disabled
[JENKINS] Archiving disabled
[JENKINS] Archiving disabled
[JENKINS] Archiving disabled
[JENKINS] Archiving disabled
[JENKINS] Archiving disabled
[JENKINS] Archiving disabled
[JENKINS] Archiving disabled
[JENKINS] Archiving disabled
[JENKINS] Archiving disabled
[JENKINS] Archiving disabled
[JENKINS] Archiving disabled
[JENKINS] Archiving disabled
[JENKINS] Archiving disabled
[JENKINS] Archiving disabled
[JENKINS] Archiving disabled
[JENKINS] Archiving disabled
[JENKINS] Archiving disabled
[JENKINS] Archiving disabled
[JENKINS] Archiving disabled
[JENKINS] Archiving disabled
[JENKINS] Archiving disabled
[JENKINS] Archiving disabled
[JENKINS] Archiving disabled
[JENKINS] Archiving disabled
[JENKINS] Archiving disabled
[JENKINS] Archiving disabled
[JENKINS] Archiving disabled
[JENKINS] Archiving disabled
[JENKINS] Archiving disabled
[JENKINS] Archiving disabled
2018-01-31T05:01:17.019 [INFO] ------------------------------------------------------------------------
2018-01-31T05:01:17.019 [INFO] Reactor Summary:
2018-01-31T05:01:17.019 [INFO] 
2018-01-31T05:01:17.019 [INFO] Apache Beam :: Parent .............................. SUCCESS
[ 30.765 s]
2018-01-31T05:01:17.019 [INFO] Apache Beam :: SDKs :: Java :: Build Tools ......... SUCCESS
[ 13.824 s]
2018-01-31T05:01:17.019 [INFO] Apache Beam :: Model ............................... SUCCESS
[  2.552 s]
2018-01-31T05:01:17.019 [INFO] Apache Beam :: Model :: Pipeline ................... SUCCESS
[ 25.219 s]
2018-01-31T05:01:17.019 [INFO] Apache Beam :: Model :: Job Management ............. SUCCESS
[ 13.866 s]
2018-01-31T05:01:17.019 [INFO] Apache Beam :: Model :: Fn Execution ............... SUCCESS
[ 17.555 s]
2018-01-31T05:01:17.019 [INFO] Apache Beam :: SDKs ................................ SUCCESS
[  3.548 s]
2018-01-31T05:01:17.019 [INFO] Apache Beam :: SDKs :: Java ........................ SUCCESS
[  3.343 s]
2018-01-31T05:01:17.019 [INFO] Apache Beam :: SDKs :: Java :: Core ................ SUCCESS
[02:51 min]
2018-01-31T05:01:17.019 [INFO] Apache Beam :: SDKs :: Java :: Fn Execution ........ SUCCESS
[ 32.047 s]
2018-01-31T05:01:17.019 [INFO] Apache Beam :: SDKs :: Java :: Extensions :: Google Cloud Platform
Core SUCCESS [ 27.559 s]
2018-01-31T05:01:17.019 [INFO] Apache Beam :: Runners ............................. SUCCESS
[  3.806 s]
2018-01-31T05:01:17.019 [INFO] Apache Beam :: Runners :: Core Construction Java ... SUCCESS
[ 30.064 s]
2018-01-31T05:01:17.019 [INFO] Apache Beam :: Runners :: Core Java ................ SUCCESS
[ 41.812 s]
2018-01-31T05:01:17.019 [INFO] Apache Beam :: SDKs :: Java :: Harness ............. SUCCESS
[ 36.060 s]
2018-01-31T05:01:17.019 [INFO] Apache Beam :: SDKs :: Java :: IO :: Amazon Web Services SUCCESS
[ 20.990 s]
2018-01-31T05:01:17.019 [INFO] Apache Beam :: Runners :: Local Java Core .......... SUCCESS
[ 11.888 s]
2018-01-31T05:01:17.019 [INFO] Apache Beam :: Runners :: Direct Java .............. SUCCESS
[04:41 min]
2018-01-31T05:01:17.020 [INFO] Apache Beam :: SDKs :: Java :: IO :: AMQP .......... SUCCESS
[ 24.654 s]
2018-01-31T05:01:17.020 [INFO] Apache Beam :: SDKs :: Java :: IO :: Common ........ SUCCESS
[  7.722 s]
2018-01-31T05:01:17.020 [INFO] Apache Beam :: SDKs :: Java :: IO :: Cassandra ..... SUCCESS
[ 23.663 s]
2018-01-31T05:01:17.020 [INFO] Apache Beam :: SDKs :: Java :: IO :: Elasticsearch . SUCCESS
[ 14.028 s]
2018-01-31T05:01:17.020 [INFO] Apache Beam :: SDKs :: Java :: IO :: Elasticsearch-Tests SUCCESS
[  4.984 s]
2018-01-31T05:01:17.020 [INFO] Apache Beam :: SDKs :: Java :: IO :: Elasticsearch-Tests ::
Common SUCCESS [  4.949 s]
2018-01-31T05:01:17.020 [INFO] Apache Beam :: SDKs :: Java :: IO :: Elasticsearch-Tests ::
2.x SUCCESS [ 26.404 s]
2018-01-31T05:01:17.020 [INFO] Apache Beam :: SDKs :: Java :: IO :: Elasticsearch-Tests ::
5.x SUCCESS [ 28.115 s]
2018-01-31T05:01:17.020 [INFO] Apache Beam :: SDKs :: Java :: Extensions :: Protobuf SUCCESS
[ 19.994 s]
2018-01-31T05:01:17.020 [INFO] Apache Beam :: SDKs :: Java :: IO :: Google Cloud Platform
SUCCESS [01:41 min]
2018-01-31T05:01:17.020 [INFO] Apache Beam :: Runners :: Google Cloud Dataflow .... SUCCESS
[07:31 min]
2018-01-31T05:01:17.020 [INFO] Apache Beam :: SDKs :: Java :: IO :: File-based-io-tests SUCCESS
[  8.688 s]
2018-01-31T05:01:17.020 [INFO] Apache Beam :: SDKs :: Java :: IO :: Hadoop Common . SUCCESS
[ 21.942 s]
2018-01-31T05:01:17.020 [INFO] Apache Beam :: SDKs :: Java :: IO :: Hadoop File System SUCCESS
[ 42.370 s]
2018-01-31T05:01:17.020 [INFO] Apache Beam :: SDKs :: Java :: IO :: JDBC .......... SUCCESS
[ 44.266 s]
2018-01-31T05:01:17.020 [INFO] Apache Beam :: SDKs :: Java :: IO :: Hadoop Input Format SUCCESS
[01:23 min]
2018-01-31T05:01:17.020 [INFO] Apache Beam :: SDKs :: Java :: IO :: HBase ......... SUCCESS
[01:40 min]
2018-01-31T05:01:17.020 [INFO] Apache Beam :: SDKs :: Java :: IO :: HCatalog ...... SUCCESS
[01:03 min]
2018-01-31T05:01:17.020 [INFO] Apache Beam :: SDKs :: Java :: IO :: JMS ........... SUCCESS
[ 26.615 s]
2018-01-31T05:01:17.020 [INFO] Apache Beam :: SDKs :: Java :: IO :: Kafka ......... SUCCESS
[ 36.473 s]
2018-01-31T05:01:17.020 [INFO] Apache Beam :: SDKs :: Java :: IO :: Kinesis ....... SUCCESS
[ 49.322 s]
2018-01-31T05:01:17.020 [INFO] Apache Beam :: SDKs :: Java :: IO :: MongoDB ....... SUCCESS
[ 40.799 s]
2018-01-31T05:01:17.020 [INFO] Apache Beam :: SDKs :: Java :: IO :: MQTT .......... SUCCESS
[ 28.752 s]
2018-01-31T05:01:17.020 [INFO] Apache Beam :: SDKs :: Java :: IO :: Redis ......... SUCCESS
[ 23.363 s]
2018-01-31T05:01:17.020 [INFO] Apache Beam :: SDKs :: Java :: IO :: Solr .......... SUCCESS
[ 39.985 s]
2018-01-31T05:01:17.020 [INFO] Apache Beam :: SDKs :: Java :: IO :: Tika .......... SUCCESS
[ 29.879 s]
2018-01-31T05:01:17.020 [INFO] Apache Beam :: SDKs :: Java :: IO :: XML ........... SUCCESS
[ 27.928 s]
2018-01-31T05:01:17.020 [INFO] Apache Beam :: SDKs :: Java :: Java 8 Tests ........ SUCCESS
[ 17.311 s]
2018-01-31T05:01:17.020 [INFO] Apache Beam :: SDKs :: Java :: Maven Archetypes :: Starter
SUCCESS [ 15.851 s]
2018-01-31T05:01:17.020 [INFO] Apache Beam :: Examples :: Java .................... SUCCESS
[08:15 min]
2018-01-31T05:01:17.020 [INFO] Apache Beam :: SDKs :: Java :: Maven Archetypes :: Examples
SUCCESS [ 29.920 s]
2018-01-31T05:01:17.020 [INFO] Apache Beam :: SDKs :: Java :: Extensions :: Jackson SUCCESS
[ 16.132 s]
2018-01-31T05:01:17.020 [INFO] Apache Beam :: SDKs :: Java :: Extensions :: Join library SUCCESS
[ 21.062 s]
2018-01-31T05:01:17.020 [INFO] Apache Beam :: SDKs :: Java :: Extensions :: Sketching SUCCESS
[ 23.760 s]
2018-01-31T05:01:17.020 [INFO] Apache Beam :: SDKs :: Java :: Extensions :: Sorter  SUCCESS
[ 32.423 s]
2018-01-31T05:01:17.020 [INFO] Apache Beam :: SDKs :: Java :: Extensions :: SQL ... FAILURE
[01:20 min]
2018-01-31T05:01:17.020 [INFO] Apache Beam :: SDKs :: Java :: Nexmark ............. SKIPPED
2018-01-31T05:01:17.020 [INFO] Apache Beam :: Runners :: Java Fn Execution ........ SUCCESS
[ 21.713 s]
2018-01-31T05:01:17.020 [INFO] Apache Beam :: Runners :: Java Local Artifact Service SUCCESS
[ 16.046 s]
2018-01-31T05:01:17.020 [INFO] Apache Beam :: Runners :: Reference :: Java ........ SUCCESS
[ 12.562 s]
2018-01-31T05:01:17.020 [INFO] Apache Beam :: Runners :: Reference :: Job Orchestrator SUCCESS
[ 17.439 s]
2018-01-31T05:01:17.020 [INFO] Apache Beam :: Runners :: Flink .................... SUCCESS
[ 41.655 s]
2018-01-31T05:01:17.020 [INFO] Apache Beam :: Runners :: Gearpump ................. SUCCESS
[ 28.838 s]
2018-01-31T05:01:17.020 [INFO] Apache Beam :: Runners :: Spark .................... SUCCESS
[01:52 min]
2018-01-31T05:01:17.020 [INFO] Apache Beam :: Runners :: Apex ..................... SUCCESS
[01:09 min]
2018-01-31T05:01:17.020 [INFO] Apache Beam :: SDKs :: Java :: Aggregated Javadoc .. SKIPPED
2018-01-31T05:01:17.020 [INFO] ------------------------------------------------------------------------
2018-01-31T05:01:17.020 [INFO] BUILD FAILURE
2018-01-31T05:01:17.020 [INFO] ------------------------------------------------------------------------
2018-01-31T05:01:17.021 [INFO] Total time: 56:00 min
2018-01-31T05:01:17.021 [INFO] Finished at: 2018-01-31T05:01:17Z
2018-01-31T05:01:18.186 [INFO] Final Memory: 404M/1942M
2018-01-31T05:01:18.186 [INFO] ------------------------------------------------------------------------
2018-01-31T05:01:18.199 [ERROR] Failed to execute goal org.apache.maven.plugins:maven-dependency-plugin:3.0.2:analyze-only
(default) on project beam-sdks-java-extensions-sql: Dependency problems found -> [Help
1]
2018-01-31T05:01:18.199 [ERROR] 
2018-01-31T05:01:18.199 [ERROR] To see the full stack trace of the errors, re-run Maven with
the -e switch.
2018-01-31T05:01:18.200 [ERROR] Re-run Maven using the -X switch to enable full debug logging.
2018-01-31T05:01:18.200 [ERROR] 
2018-01-31T05:01:18.200 [ERROR] For more information about the errors and possible solutions,
please read the following articles:
2018-01-31T05:01:18.200 [ERROR] [Help 1] http://cwiki.apache.org/confluence/display/MAVEN/MojoExecutionException
2018-01-31T05:01:18.200 [ERROR] 
2018-01-31T05:01:18.200 [ERROR] After correcting the problems, you can resume the build with
the command
2018-01-31T05:01:18.200 [ERROR]   mvn <goals> -rf :beam-sdks-java-extensions-sql
channel stopped
Not sending mail to unregistered user kedin@google.com

Mime
View raw message