beam-commits mailing list archives

Site index · List index
Message view « Date » · « Thread »
Top « Date » · « Thread »
From Apache Jenkins Server <jenk...@builds.apache.org>
Subject Build failed in Jenkins: beam_PostCommit_Java_MavenInstall #6087
Date Thu, 01 Mar 2018 01:05:50 GMT
See <https://builds.apache.org/job/beam_PostCommit_Java_MavenInstall/6087/display/redirect>

------------------------------------------
[...truncated 1.08 MB...]
2018-03-01T01:04:21.648 [INFO] Excluding com.google.inject:guice:jar:3.0 from the shaded jar.
2018-03-01T01:04:21.648 [INFO] Excluding javax.inject:javax.inject:jar:1 from the shaded jar.
2018-03-01T01:04:21.648 [INFO] Excluding aopalliance:aopalliance:jar:1.0 from the shaded jar.
2018-03-01T01:04:21.648 [INFO] Excluding com.sun.jersey:jersey-server:jar:1.9 from the shaded
jar.
2018-03-01T01:04:21.648 [INFO] Excluding asm:asm:jar:3.1 from the shaded jar.
2018-03-01T01:04:21.648 [INFO] Excluding com.sun.jersey.contribs:jersey-guice:jar:1.9 from
the shaded jar.
2018-03-01T01:04:21.648 [INFO] Excluding jline:jline:jar:2.11 from the shaded jar.
2018-03-01T01:04:21.648 [INFO] Excluding org.apache.ant:ant:jar:1.9.2 from the shaded jar.
2018-03-01T01:04:21.648 [INFO] Excluding org.apache.ant:ant-launcher:jar:1.9.2 from the shaded
jar.
2018-03-01T01:04:21.648 [INFO] Excluding net.engio:mbassador:jar:1.1.9 from the shaded jar.
2018-03-01T01:04:21.648 [INFO] Excluding net.lingala.zip4j:zip4j:jar:1.3.2 from the shaded
jar.
2018-03-01T01:04:21.648 [INFO] Excluding commons-codec:commons-codec:jar:1.10 from the shaded
jar.
2018-03-01T01:04:21.648 [INFO] Excluding org.apache.xbean:xbean-asm5-shaded:jar:4.3 from the
shaded jar.
2018-03-01T01:04:21.648 [INFO] Excluding org.jctools:jctools-core:jar:1.1 from the shaded
jar.
2018-03-01T01:04:21.648 [INFO] Excluding org.apache.beam:beam-model-pipeline:jar:2.4.0-SNAPSHOT
from the shaded jar.
2018-03-01T01:04:21.648 [INFO] Excluding com.google.protobuf:protobuf-java:jar:3.2.0 from
the shaded jar.
2018-03-01T01:04:21.648 [INFO] Excluding org.apache.beam:beam-sdks-java-core:jar:2.4.0-SNAPSHOT
from the shaded jar.
2018-03-01T01:04:21.648 [INFO] Including com.google.guava:guava:jar:20.0 in the shaded jar.
2018-03-01T01:04:21.648 [INFO] Excluding com.github.stephenc.findbugs:findbugs-annotations:jar:1.3.9-1
from the shaded jar.
2018-03-01T01:04:21.648 [INFO] Excluding com.fasterxml.jackson.core:jackson-core:jar:2.8.9
from the shaded jar.
2018-03-01T01:04:21.648 [INFO] Excluding com.fasterxml.jackson.core:jackson-annotations:jar:2.8.9
from the shaded jar.
2018-03-01T01:04:21.648 [INFO] Excluding com.fasterxml.jackson.core:jackson-databind:jar:2.8.9
from the shaded jar.
2018-03-01T01:04:21.648 [INFO] Excluding net.bytebuddy:byte-buddy:jar:1.7.10 from the shaded
jar.
2018-03-01T01:04:21.648 [INFO] Excluding org.apache.avro:avro:jar:1.8.2 from the shaded jar.
2018-03-01T01:04:21.648 [INFO] Excluding com.thoughtworks.paranamer:paranamer:jar:2.7 from
the shaded jar.
2018-03-01T01:04:21.648 [INFO] Excluding org.tukaani:xz:jar:1.5 from the shaded jar.
2018-03-01T01:04:21.648 [INFO] Excluding org.xerial.snappy:snappy-java:jar:1.1.4 from the
shaded jar.
2018-03-01T01:04:21.648 [INFO] Excluding org.apache.commons:commons-compress:jar:1.14 from
the shaded jar.
2018-03-01T01:04:21.648 [INFO] Excluding org.apache.beam:beam-runners-core-construction-java:jar:2.4.0-SNAPSHOT
from the shaded jar.
2018-03-01T01:04:21.648 [INFO] Excluding org.apache.beam:beam-model-job-management:jar:2.4.0-SNAPSHOT
from the shaded jar.
2018-03-01T01:04:21.648 [INFO] Excluding com.google.protobuf:protobuf-java-util:jar:3.2.0
from the shaded jar.
2018-03-01T01:04:21.648 [INFO] Excluding com.google.code.gson:gson:jar:2.7 from the shaded
jar.
2018-03-01T01:04:21.648 [INFO] Excluding io.grpc:grpc-core:jar:1.2.0 from the shaded jar.
2018-03-01T01:04:21.648 [INFO] Excluding com.google.errorprone:error_prone_annotations:jar:2.0.15
from the shaded jar.
2018-03-01T01:04:21.648 [INFO] Excluding io.grpc:grpc-context:jar:1.2.0 from the shaded jar.
2018-03-01T01:04:21.648 [INFO] Excluding com.google.instrumentation:instrumentation-api:jar:0.3.0
from the shaded jar.
2018-03-01T01:04:21.648 [INFO] Excluding io.grpc:grpc-stub:jar:1.2.0 from the shaded jar.
2018-03-01T01:04:21.648 [INFO] Excluding org.apache.beam:beam-runners-core-java:jar:2.4.0-SNAPSHOT
from the shaded jar.
2018-03-01T01:04:21.648 [INFO] Excluding org.apache.beam:beam-model-fn-execution:jar:2.4.0-SNAPSHOT
from the shaded jar.
2018-03-01T01:04:21.648 [INFO] Excluding org.apache.commons:commons-lang3:jar:3.6 from the
shaded jar.
2018-03-01T01:04:21.648 [INFO] Excluding com.google.code.findbugs:jsr305:jar:3.0.1 from the
shaded jar.
2018-03-01T01:04:21.648 [INFO] Excluding org.objenesis:objenesis:jar:1.0 from the shaded jar.
2018-03-01T01:04:21.648 [INFO] Excluding com.google.auto.service:auto-service:jar:1.0-rc2
from the shaded jar.
2018-03-01T01:04:21.648 [INFO] Excluding com.google.auto:auto-common:jar:0.3 from the shaded
jar.
2018-03-01T01:04:21.648 [INFO] Excluding io.grpc:grpc-protobuf:jar:1.2.0 from the shaded jar.
2018-03-01T01:04:21.648 [INFO] Excluding io.grpc:grpc-protobuf-lite:jar:1.2.0 from the shaded
jar.
2018-03-01T01:04:23.616 [INFO] Replacing original artifact with shaded artifact.
2018-03-01T01:04:23.616 [INFO] Replacing <https://builds.apache.org/job/beam_PostCommit_Java_MavenInstall/ws/src/runners/apex/target/beam-runners-apex-2.4.0-SNAPSHOT.jar>
with <https://builds.apache.org/job/beam_PostCommit_Java_MavenInstall/ws/src/runners/apex/target/beam-runners-apex-2.4.0-SNAPSHOT-shaded.jar>
2018-03-01T01:04:23.616 [INFO] Replacing original test artifact with shaded test artifact.
2018-03-01T01:04:23.616 [INFO] Replacing <https://builds.apache.org/job/beam_PostCommit_Java_MavenInstall/ws/src/runners/apex/target/beam-runners-apex-2.4.0-SNAPSHOT-tests.jar>
with <https://builds.apache.org/job/beam_PostCommit_Java_MavenInstall/ws/src/runners/apex/target/beam-runners-apex-2.4.0-SNAPSHOT-shaded-tests.jar>
2018-03-01T01:04:23.726 [INFO] 
2018-03-01T01:04:23.726 [INFO] --- maven-assembly-plugin:3.1.0:single (source-release-assembly)
@ beam-runners-apex ---
2018-03-01T01:04:23.728 [INFO] Skipping the assembly in this project because it's not the
Execution Root
2018-03-01T01:04:23.836 [INFO] 
2018-03-01T01:04:23.836 [INFO] --- maven-source-plugin:3.0.1:jar-no-fork (attach-sources)
@ beam-runners-apex ---
2018-03-01T01:04:23.839 [INFO] Building jar: <https://builds.apache.org/job/beam_PostCommit_Java_MavenInstall/ws/src/runners/apex/target/beam-runners-apex-2.4.0-SNAPSHOT-sources.jar>
2018-03-01T01:04:23.961 [INFO] 
2018-03-01T01:04:23.961 [INFO] --- maven-source-plugin:3.0.1:test-jar-no-fork (attach-test-sources)
@ beam-runners-apex ---
2018-03-01T01:04:23.965 [INFO] Building jar: <https://builds.apache.org/job/beam_PostCommit_Java_MavenInstall/ws/src/runners/apex/target/beam-runners-apex-2.4.0-SNAPSHOT-test-sources.jar>
2018-03-01T01:04:24.088 [INFO] 
2018-03-01T01:04:24.088 [INFO] --- maven-javadoc-plugin:3.0.0-M1:jar (attach-javadocs) @ beam-runners-apex
---
2018-03-01T01:04:28.186 [INFO] 
2 warnings
2018-03-01T01:04:28.187 [WARNING] Javadoc Warnings
2018-03-01T01:04:28.187 [WARNING] <https://builds.apache.org/job/beam_PostCommit_Java_MavenInstall/ws/src/runners/apex/src/main/java/org/apache/beam/runners/apex/translation/utils/StateInternalsProxy.java>:33:
warning: no description for @param
2018-03-01T01:04:28.187 [WARNING] * @param <K>
2018-03-01T01:04:28.187 [WARNING] ^
2018-03-01T01:04:28.187 [WARNING] <https://builds.apache.org/job/beam_PostCommit_Java_MavenInstall/ws/src/runners/apex/src/main/java/org/apache/beam/runners/apex/translation/operators/ApexTimerInternals.java>:48:
warning: no description for @param
2018-03-01T01:04:28.187 [WARNING] * @param <K>
2018-03-01T01:04:28.187 [WARNING] ^
2018-03-01T01:04:28.199 [INFO] Building jar: <https://builds.apache.org/job/beam_PostCommit_Java_MavenInstall/ws/src/runners/apex/target/beam-runners-apex-2.4.0-SNAPSHOT-javadoc.jar>
2018-03-01T01:04:28.378 [INFO] 
2018-03-01T01:04:28.378 [INFO] --- reproducible-build-maven-plugin:0.4:strip-jar (default)
@ beam-runners-apex ---
2018-03-01T01:04:28.379 [INFO] Stripping <https://builds.apache.org/job/beam_PostCommit_Java_MavenInstall/ws/src/runners/apex/target/beam-runners-apex-2.4.0-SNAPSHOT-test-sources.jar>
2018-03-01T01:04:28.381 [INFO] Stripping <https://builds.apache.org/job/beam_PostCommit_Java_MavenInstall/ws/src/runners/apex/target/original-beam-runners-apex-2.4.0-SNAPSHOT-tests.jar>
2018-03-01T01:04:28.384 [INFO] Stripping <https://builds.apache.org/job/beam_PostCommit_Java_MavenInstall/ws/src/runners/apex/target/original-beam-runners-apex-2.4.0-SNAPSHOT.jar>
2018-03-01T01:04:28.388 [INFO] Stripping <https://builds.apache.org/job/beam_PostCommit_Java_MavenInstall/ws/src/runners/apex/target/beam-runners-apex-2.4.0-SNAPSHOT-javadoc.jar>
2018-03-01T01:04:28.392 [INFO] Stripping <https://builds.apache.org/job/beam_PostCommit_Java_MavenInstall/ws/src/runners/apex/target/beam-runners-apex-2.4.0-SNAPSHOT-sources.jar>
2018-03-01T01:04:28.394 [INFO] Stripping <https://builds.apache.org/job/beam_PostCommit_Java_MavenInstall/ws/src/runners/apex/target/beam-runners-apex-2.4.0-SNAPSHOT.jar>
2018-03-01T01:04:28.470 [INFO] Stripping <https://builds.apache.org/job/beam_PostCommit_Java_MavenInstall/ws/src/runners/apex/target/beam-runners-apex-2.4.0-SNAPSHOT-tests.jar>
2018-03-01T01:04:28.580 [INFO] 
2018-03-01T01:04:28.580 [INFO] --- maven-surefire-plugin:2.20.1:test (validates-runner-tests)
@ beam-runners-apex ---
2018-03-01T01:04:28.584 [INFO] Tests are skipped.
2018-03-01T01:04:28.690 [INFO] 
2018-03-01T01:04:28.690 [INFO] --- maven-dependency-plugin:3.0.2:analyze-only (default) @
beam-runners-apex ---
2018-03-01T01:04:28.806 [INFO] No dependency problems found
2018-03-01T01:04:28.913 [INFO] 
2018-03-01T01:04:28.913 [INFO] --- maven-install-plugin:2.5.2:install (default-install) @
beam-runners-apex ---
2018-03-01T01:04:28.914 [INFO] Installing <https://builds.apache.org/job/beam_PostCommit_Java_MavenInstall/ws/src/runners/apex/target/beam-runners-apex-2.4.0-SNAPSHOT.jar>
to <https://builds.apache.org/job/beam_PostCommit_Java_MavenInstall/ws/.repository/org/apache/beam/beam-runners-apex/2.4.0-SNAPSHOT/beam-runners-apex-2.4.0-SNAPSHOT.jar>
2018-03-01T01:04:28.973 [INFO] Installing <https://builds.apache.org/job/beam_PostCommit_Java_MavenInstall/ws/src/runners/apex/pom.xml>
to <https://builds.apache.org/job/beam_PostCommit_Java_MavenInstall/ws/.repository/org/apache/beam/beam-runners-apex/2.4.0-SNAPSHOT/beam-runners-apex-2.4.0-SNAPSHOT.pom>
2018-03-01T01:04:28.993 [INFO] Installing <https://builds.apache.org/job/beam_PostCommit_Java_MavenInstall/ws/src/runners/apex/target/beam-runners-apex-2.4.0-SNAPSHOT-tests.jar>
to <https://builds.apache.org/job/beam_PostCommit_Java_MavenInstall/ws/.repository/org/apache/beam/beam-runners-apex/2.4.0-SNAPSHOT/beam-runners-apex-2.4.0-SNAPSHOT-tests.jar>
2018-03-01T01:04:28.994 [INFO] Installing <https://builds.apache.org/job/beam_PostCommit_Java_MavenInstall/ws/src/runners/apex/target/beam-runners-apex-2.4.0-SNAPSHOT-tests.jar>
to <https://builds.apache.org/job/beam_PostCommit_Java_MavenInstall/ws/.repository/org/apache/beam/beam-runners-apex/2.4.0-SNAPSHOT/beam-runners-apex-2.4.0-SNAPSHOT-tests.jar>
2018-03-01T01:04:28.995 [INFO] Installing <https://builds.apache.org/job/beam_PostCommit_Java_MavenInstall/ws/src/runners/apex/target/beam-runners-apex-2.4.0-SNAPSHOT-sources.jar>
to <https://builds.apache.org/job/beam_PostCommit_Java_MavenInstall/ws/.repository/org/apache/beam/beam-runners-apex/2.4.0-SNAPSHOT/beam-runners-apex-2.4.0-SNAPSHOT-sources.jar>
2018-03-01T01:04:28.996 [INFO] Installing <https://builds.apache.org/job/beam_PostCommit_Java_MavenInstall/ws/src/runners/apex/target/beam-runners-apex-2.4.0-SNAPSHOT-test-sources.jar>
to <https://builds.apache.org/job/beam_PostCommit_Java_MavenInstall/ws/.repository/org/apache/beam/beam-runners-apex/2.4.0-SNAPSHOT/beam-runners-apex-2.4.0-SNAPSHOT-test-sources.jar>
2018-03-01T01:04:28.997 [INFO] Installing <https://builds.apache.org/job/beam_PostCommit_Java_MavenInstall/ws/src/runners/apex/target/beam-runners-apex-2.4.0-SNAPSHOT-javadoc.jar>
to <https://builds.apache.org/job/beam_PostCommit_Java_MavenInstall/ws/.repository/org/apache/beam/beam-runners-apex/2.4.0-SNAPSHOT/beam-runners-apex-2.4.0-SNAPSHOT-javadoc.jar>
[JENKINS] Archiving disabled
2018-03-01T01:04:30.809 [INFO] 
2018-03-01T01:04:30.809 [INFO] ------------------------------------------------------------------------
2018-03-01T01:04:30.809 [INFO] Skipping Apache Beam :: SDKs :: Java :: Aggregated Javadoc
2018-03-01T01:04:30.809 [INFO] This project has been banned from the build due to previous
failures.
2018-03-01T01:04:30.809 [INFO] ------------------------------------------------------------------------
[JENKINS] Archiving disabled
[JENKINS] Archiving disabled
[JENKINS] Archiving disabled
[JENKINS] Archiving disabled
[JENKINS] Archiving disabled
[JENKINS] Archiving disabled
[JENKINS] Archiving disabled
[JENKINS] Archiving disabled
[JENKINS] Archiving disabled
[JENKINS] Archiving disabled
[JENKINS] Archiving disabled
[JENKINS] Archiving disabled
[JENKINS] Archiving disabled
[JENKINS] Archiving disabled
[JENKINS] Archiving disabled
[JENKINS] Archiving disabled
[JENKINS] Archiving disabled
[JENKINS] Archiving disabled
[JENKINS] Archiving disabled
[JENKINS] Archiving disabled
[JENKINS] Archiving disabled
[JENKINS] Archiving disabled
[JENKINS] Archiving disabled
[JENKINS] Archiving disabled
[JENKINS] Archiving disabled
[JENKINS] Archiving disabled
[JENKINS] Archiving disabled
[JENKINS] Archiving disabled
[JENKINS] Archiving disabled
[JENKINS] Archiving disabled
[JENKINS] Archiving disabled
[JENKINS] Archiving disabled
[JENKINS] Archiving disabled
[JENKINS] Archiving disabled
[JENKINS] Archiving disabled
[JENKINS] Archiving disabled
[JENKINS] Archiving disabled
[JENKINS] Archiving disabled
[JENKINS] Archiving disabled
[JENKINS] Archiving disabled
[JENKINS] Archiving disabled
[JENKINS] Archiving disabled
[JENKINS] Archiving disabled
[JENKINS] Archiving disabled
[JENKINS] Archiving disabled
[JENKINS] Archiving disabled
[JENKINS] Archiving disabled
[JENKINS] Archiving disabled
[JENKINS] Archiving disabled
[JENKINS] Archiving disabled
[JENKINS] Archiving disabled
[JENKINS] Archiving disabled
[JENKINS] Archiving disabled
[JENKINS] Archiving disabled
[JENKINS] Archiving disabled
[JENKINS] Archiving disabled
[JENKINS] Archiving disabled
[JENKINS] Archiving disabled
[JENKINS] Archiving disabled
[JENKINS] Archiving disabled
[JENKINS] Archiving disabled
[JENKINS] Archiving disabled
[JENKINS] Archiving disabled
2018-03-01T01:05:35.825 [INFO] ------------------------------------------------------------------------
2018-03-01T01:05:35.825 [INFO] Reactor Summary:
2018-03-01T01:05:35.825 [INFO] 
2018-03-01T01:05:35.826 [INFO] Apache Beam :: Parent .............................. SUCCESS
[ 19.564 s]
2018-03-01T01:05:35.826 [INFO] Apache Beam :: SDKs :: Java :: Build Tools ......... SUCCESS
[ 10.033 s]
2018-03-01T01:05:35.826 [INFO] Apache Beam :: Model ............................... SUCCESS
[  2.701 s]
2018-03-01T01:05:35.826 [INFO] Apache Beam :: Model :: Pipeline ................... SUCCESS
[ 27.495 s]
2018-03-01T01:05:35.826 [INFO] Apache Beam :: Model :: Job Management ............. SUCCESS
[ 18.897 s]
2018-03-01T01:05:35.826 [INFO] Apache Beam :: Model :: Fn Execution ............... SUCCESS
[ 22.875 s]
2018-03-01T01:05:35.826 [INFO] Apache Beam :: SDKs ................................ SUCCESS
[  3.793 s]
2018-03-01T01:05:35.826 [INFO] Apache Beam :: SDKs :: Java ........................ SUCCESS
[  2.979 s]
2018-03-01T01:05:35.826 [INFO] Apache Beam :: SDKs :: Java :: Core ................ SUCCESS
[03:09 min]
2018-03-01T01:05:35.826 [INFO] Apache Beam :: SDKs :: Java :: Fn Execution ........ SUCCESS
[ 37.250 s]
2018-03-01T01:05:35.826 [INFO] Apache Beam :: SDKs :: Java :: Extensions :: Google Cloud Platform
Core SUCCESS [ 38.540 s]
2018-03-01T01:05:35.826 [INFO] Apache Beam :: Runners ............................. SUCCESS
[  5.825 s]
2018-03-01T01:05:35.826 [INFO] Apache Beam :: Runners :: Core Construction Java ... SUCCESS
[ 43.881 s]
2018-03-01T01:05:35.826 [INFO] Apache Beam :: Runners :: Core Java ................ SUCCESS
[01:43 min]
2018-03-01T01:05:35.826 [INFO] Apache Beam :: SDKs :: Java :: Harness ............. SUCCESS
[ 53.915 s]
2018-03-01T01:05:35.826 [INFO] Apache Beam :: SDKs :: Java :: IO :: Amazon Web Services SUCCESS
[ 36.893 s]
2018-03-01T01:05:35.826 [INFO] Apache Beam :: Runners :: Local Java Core .......... SUCCESS
[ 13.381 s]
2018-03-01T01:05:35.826 [INFO] Apache Beam :: Runners :: Direct Java .............. SUCCESS
[05:54 min]
2018-03-01T01:05:35.826 [INFO] Apache Beam :: SDKs :: Java :: IO :: AMQP .......... SUCCESS
[ 51.381 s]
2018-03-01T01:05:35.826 [INFO] Apache Beam :: SDKs :: Java :: IO :: Common ........ SUCCESS
[  8.269 s]
2018-03-01T01:05:35.826 [INFO] Apache Beam :: SDKs :: Java :: IO :: Cassandra ..... SUCCESS
[ 37.338 s]
2018-03-01T01:05:35.826 [INFO] Apache Beam :: SDKs :: Java :: IO :: Elasticsearch . SUCCESS
[ 23.143 s]
2018-03-01T01:05:35.826 [INFO] Apache Beam :: SDKs :: Java :: IO :: Elasticsearch-Tests SUCCESS
[  3.969 s]
2018-03-01T01:05:35.826 [INFO] Apache Beam :: SDKs :: Java :: IO :: Elasticsearch-Tests ::
Common SUCCESS [  5.539 s]
2018-03-01T01:05:35.826 [INFO] Apache Beam :: SDKs :: Java :: IO :: Elasticsearch-Tests ::
2.x SUCCESS [ 33.288 s]
2018-03-01T01:05:35.826 [INFO] Apache Beam :: SDKs :: Java :: IO :: Elasticsearch-Tests ::
5.x SUCCESS [ 37.882 s]
2018-03-01T01:05:35.826 [INFO] Apache Beam :: SDKs :: Java :: Extensions :: Protobuf SUCCESS
[ 23.762 s]
2018-03-01T01:05:35.826 [INFO] Apache Beam :: SDKs :: Java :: IO :: Google Cloud Platform
FAILURE [02:10 min]
2018-03-01T01:05:35.826 [INFO] Apache Beam :: Runners :: Google Cloud Dataflow .... SKIPPED
2018-03-01T01:05:35.826 [INFO] Apache Beam :: SDKs :: Java :: IO :: File-based-io-tests SKIPPED
2018-03-01T01:05:35.826 [INFO] Apache Beam :: SDKs :: Java :: IO :: Hadoop Common . SUCCESS
[ 17.375 s]
2018-03-01T01:05:35.826 [INFO] Apache Beam :: SDKs :: Java :: IO :: Hadoop File System SUCCESS
[ 37.840 s]
2018-03-01T01:05:35.826 [INFO] Apache Beam :: SDKs :: Java :: IO :: JDBC .......... SKIPPED
2018-03-01T01:05:35.826 [INFO] Apache Beam :: SDKs :: Java :: IO :: Hadoop Input Format SKIPPED
2018-03-01T01:05:35.826 [INFO] Apache Beam :: SDKs :: Java :: IO :: HBase ......... SUCCESS
[01:17 min]
2018-03-01T01:05:35.826 [INFO] Apache Beam :: SDKs :: Java :: IO :: HCatalog ...... SUCCESS
[ 50.872 s]
2018-03-01T01:05:35.826 [INFO] Apache Beam :: SDKs :: Java :: IO :: JMS ........... SUCCESS
[ 20.417 s]
2018-03-01T01:05:35.826 [INFO] Apache Beam :: SDKs :: Java :: IO :: Kafka ......... SUCCESS
[ 33.755 s]
2018-03-01T01:05:35.826 [INFO] Apache Beam :: SDKs :: Java :: IO :: Kinesis ....... SUCCESS
[ 29.204 s]
2018-03-01T01:05:35.826 [INFO] Apache Beam :: SDKs :: Java :: IO :: MongoDB ....... SUCCESS
[ 37.270 s]
2018-03-01T01:05:35.826 [INFO] Apache Beam :: SDKs :: Java :: IO :: MQTT .......... SUCCESS
[ 25.429 s]
2018-03-01T01:05:35.826 [INFO] Apache Beam :: SDKs :: Java :: IO :: Redis ......... SUCCESS
[ 19.712 s]
2018-03-01T01:05:35.826 [INFO] Apache Beam :: SDKs :: Java :: IO :: Solr .......... SUCCESS
[ 38.797 s]
2018-03-01T01:05:35.826 [INFO] Apache Beam :: SDKs :: Java :: IO :: Tika .......... SUCCESS
[ 25.184 s]
2018-03-01T01:05:35.826 [INFO] Apache Beam :: SDKs :: Java :: IO :: XML ........... SUCCESS
[ 33.981 s]
2018-03-01T01:05:35.826 [INFO] Apache Beam :: SDKs :: Java :: Maven Archetypes :: Starter
SUCCESS [ 16.542 s]
2018-03-01T01:05:35.826 [INFO] Apache Beam :: Examples :: Java .................... SKIPPED
2018-03-01T01:05:35.826 [INFO] Apache Beam :: SDKs :: Java :: Maven Archetypes :: Examples
SKIPPED
2018-03-01T01:05:35.827 [INFO] Apache Beam :: SDKs :: Java :: Extensions :: Jackson SUCCESS
[ 21.633 s]
2018-03-01T01:05:35.827 [INFO] Apache Beam :: SDKs :: Java :: Extensions :: Join library SUCCESS
[ 22.111 s]
2018-03-01T01:05:35.827 [INFO] Apache Beam :: SDKs :: Java :: Extensions :: Sketching SUCCESS
[ 28.245 s]
2018-03-01T01:05:35.827 [INFO] Apache Beam :: SDKs :: Java :: Extensions :: Sorter  SUCCESS
[ 53.837 s]
2018-03-01T01:05:35.827 [INFO] Apache Beam :: SDKs :: Java :: Extensions :: SQL ... SUCCESS
[02:32 min]
2018-03-01T01:05:35.827 [INFO] Apache Beam :: SDKs :: Java :: Nexmark ............. SKIPPED
2018-03-01T01:05:35.827 [INFO] Apache Beam :: Runners :: Java Fn Execution ........ SUCCESS
[ 33.378 s]
2018-03-01T01:05:35.827 [INFO] Apache Beam :: Runners :: Java Local Artifact Service SUCCESS
[ 28.114 s]
2018-03-01T01:05:35.827 [INFO] Apache Beam :: Runners :: Reference :: Java ........ SUCCESS
[ 15.352 s]
2018-03-01T01:05:35.827 [INFO] Apache Beam :: Runners :: Reference :: Job Orchestrator SUCCESS
[ 19.948 s]
2018-03-01T01:05:35.827 [INFO] Apache Beam :: Runners :: Flink .................... SUCCESS
[01:05 min]
2018-03-01T01:05:35.827 [INFO] Apache Beam :: Runners :: Gearpump ................. SUCCESS
[ 36.224 s]
2018-03-01T01:05:35.827 [INFO] Apache Beam :: Runners :: Spark .................... SUCCESS
[02:44 min]
2018-03-01T01:05:35.827 [INFO] Apache Beam :: Runners :: Apex ..................... SUCCESS
[01:23 min]
2018-03-01T01:05:35.827 [INFO] Apache Beam :: SDKs :: Java :: Aggregated Javadoc .. SKIPPED
2018-03-01T01:05:35.827 [INFO] ------------------------------------------------------------------------
2018-03-01T01:05:35.827 [INFO] BUILD FAILURE
2018-03-01T01:05:35.827 [INFO] ------------------------------------------------------------------------
2018-03-01T01:05:35.827 [INFO] Total time: 45:12 min
2018-03-01T01:05:35.827 [INFO] Finished at: 2018-03-01T01:05:35Z
2018-03-01T01:05:37.316 [INFO] Final Memory: 379M/1518M
2018-03-01T01:05:37.316 [INFO] ------------------------------------------------------------------------
2018-03-01T01:05:37.329 [ERROR] Failed to execute goal org.apache.maven.plugins:maven-dependency-plugin:3.0.2:analyze-only
(default) on project beam-sdks-java-io-google-cloud-platform: Dependency problems found ->
[Help 1]
2018-03-01T01:05:37.329 [ERROR] 
2018-03-01T01:05:37.329 [ERROR] To see the full stack trace of the errors, re-run Maven with
the -e switch.
2018-03-01T01:05:37.329 [ERROR] Re-run Maven using the -X switch to enable full debug logging.
2018-03-01T01:05:37.329 [ERROR] 
2018-03-01T01:05:37.329 [ERROR] For more information about the errors and possible solutions,
please read the following articles:
2018-03-01T01:05:37.329 [ERROR] [Help 1] http://cwiki.apache.org/confluence/display/MAVEN/MojoExecutionException
2018-03-01T01:05:37.330 [ERROR] 
2018-03-01T01:05:37.330 [ERROR] After correcting the problems, you can resume the build with
the command
2018-03-01T01:05:37.330 [ERROR]   mvn <goals> -rf :beam-sdks-java-io-google-cloud-platform
channel stopped
Not sending mail to unregistered user github@alasdairhodge.co.uk

Mime
View raw message