beam-commits mailing list archives

Site index · List index
Message view « Date » · « Thread »
Top « Date » · « Thread »
From Apache Jenkins Server <jenk...@builds.apache.org>
Subject Build failed in Jenkins: beam_PerformanceTests_Python #1027
Date Fri, 16 Mar 2018 01:21:36 GMT
See <https://builds.apache.org/job/beam_PerformanceTests_Python/1027/display/redirect?page=changes>

Changes:

[sidhom] Add Java bounded read overrides

[coheigea] Replacing size() == 0 with isEmpty()

[lukasz.gajowy] [BEAM-3798] Remove error check on dataflow when getting batch job state

[XuMingmin] [SQL] Add support for DOT expression (#4863)

------------------------------------------
[...truncated 493.58 KB...]
[INFO] 
[INFO] --- maven-shade-plugin:3.1.0:shade (bundle-and-repackage) @ beam-sdks-java-maven-archetypes-examples
---
[INFO] Excluding org.apache.beam:beam-examples-java:jar:2.5.0-SNAPSHOT from the shaded jar.
[INFO] Excluding org.apache.beam:beam-sdks-java-core:jar:2.5.0-SNAPSHOT from the shaded jar.
[INFO] Excluding com.google.guava:guava-testlib:jar:20.0 from the shaded jar.
[INFO] Excluding com.google.errorprone:error_prone_annotations:jar:2.0.15 from the shaded
jar.
[INFO] Excluding com.google.protobuf:protobuf-java:jar:3.2.0 from the shaded jar.
[INFO] Excluding com.github.stephenc.findbugs:findbugs-annotations:jar:1.3.9-1 from the shaded
jar.
[INFO] Excluding com.fasterxml.jackson.core:jackson-core:jar:2.8.9 from the shaded jar.
[INFO] Excluding com.fasterxml.jackson.core:jackson-annotations:jar:2.8.9 from the shaded
jar.
[INFO] Excluding com.fasterxml.jackson.core:jackson-databind:jar:2.8.9 from the shaded jar.
[INFO] Excluding net.bytebuddy:byte-buddy:jar:1.7.10 from the shaded jar.
[INFO] Excluding org.xerial.snappy:snappy-java:jar:1.1.4 from the shaded jar.
[INFO] Excluding org.apache.commons:commons-compress:jar:1.14 from the shaded jar.
[INFO] Excluding org.apache.commons:commons-lang3:jar:3.6 from the shaded jar.
[INFO] Excluding org.apache.beam:beam-sdks-java-extensions-google-cloud-platform-core:jar:2.5.0-SNAPSHOT
from the shaded jar.
[INFO] Excluding com.google.http-client:google-http-client-jackson2:jar:1.22.0 from the shaded
jar.
[INFO] Excluding com.google.cloud.bigdataoss:gcsio:jar:1.4.5 from the shaded jar.
[INFO] Excluding com.google.apis:google-api-services-cloudresourcemanager:jar:v1-rev6-1.22.0
from the shaded jar.
[INFO] Excluding com.google.apis:google-api-services-storage:jar:v1-rev71-1.22.0 from the
shaded jar.
[INFO] Excluding org.apache.beam:beam-sdks-java-io-google-cloud-platform:jar:2.5.0-SNAPSHOT
from the shaded jar.
[INFO] Excluding org.apache.beam:beam-sdks-java-extensions-protobuf:jar:2.5.0-SNAPSHOT from
the shaded jar.
[INFO] Excluding io.grpc:grpc-core:jar:1.2.0 from the shaded jar.
[INFO] Excluding io.grpc:grpc-context:jar:1.2.0 from the shaded jar.
[INFO] Excluding com.google.instrumentation:instrumentation-api:jar:0.3.0 from the shaded
jar.
[INFO] Excluding com.google.api:gax-grpc:jar:0.20.0 from the shaded jar.
[INFO] Excluding io.grpc:grpc-protobuf:jar:1.2.0 from the shaded jar.
[INFO] Excluding com.google.api:api-common:jar:1.0.0-rc2 from the shaded jar.
[INFO] Excluding com.google.auto.value:auto-value:jar:1.5.3 from the shaded jar.
[INFO] Excluding com.google.api:gax:jar:1.3.1 from the shaded jar.
[INFO] Excluding org.threeten:threetenbp:jar:1.3.3 from the shaded jar.
[INFO] Excluding com.google.cloud:google-cloud-core-grpc:jar:1.2.0 from the shaded jar.
[INFO] Excluding com.google.protobuf:protobuf-java-util:jar:3.2.0 from the shaded jar.
[INFO] Excluding com.google.code.gson:gson:jar:2.7 from the shaded jar.
[INFO] Excluding com.google.api.grpc:grpc-google-cloud-pubsub-v1:jar:0.1.18 from the shaded
jar.
[INFO] Excluding com.google.api.grpc:proto-google-cloud-pubsub-v1:jar:0.1.18 from the shaded
jar.
[INFO] Excluding com.google.api.grpc:proto-google-iam-v1:jar:0.1.18 from the shaded jar.
[INFO] Excluding io.grpc:grpc-auth:jar:1.2.0 from the shaded jar.
[INFO] Excluding io.grpc:grpc-netty:jar:1.2.0 from the shaded jar.
[INFO] Excluding io.netty:netty-codec-http2:jar:4.1.8.Final from the shaded jar.
[INFO] Excluding io.netty:netty-codec-http:jar:4.1.8.Final from the shaded jar.
[INFO] Excluding io.netty:netty-handler-proxy:jar:4.1.8.Final from the shaded jar.
[INFO] Excluding io.netty:netty-codec-socks:jar:4.1.8.Final from the shaded jar.
[INFO] Excluding io.netty:netty-handler:jar:4.1.8.Final from the shaded jar.
[INFO] Excluding io.netty:netty-buffer:jar:4.1.8.Final from the shaded jar.
[INFO] Excluding io.netty:netty-common:jar:4.1.8.Final from the shaded jar.
[INFO] Excluding io.netty:netty-transport:jar:4.1.8.Final from the shaded jar.
[INFO] Excluding io.netty:netty-resolver:jar:4.1.8.Final from the shaded jar.
[INFO] Excluding io.netty:netty-codec:jar:4.1.8.Final from the shaded jar.
[INFO] Excluding io.grpc:grpc-stub:jar:1.2.0 from the shaded jar.
[INFO] Excluding io.grpc:grpc-all:jar:1.2.0 from the shaded jar.
[INFO] Excluding io.grpc:grpc-okhttp:jar:1.2.0 from the shaded jar.
[INFO] Excluding com.squareup.okhttp:okhttp:jar:2.5.0 from the shaded jar.
[INFO] Excluding com.squareup.okio:okio:jar:1.6.0 from the shaded jar.
[INFO] Excluding io.grpc:grpc-protobuf-lite:jar:1.2.0 from the shaded jar.
[INFO] Excluding io.grpc:grpc-protobuf-nano:jar:1.2.0 from the shaded jar.
[INFO] Excluding com.google.protobuf.nano:protobuf-javanano:jar:3.0.0-alpha-5 from the shaded
jar.
[INFO] Excluding com.google.cloud:google-cloud-core:jar:1.0.2 from the shaded jar.
[INFO] Excluding org.json:json:jar:20160810 from the shaded jar.
[INFO] Excluding com.google.cloud:google-cloud-spanner:jar:0.20.0b-beta from the shaded jar.
[INFO] Excluding com.google.api.grpc:proto-google-cloud-spanner-v1:jar:0.1.11b from the shaded
jar.
[INFO] Excluding com.google.api.grpc:proto-google-cloud-spanner-admin-instance-v1:jar:0.1.11
from the shaded jar.
[INFO] Excluding com.google.api.grpc:grpc-google-cloud-spanner-v1:jar:0.1.11b from the shaded
jar.
[INFO] Excluding com.google.api.grpc:grpc-google-cloud-spanner-admin-database-v1:jar:0.1.11
from the shaded jar.
[INFO] Excluding com.google.api.grpc:grpc-google-cloud-spanner-admin-instance-v1:jar:0.1.11
from the shaded jar.
[INFO] Excluding com.google.api.grpc:grpc-google-longrunning-v1:jar:0.1.11 from the shaded
jar.
[INFO] Excluding com.google.api.grpc:proto-google-longrunning-v1:jar:0.1.11 from the shaded
jar.
[INFO] Excluding com.google.cloud.bigtable:bigtable-protos:jar:1.0.0-pre3 from the shaded
jar.
[INFO] Excluding com.google.cloud.bigtable:bigtable-client-core:jar:1.0.0 from the shaded
jar.
[INFO] Excluding commons-logging:commons-logging:jar:1.2 from the shaded jar.
[INFO] Excluding com.google.auth:google-auth-library-appengine:jar:0.7.0 from the shaded jar.
[INFO] Excluding io.opencensus:opencensus-contrib-grpc-util:jar:0.7.0 from the shaded jar.
[INFO] Excluding io.opencensus:opencensus-api:jar:0.7.0 from the shaded jar.
[INFO] Excluding io.dropwizard.metrics:metrics-core:jar:3.1.2 from the shaded jar.
[INFO] Excluding io.netty:netty-tcnative-boringssl-static:jar:1.1.33.Fork26 from the shaded
jar.
[INFO] Excluding com.google.api.grpc:proto-google-cloud-spanner-admin-database-v1:jar:0.1.9
from the shaded jar.
[INFO] Excluding com.google.api.grpc:proto-google-common-protos:jar:0.1.9 from the shaded
jar.
[INFO] Excluding com.google.api-client:google-api-client:jar:1.22.0 from the shaded jar.
[INFO] Excluding com.google.apis:google-api-services-bigquery:jar:v2-rev374-1.22.0 from the
shaded jar.
[INFO] Excluding com.google.code.findbugs:jsr305:jar:3.0.1 from the shaded jar.
[INFO] Excluding com.google.http-client:google-http-client:jar:1.22.0 from the shaded jar.
[INFO] Excluding org.apache.httpcomponents:httpclient:jar:4.0.1 from the shaded jar.
[INFO] Excluding org.apache.httpcomponents:httpcore:jar:4.0.1 from the shaded jar.
[INFO] Excluding commons-codec:commons-codec:jar:1.3 from the shaded jar.
[INFO] Excluding com.google.oauth-client:google-oauth-client:jar:1.22.0 from the shaded jar.
[INFO] Excluding com.google.cloud.bigdataoss:util:jar:1.4.5 from the shaded jar.
[INFO] Excluding com.google.api-client:google-api-client-java6:jar:1.22.0 from the shaded
jar.
[INFO] Excluding com.google.api-client:google-api-client-jackson2:jar:1.22.0 from the shaded
jar.
[INFO] Excluding com.google.oauth-client:google-oauth-client-java6:jar:1.22.0 from the shaded
jar.
[INFO] Excluding com.google.auth:google-auth-library-oauth2-http:jar:0.7.1 from the shaded
jar.
[INFO] Excluding com.google.auth:google-auth-library-credentials:jar:0.7.1 from the shaded
jar.
[INFO] Excluding org.apache.avro:avro:jar:1.8.2 from the shaded jar.
[INFO] Excluding org.codehaus.jackson:jackson-core-asl:jar:1.9.13 from the shaded jar.
[INFO] Excluding org.codehaus.jackson:jackson-mapper-asl:jar:1.9.13 from the shaded jar.
[INFO] Excluding com.thoughtworks.paranamer:paranamer:jar:2.7 from the shaded jar.
[INFO] Excluding org.tukaani:xz:jar:1.5 from the shaded jar.
[INFO] Excluding com.google.apis:google-api-services-pubsub:jar:v1-rev10-1.22.0 from the shaded
jar.
[INFO] Including com.google.guava:guava:jar:20.0 in the shaded jar.
[INFO] Excluding com.google.cloud.datastore:datastore-v1-proto-client:jar:1.4.0 from the shaded
jar.
[INFO] Excluding com.google.http-client:google-http-client-protobuf:jar:1.22.0 from the shaded
jar.
[INFO] Excluding com.google.http-client:google-http-client-jackson:jar:1.22.0 from the shaded
jar.
[INFO] Excluding com.google.cloud.datastore:datastore-v1-protos:jar:1.3.0 from the shaded
jar.
[INFO] Excluding com.google.api.grpc:grpc-google-common-protos:jar:0.1.9 from the shaded jar.
[INFO] Excluding joda-time:joda-time:jar:2.4 from the shaded jar.
[INFO] Excluding org.slf4j:slf4j-api:jar:1.7.25 from the shaded jar.
[INFO] Excluding org.apache.beam:beam-runners-google-cloud-dataflow-java:jar:2.5.0-SNAPSHOT
from the shaded jar.
[INFO] Excluding org.apache.beam:beam-model-pipeline:jar:2.5.0-SNAPSHOT from the shaded jar.
[INFO] Excluding org.apache.beam:beam-runners-core-construction-java:jar:2.5.0-SNAPSHOT from
the shaded jar.
[INFO] Excluding org.apache.beam:beam-model-job-management:jar:2.5.0-SNAPSHOT from the shaded
jar.
[INFO] Excluding com.google.apis:google-api-services-dataflow:jar:v1b3-rev221-1.22.0 from
the shaded jar.
[INFO] Excluding com.google.apis:google-api-services-clouddebugger:jar:v2-rev8-1.22.0 from
the shaded jar.
[INFO] Replacing original artifact with shaded artifact.
[INFO] Replacing <https://builds.apache.org/job/beam_PerformanceTests_Python/ws/runs/7ed08a6c/beam/sdks/java/maven-archetypes/examples/target/beam-sdks-java-maven-archetypes-examples-2.5.0-SNAPSHOT.jar>
with <https://builds.apache.org/job/beam_PerformanceTests_Python/ws/runs/7ed08a6c/beam/sdks/java/maven-archetypes/examples/target/beam-sdks-java-maven-archetypes-examples-2.5.0-SNAPSHOT-shaded.jar>
[INFO] Replacing original test artifact with shaded test artifact.
[INFO] Replacing <https://builds.apache.org/job/beam_PerformanceTests_Python/ws/runs/7ed08a6c/beam/sdks/java/maven-archetypes/examples/target/beam-sdks-java-maven-archetypes-examples-2.5.0-SNAPSHOT-tests.jar>
with <https://builds.apache.org/job/beam_PerformanceTests_Python/ws/runs/7ed08a6c/beam/sdks/java/maven-archetypes/examples/target/beam-sdks-java-maven-archetypes-examples-2.5.0-SNAPSHOT-shaded-tests.jar>
[INFO] 
[INFO] --- maven-dependency-plugin:3.0.2:analyze-only (default) @ beam-sdks-java-maven-archetypes-examples
---
[INFO] No dependency problems found
[INFO] 
[INFO] --- maven-install-plugin:2.5.2:install (default-install) @ beam-sdks-java-maven-archetypes-examples
---
[INFO] Installing <https://builds.apache.org/job/beam_PerformanceTests_Python/ws/runs/7ed08a6c/beam/sdks/java/maven-archetypes/examples/target/beam-sdks-java-maven-archetypes-examples-2.5.0-SNAPSHOT.jar>
to /home/jenkins/.m2/repository/org/apache/beam/beam-sdks-java-maven-archetypes-examples/2.5.0-SNAPSHOT/beam-sdks-java-maven-archetypes-examples-2.5.0-SNAPSHOT.jar
[INFO] Installing <https://builds.apache.org/job/beam_PerformanceTests_Python/ws/runs/7ed08a6c/beam/sdks/java/maven-archetypes/examples/pom.xml>
to /home/jenkins/.m2/repository/org/apache/beam/beam-sdks-java-maven-archetypes-examples/2.5.0-SNAPSHOT/beam-sdks-java-maven-archetypes-examples-2.5.0-SNAPSHOT.pom
[INFO] Installing <https://builds.apache.org/job/beam_PerformanceTests_Python/ws/runs/7ed08a6c/beam/sdks/java/maven-archetypes/examples/target/beam-sdks-java-maven-archetypes-examples-2.5.0-SNAPSHOT-tests.jar>
to /home/jenkins/.m2/repository/org/apache/beam/beam-sdks-java-maven-archetypes-examples/2.5.0-SNAPSHOT/beam-sdks-java-maven-archetypes-examples-2.5.0-SNAPSHOT-tests.jar
[INFO] 
[INFO] --- maven-archetype-plugin:2.4:integration-test (default-integration-test) @ beam-sdks-java-maven-archetypes-examples
---
[INFO] Processing Archetype IT project: basic
[INFO] ----------------------------------------------------------------------------
[INFO] Using following parameters for creating project from Archetype: beam-sdks-java-maven-archetypes-examples:2.5.0-SNAPSHOT
[INFO] ----------------------------------------------------------------------------
[INFO] Parameter: groupId, Value: archetype.it
[INFO] Parameter: artifactId, Value: basic
[INFO] Parameter: version, Value: 0.1
[INFO] Parameter: package, Value: it.pkg
[INFO] Parameter: packageInPathFormat, Value: it/pkg
[INFO] Parameter: version, Value: 0.1
[INFO] Parameter: package, Value: it.pkg
[INFO] Parameter: groupId, Value: archetype.it
[INFO] Parameter: targetPlatform, Value: 1.8
[INFO] Parameter: artifactId, Value: basic
[INFO] project created from Archetype in dir: <https://builds.apache.org/job/beam_PerformanceTests_Python/ws/runs/7ed08a6c/beam/sdks/java/maven-archetypes/examples/target/test-classes/projects/basic/project/basic>
[INFO] Invoking post-archetype-generation goals: verify

STDERR: 
2018-03-16 01:20:33,806 7ed08a6c MainThread beam_integration_benchmark(1/1) INFO     Running
benchmark beam_integration_benchmark
2018-03-16 01:20:33,876 7ed08a6c MainThread beam_integration_benchmark(1/1) ERROR    Error
during benchmark beam_integration_benchmark
Traceback (most recent call last):
  File "<https://builds.apache.org/job/beam_PerformanceTests_Python/ws/PerfKitBenchmarker/perfkitbenchmarker/pkb.py",>
line 623, in RunBenchmark
    DoRunPhase(spec, collector, detailed_timer)
  File "<https://builds.apache.org/job/beam_PerformanceTests_Python/ws/PerfKitBenchmarker/perfkitbenchmarker/pkb.py",>
line 526, in DoRunPhase
    samples = spec.BenchmarkRun(spec)
  File "<https://builds.apache.org/job/beam_PerformanceTests_Python/ws/PerfKitBenchmarker/perfkitbenchmarker/linux_benchmarks/beam_integration_benchmark.py",>
line 159, in Run
    job_type=job_type)
  File "<https://builds.apache.org/job/beam_PerformanceTests_Python/ws/PerfKitBenchmarker/perfkitbenchmarker/providers/gcp/gcp_dpb_dataflow.py",>
line 87, in SubmitJob
    self.spec, classname, job_arguments)
  File "<https://builds.apache.org/job/beam_PerformanceTests_Python/ws/PerfKitBenchmarker/perfkitbenchmarker/beam_benchmark_helper.py",>
line 175, in BuildBeamCommand
    cmd = _BuildPythonCommand(benchmark_spec, classname, job_arguments)
  File "<https://builds.apache.org/job/beam_PerformanceTests_Python/ws/PerfKitBenchmarker/perfkitbenchmarker/beam_benchmark_helper.py",>
line 265, in _BuildPythonCommand
    'apache-beam*.tar.gz')
  File "<https://builds.apache.org/job/beam_PerformanceTests_Python/ws/PerfKitBenchmarker/perfkitbenchmarker/beam_benchmark_helper.py",>
line 290, in _FindFiles
    raise RuntimeError('No such directory: %s' % base_path)
RuntimeError: No such directory: <https://builds.apache.org/job/beam_PerformanceTests_Python/ws/runs/7ed08a6c/beam/sdks/python/target>
2018-03-16 01:20:33,951 7ed08a6c MainThread beam_integration_benchmark(1/1) INFO     Cleaning
up benchmark beam_integration_benchmark
2018-03-16 01:20:33,963 7ed08a6c MainThread beam_integration_benchmark(1/1) ERROR    Exception
running benchmark
Traceback (most recent call last):
  File "<https://builds.apache.org/job/beam_PerformanceTests_Python/ws/PerfKitBenchmarker/perfkitbenchmarker/pkb.py",>
line 733, in RunBenchmarkTask
    RunBenchmark(spec, collector)
  File "<https://builds.apache.org/job/beam_PerformanceTests_Python/ws/PerfKitBenchmarker/perfkitbenchmarker/pkb.py",>
line 623, in RunBenchmark
    DoRunPhase(spec, collector, detailed_timer)
  File "<https://builds.apache.org/job/beam_PerformanceTests_Python/ws/PerfKitBenchmarker/perfkitbenchmarker/pkb.py",>
line 526, in DoRunPhase
    samples = spec.BenchmarkRun(spec)
  File "<https://builds.apache.org/job/beam_PerformanceTests_Python/ws/PerfKitBenchmarker/perfkitbenchmarker/linux_benchmarks/beam_integration_benchmark.py",>
line 159, in Run
    job_type=job_type)
  File "<https://builds.apache.org/job/beam_PerformanceTests_Python/ws/PerfKitBenchmarker/perfkitbenchmarker/providers/gcp/gcp_dpb_dataflow.py",>
line 87, in SubmitJob
    self.spec, classname, job_arguments)
  File "<https://builds.apache.org/job/beam_PerformanceTests_Python/ws/PerfKitBenchmarker/perfkitbenchmarker/beam_benchmark_helper.py",>
line 175, in BuildBeamCommand
    cmd = _BuildPythonCommand(benchmark_spec, classname, job_arguments)
  File "<https://builds.apache.org/job/beam_PerformanceTests_Python/ws/PerfKitBenchmarker/perfkitbenchmarker/beam_benchmark_helper.py",>
line 265, in _BuildPythonCommand
    'apache-beam*.tar.gz')
  File "<https://builds.apache.org/job/beam_PerformanceTests_Python/ws/PerfKitBenchmarker/perfkitbenchmarker/beam_benchmark_helper.py",>
line 290, in _FindFiles
    raise RuntimeError('No such directory: %s' % base_path)
RuntimeError: No such directory: <https://builds.apache.org/job/beam_PerformanceTests_Python/ws/runs/7ed08a6c/beam/sdks/python/target>
2018-03-16 01:20:33,971 7ed08a6c MainThread beam_integration_benchmark(1/1) ERROR    Benchmark
1/1 beam_integration_benchmark (UID: beam_integration_benchmark0) failed. Execution will continue.
2018-03-16 01:20:33,971 7ed08a6c MainThread beam_integration_benchmark(1/1) INFO     Benchmark
run statuses:
---------------------------------------------------------------------------------
Name                        UID                          Status  Failed Substatus
---------------------------------------------------------------------------------
beam_integration_benchmark  beam_integration_benchmark0  FAILED                  
---------------------------------------------------------------------------------
Success rate: 0.00% (0/1)
2018-03-16 01:20:33,983 7ed08a6c MainThread beam_integration_benchmark(1/1) INFO     Complete
logs can be found at: <https://builds.apache.org/job/beam_PerformanceTests_Python/ws/runs/7ed08a6c/pkb.log>
2018-03-16 01:20:33,983 7ed08a6c MainThread beam_integration_benchmark(1/1) INFO     Completion
statuses can be found at: <https://builds.apache.org/job/beam_PerformanceTests_Python/ws/runs/7ed08a6c/completion_statuses.json>
Build step 'Execute shell' marked build as failure
Not sending mail to unregistered user klk@google.com
Not sending mail to unregistered user samuel.waggoner@healthsparq.com
Not sending mail to unregistered user ekirpichov@gmail.com
Not sending mail to unregistered user ankurgoenka@gmail.com
Not sending mail to unregistered user dcavazos@google.com
Not sending mail to unregistered user boyuanz@google.com
Not sending mail to unregistered user mariand@google.com
Not sending mail to unregistered user aromanenko.dev@gmail.com
Not sending mail to unregistered user grzegorz.kolakowski@getindata.com
Not sending mail to unregistered user fjetumale@gmail.com
Not sending mail to unregistered user amyrvold@google.com
Not sending mail to unregistered user kedin@google.com
Not sending mail to unregistered user luke_zhu@brown.edu
Not sending mail to unregistered user rober@frantil.com
Not sending mail to unregistered user ccy@google.com
Not sending mail to unregistered user aljoscha.krettek@gmail.com
Not sending mail to unregistered user github@alasdairhodge.co.uk
Not sending mail to unregistered user arostami@google.com
Not sending mail to unregistered user lukasz.gajowy@polidea.com
Not sending mail to unregistered user samuelw@google.com
Not sending mail to unregistered user sduskis@google.com
Not sending mail to unregistered user joey.baruch@gmail.com
Not sending mail to unregistered user wcn@google.com
Not sending mail to unregistered user kirpichov@google.com
Not sending mail to unregistered user markliu@google.com
Not sending mail to unregistered user sidhom@google.com
Not sending mail to unregistered user ehudm@google.com
Not sending mail to unregistered user daniel.o.programmer@gmail.com
Not sending mail to unregistered user arnaudfournier021@gmail.com
Not sending mail to unregistered user batbat@batbat-linuxworkstation.sea.corp.google.com
Not sending mail to unregistered user melissapa@google.com
Not sending mail to unregistered user jiangkai@gmail.com
Not sending mail to unregistered user holdenkarau@google.com
Not sending mail to unregistered user jb@nanthrax.net
Not sending mail to unregistered user zhouhai02@meituan.com
Not sending mail to unregistered user xumingmingv@gmail.com
Not sending mail to unregistered user dariusz.aniszewski@polidea.com
Not sending mail to unregistered user mairbek@google.com
Not sending mail to unregistered user pawel.pk.kaczmarczyk@gmail.com
Not sending mail to unregistered user herohde@google.com
Not sending mail to unregistered user robert@frantil.com
Not sending mail to unregistered user yifanzou@yifanzou-linuxworkstation.sea.corp.google.com
Not sending mail to unregistered user wtanaka@yahoo.com
Not sending mail to unregistered user cclauss@bluewin.ch
Not sending mail to unregistered user gene@telligent-data.com
Not sending mail to unregistered user zoy@giggles.nyc.corp.google.com
Not sending mail to unregistered user 1028332163@qq.com
Not sending mail to unregistered user mariagh@mariagh.svl.corp.google.com
Not sending mail to unregistered user niemo@google.com
Not sending mail to unregistered user apilloud@google.com
Not sending mail to unregistered user Mottyg1@gmail.com
Not sending mail to unregistered user alan.myrvold@comcast.net
Not sending mail to unregistered user willy@bounceexchange.com
Not sending mail to unregistered user arnaudfournier921@gmail.com
Not sending mail to unregistered user XuMingmin@users.noreply.github.com
Not sending mail to unregistered user abhyankar@gmail.com
Not sending mail to unregistered user swegner@google.com

Mime
View raw message