beam-commits mailing list archives

Site index · List index
Message view « Date » · « Thread »
Top « Date » · « Thread »
From Apache Jenkins Server <jenk...@builds.apache.org>
Subject Build failed in Jenkins: beam_PostCommit_Java_ValidatesRunner_Flink #5133
Date Fri, 02 Mar 2018 00:21:06 GMT
See <https://builds.apache.org/job/beam_PostCommit_Java_ValidatesRunner_Flink/5133/display/redirect>

------------------------------------------
[...truncated 154.79 KB...]
2018-03-02T00:20:11.074 [INFO] Tests run: 2, Failures: 0, Errors: 0, Skipped: 0, Time elapsed:
0.002 s - in org.apache.beam.runners.core.triggers.TriggerStateMachineTest
2018-03-02T00:20:11.074 [INFO] Running org.apache.beam.runners.core.StateTagTest
2018-03-02T00:20:11.082 [INFO] Tests run: 7, Failures: 0, Errors: 0, Skipped: 0, Time elapsed:
0.005 s - in org.apache.beam.runners.core.StateTagTest
2018-03-02T00:20:11.083 [INFO] Running org.apache.beam.runners.core.triggers.AfterWatermarkStateMachineTest
2018-03-02T00:20:11.102 [INFO] Tests run: 15, Failures: 0, Errors: 0, Skipped: 0, Time elapsed:
0.016 s - in org.apache.beam.runners.core.triggers.AfterWatermarkStateMachineTest
2018-03-02T00:20:11.103 [INFO] Running org.apache.beam.runners.core.triggers.FinishedTriggersSetTest
2018-03-02T00:20:11.106 [INFO] Tests run: 3, Failures: 0, Errors: 0, Skipped: 0, Time elapsed:
0 s - in org.apache.beam.runners.core.triggers.FinishedTriggersSetTest
2018-03-02T00:20:11.106 [INFO] Running org.apache.beam.runners.core.SideInputHandlerTest
2018-03-02T00:20:11.206 [INFO] Tests run: 6, Failures: 0, Errors: 0, Skipped: 0, Time elapsed:
0.096 s - in org.apache.beam.runners.core.SideInputHandlerTest
2018-03-02T00:20:11.206 [INFO] Running org.apache.beam.runners.core.OutputAndTimeBoundedSplittableProcessElementInvokerTest
2018-03-02T00:20:21.321 [INFO] Tests run: 7, Failures: 0, Errors: 0, Skipped: 0, Time elapsed:
10.112 s - in org.apache.beam.runners.core.OutputAndTimeBoundedSplittableProcessElementInvokerTest
2018-03-02T00:20:21.323 [INFO] Running org.apache.beam.runners.core.KeyedWorkItemCoderTest
2018-03-02T00:20:21.364 [INFO] Tests run: 3, Failures: 0, Errors: 0, Skipped: 0, Time elapsed:
0.038 s - in org.apache.beam.runners.core.KeyedWorkItemCoderTest
2018-03-02T00:20:21.371 [INFO] Running org.apache.beam.runners.core.triggers.AfterPaneStateMachineTest
2018-03-02T00:20:21.374 [INFO] Tests run: 4, Failures: 0, Errors: 0, Skipped: 0, Time elapsed:
0 s - in org.apache.beam.runners.core.triggers.AfterPaneStateMachineTest
2018-03-02T00:20:21.379 [INFO] Running org.apache.beam.runners.core.triggers.AfterAllStateMachineTest
2018-03-02T00:20:21.382 [INFO] Tests run: 4, Failures: 0, Errors: 0, Skipped: 0, Time elapsed:
0 s - in org.apache.beam.runners.core.triggers.AfterAllStateMachineTest
2018-03-02T00:20:21.383 [INFO] Running org.apache.beam.runners.core.triggers.AfterEachStateMachineTest
2018-03-02T00:20:21.386 [INFO] Tests run: 2, Failures: 0, Errors: 0, Skipped: 0, Time elapsed:
0 s - in org.apache.beam.runners.core.triggers.AfterEachStateMachineTest
2018-03-02T00:20:21.798 [INFO] 
2018-03-02T00:20:21.798 [INFO] Results:
2018-03-02T00:20:21.798 [INFO] 
2018-03-02T00:20:21.798 [INFO] Tests run: 246, Failures: 0, Errors: 0, Skipped: 0
2018-03-02T00:20:21.798 [INFO] 
[JENKINS] Recording test results
2018-03-02T00:20:22.793 [INFO] 
2018-03-02T00:20:22.793 [INFO] --- build-helper-maven-plugin:3.0.0:regex-properties (render-artifact-id)
@ beam-runners-core-java ---
2018-03-02T00:20:22.901 [INFO] 
2018-03-02T00:20:22.902 [INFO] --- jacoco-maven-plugin:0.7.9:report (report) @ beam-runners-core-java
---
2018-03-02T00:20:22.903 [INFO] Loading execution data file <https://builds.apache.org/job/beam_PostCommit_Java_ValidatesRunner_Flink/ws/src/runners/core-java/target/jacoco.exec>
2018-03-02T00:20:22.953 [INFO] Analyzed bundle 'Apache Beam :: Runners :: Core Java' with
176 classes
2018-03-02T00:20:23.630 [INFO] 
2018-03-02T00:20:23.631 [INFO] --- maven-jar-plugin:3.0.2:jar (default-jar) @ beam-runners-core-java
---
2018-03-02T00:20:23.662 [INFO] Building jar: <https://builds.apache.org/job/beam_PostCommit_Java_ValidatesRunner_Flink/ws/src/runners/core-java/target/beam-runners-core-java-2.4.0-SNAPSHOT.jar>
2018-03-02T00:20:23.805 [INFO] 
2018-03-02T00:20:23.805 [INFO] --- maven-site-plugin:3.7:attach-descriptor (attach-descriptor)
@ beam-runners-core-java ---
2018-03-02T00:20:23.806 [INFO] Skipping because packaging 'jar' is not pom.
2018-03-02T00:20:24.061 [INFO] 
2018-03-02T00:20:24.061 [INFO] --- maven-jar-plugin:3.0.2:test-jar (default-test-jar) @ beam-runners-core-java
---
2018-03-02T00:20:24.075 [INFO] Building jar: <https://builds.apache.org/job/beam_PostCommit_Java_ValidatesRunner_Flink/ws/src/runners/core-java/target/beam-runners-core-java-2.4.0-SNAPSHOT-tests.jar>
2018-03-02T00:20:24.306 [INFO] 
2018-03-02T00:20:24.306 [INFO] --- maven-shade-plugin:3.1.0:shade (bundle-and-repackage) @
beam-runners-core-java ---
2018-03-02T00:20:24.309 [INFO] Excluding org.apache.beam:beam-model-pipeline:jar:2.4.0-SNAPSHOT
from the shaded jar.
2018-03-02T00:20:24.309 [INFO] Excluding com.google.protobuf:protobuf-java:jar:3.2.0 from
the shaded jar.
2018-03-02T00:20:24.309 [INFO] Excluding org.apache.beam:beam-model-fn-execution:jar:2.4.0-SNAPSHOT
from the shaded jar.
2018-03-02T00:20:24.309 [INFO] Excluding io.grpc:grpc-core:jar:1.2.0 from the shaded jar.
2018-03-02T00:20:24.309 [INFO] Excluding com.google.errorprone:error_prone_annotations:jar:2.0.15
from the shaded jar.
2018-03-02T00:20:24.309 [INFO] Excluding io.grpc:grpc-context:jar:1.2.0 from the shaded jar.
2018-03-02T00:20:24.309 [INFO] Excluding com.google.instrumentation:instrumentation-api:jar:0.3.0
from the shaded jar.
2018-03-02T00:20:24.309 [INFO] Excluding io.grpc:grpc-protobuf:jar:1.2.0 from the shaded jar.
2018-03-02T00:20:24.309 [INFO] Excluding io.grpc:grpc-protobuf-lite:jar:1.2.0 from the shaded
jar.
2018-03-02T00:20:24.309 [INFO] Excluding io.grpc:grpc-stub:jar:1.2.0 from the shaded jar.
2018-03-02T00:20:24.309 [INFO] Excluding org.apache.beam:beam-sdks-java-core:jar:2.4.0-SNAPSHOT
from the shaded jar.
2018-03-02T00:20:24.309 [INFO] Excluding com.fasterxml.jackson.core:jackson-core:jar:2.8.9
from the shaded jar.
2018-03-02T00:20:24.309 [INFO] Excluding com.fasterxml.jackson.core:jackson-annotations:jar:2.8.9
from the shaded jar.
2018-03-02T00:20:24.309 [INFO] Excluding com.fasterxml.jackson.core:jackson-databind:jar:2.8.9
from the shaded jar.
2018-03-02T00:20:24.309 [INFO] Excluding org.slf4j:slf4j-api:jar:1.7.25 from the shaded jar.
2018-03-02T00:20:24.309 [INFO] Excluding net.bytebuddy:byte-buddy:jar:1.7.10 from the shaded
jar.
2018-03-02T00:20:24.309 [INFO] Excluding org.apache.avro:avro:jar:1.8.2 from the shaded jar.
2018-03-02T00:20:24.309 [INFO] Excluding org.codehaus.jackson:jackson-core-asl:jar:1.9.13
from the shaded jar.
2018-03-02T00:20:24.309 [INFO] Excluding org.codehaus.jackson:jackson-mapper-asl:jar:1.9.13
from the shaded jar.
2018-03-02T00:20:24.309 [INFO] Excluding com.thoughtworks.paranamer:paranamer:jar:2.7 from
the shaded jar.
2018-03-02T00:20:24.309 [INFO] Excluding org.tukaani:xz:jar:1.5 from the shaded jar.
2018-03-02T00:20:24.309 [INFO] Excluding org.xerial.snappy:snappy-java:jar:1.1.4 from the
shaded jar.
2018-03-02T00:20:24.309 [INFO] Excluding org.apache.commons:commons-compress:jar:1.14 from
the shaded jar.
2018-03-02T00:20:24.309 [INFO] Excluding org.apache.commons:commons-lang3:jar:3.6 from the
shaded jar.
2018-03-02T00:20:24.309 [INFO] Excluding org.apache.beam:beam-runners-core-construction-java:jar:2.4.0-SNAPSHOT
from the shaded jar.
2018-03-02T00:20:24.309 [INFO] Excluding org.apache.beam:beam-model-job-management:jar:2.4.0-SNAPSHOT
from the shaded jar.
2018-03-02T00:20:24.309 [INFO] Excluding com.google.protobuf:protobuf-java-util:jar:3.2.0
from the shaded jar.
2018-03-02T00:20:24.309 [INFO] Excluding com.google.code.gson:gson:jar:2.7 from the shaded
jar.
2018-03-02T00:20:24.309 [INFO] Excluding com.github.stephenc.findbugs:findbugs-annotations:jar:1.3.9-1
from the shaded jar.
2018-03-02T00:20:24.309 [INFO] Excluding com.google.code.findbugs:jsr305:jar:3.0.1 from the
shaded jar.
2018-03-02T00:20:24.309 [INFO] Including com.google.guava:guava:jar:20.0 in the shaded jar.
2018-03-02T00:20:24.309 [INFO] Excluding joda-time:joda-time:jar:2.4 from the shaded jar.
2018-03-02T00:20:26.431 [INFO] Replacing original artifact with shaded artifact.
2018-03-02T00:20:26.431 [INFO] Replacing <https://builds.apache.org/job/beam_PostCommit_Java_ValidatesRunner_Flink/ws/src/runners/core-java/target/beam-runners-core-java-2.4.0-SNAPSHOT.jar>
with <https://builds.apache.org/job/beam_PostCommit_Java_ValidatesRunner_Flink/ws/src/runners/core-java/target/beam-runners-core-java-2.4.0-SNAPSHOT-shaded.jar>
2018-03-02T00:20:26.431 [INFO] Replacing original test artifact with shaded test artifact.
2018-03-02T00:20:26.432 [INFO] Replacing <https://builds.apache.org/job/beam_PostCommit_Java_ValidatesRunner_Flink/ws/src/runners/core-java/target/beam-runners-core-java-2.4.0-SNAPSHOT-tests.jar>
with <https://builds.apache.org/job/beam_PostCommit_Java_ValidatesRunner_Flink/ws/src/runners/core-java/target/beam-runners-core-java-2.4.0-SNAPSHOT-shaded-tests.jar>
2018-03-02T00:20:26.432 [INFO] Dependency-reduced POM written at: <https://builds.apache.org/job/beam_PostCommit_Java_ValidatesRunner_Flink/ws/src/runners/core-java/dependency-reduced-pom.xml>
2018-03-02T00:20:26.869 [INFO] 
2018-03-02T00:20:26.870 [INFO] --- maven-dependency-plugin:3.0.2:analyze-only (default) @
beam-runners-core-java ---
2018-03-02T00:20:26.994 [INFO] No dependency problems found
[JENKINS] Archiving disabled
2018-03-02T00:20:29.129 [INFO] 
2018-03-02T00:20:29.129 [INFO] ------------------------------------------------------------------------
2018-03-02T00:20:29.129 [INFO] Building Apache Beam :: Runners :: Flink 2.4.0-SNAPSHOT
2018-03-02T00:20:29.129 [INFO] ------------------------------------------------------------------------
2018-03-02T00:20:30.205 [INFO] 
2018-03-02T00:20:30.206 [INFO] --- maven-clean-plugin:3.0.0:clean (default-clean) @ beam-runners-flink_2.11
---
2018-03-02T00:20:30.209 [INFO] Deleting <https://builds.apache.org/job/beam_PostCommit_Java_ValidatesRunner_Flink/ws/src/runners/flink>
(includes = [**/*.pyc, **/*.egg-info/, **/sdks/python/LICENSE, **/sdks/python/NOTICE, **/sdks/python/README.md,
**/sdks/python/apache_beam/portability/api/*pb2*.*, **/sdks/python/apache_beam/portability/common_urns.py,
**/sdks/python/**/*.c, **/sdks/python/**/*.so, **/sdks/python/**/*.egg], excludes = [])
2018-03-02T00:20:30.357 [INFO] 
2018-03-02T00:20:30.357 [INFO] --- maven-enforcer-plugin:3.0.0-M1:enforce (enforce-maven-version)
@ beam-runners-flink_2.11 ---
2018-03-02T00:20:33.145 [INFO] 
2018-03-02T00:20:33.145 [INFO] --- maven-enforcer-plugin:3.0.0-M1:enforce (enforce) @ beam-runners-flink_2.11
---
2018-03-02T00:20:34.354 [INFO] Adding ignore: module-info
2018-03-02T00:20:35.825 [INFO] 
2018-03-02T00:20:35.825 [INFO] --- maven-enforcer-plugin:3.0.0-M1:enforce (enforce-banned-dependencies)
@ beam-runners-flink_2.11 ---
2018-03-02T00:20:36.031 [INFO] 
2018-03-02T00:20:36.031 [INFO] --- maven-remote-resources-plugin:1.5:process (process-resource-bundles)
@ beam-runners-flink_2.11 ---
2018-03-02T00:20:36.833 [INFO] 
2018-03-02T00:20:36.833 [INFO] --- maven-resources-plugin:3.0.2:resources (default-resources)
@ beam-runners-flink_2.11 ---
2018-03-02T00:20:36.836 [INFO] Using 'UTF-8' encoding to copy filtered resources.
2018-03-02T00:20:36.836 [INFO] Copying 1 resource
2018-03-02T00:20:36.846 [INFO] Copying 3 resources
2018-03-02T00:20:36.954 [INFO] 
2018-03-02T00:20:36.954 [INFO] --- maven-compiler-plugin:3.7.0:compile (default-compile) @
beam-runners-flink_2.11 ---
2018-03-02T00:20:36.970 [INFO] Changes detected - recompiling the module!
2018-03-02T00:20:36.970 [INFO] Compiling 75 source files to <https://builds.apache.org/job/beam_PostCommit_Java_ValidatesRunner_Flink/ws/src/runners/flink/target/classes>
2018-03-02T00:20:39.232 [INFO] <https://builds.apache.org/job/beam_PostCommit_Java_ValidatesRunner_Flink/ws/src/runners/flink/src/main/java/org/apache/beam/runners/flink/translation/wrappers/streaming/io/DedupingOperator.java>:
Some input files use or override a deprecated API.
2018-03-02T00:20:39.232 [INFO] <https://builds.apache.org/job/beam_PostCommit_Java_ValidatesRunner_Flink/ws/src/runners/flink/src/main/java/org/apache/beam/runners/flink/translation/wrappers/streaming/io/DedupingOperator.java>:
Recompile with -Xlint:deprecation for details.
2018-03-02T00:20:39.232 [INFO] <https://builds.apache.org/job/beam_PostCommit_Java_ValidatesRunner_Flink/ws/src/runners/flink/src/main/java/org/apache/beam/runners/flink/FlinkStreamingPipelineTranslator.java>:
Some input files use unchecked or unsafe operations.
2018-03-02T00:20:39.232 [INFO] <https://builds.apache.org/job/beam_PostCommit_Java_ValidatesRunner_Flink/ws/src/runners/flink/src/main/java/org/apache/beam/runners/flink/FlinkStreamingPipelineTranslator.java>:
Recompile with -Xlint:unchecked for details.
2018-03-02T00:20:39.232 [INFO] -------------------------------------------------------------
2018-03-02T00:20:39.232 [ERROR] COMPILATION ERROR : 
2018-03-02T00:20:39.232 [INFO] -------------------------------------------------------------
2018-03-02T00:20:39.232 [ERROR] <https://builds.apache.org/job/beam_PostCommit_Java_ValidatesRunner_Flink/ws/src/runners/flink/src/main/java/org/apache/beam/runners/flink/translation/wrappers/streaming/DoFnOperator.java>:[359,11]
cannot infer type arguments for org.apache.beam.runners.core.ProcessFnRunner<>
  reason: cannot infer type-variable(s) InputT,OutputT,RestrictionT
    (argument mismatch; org.apache.beam.runners.core.DoFnRunner cannot be converted to org.apache.beam.runners.core.SimpleDoFnRunner<org.apache.beam.runners.core.KeyedWorkItem<java.lang.String,org.apache.beam.sdk.values.KV<InputT,RestrictionT>>,OutputT>)
2018-03-02T00:20:39.232 [INFO] 1 error
2018-03-02T00:20:39.232 [INFO] -------------------------------------------------------------
[JENKINS] Archiving disabled
[JENKINS] Archiving disabled
[JENKINS] Archiving disabled
[JENKINS] Archiving disabled
[JENKINS] Archiving disabled
[JENKINS] Archiving disabled
[JENKINS] Archiving disabled
[JENKINS] Archiving disabled
[JENKINS] Archiving disabled
[JENKINS] Archiving disabled
[JENKINS] Archiving disabled
[JENKINS] Archiving disabled
[JENKINS] Archiving disabled
[JENKINS] Archiving disabled
2018-03-02T00:20:50.439 [INFO] ------------------------------------------------------------------------
2018-03-02T00:20:50.439 [INFO] Reactor Summary:
2018-03-02T00:20:50.439 [INFO] 
2018-03-02T00:20:50.439 [INFO] Apache Beam :: Parent .............................. SUCCESS
[ 12.185 s]
2018-03-02T00:20:50.439 [INFO] Apache Beam :: SDKs :: Java :: Build Tools ......... SUCCESS
[ 11.180 s]
2018-03-02T00:20:50.439 [INFO] Apache Beam :: Model ............................... SUCCESS
[  2.169 s]
2018-03-02T00:20:50.439 [INFO] Apache Beam :: Model :: Pipeline ................... SUCCESS
[ 11.545 s]
2018-03-02T00:20:50.439 [INFO] Apache Beam :: Model :: Job Management ............. SUCCESS
[  9.860 s]
2018-03-02T00:20:50.439 [INFO] Apache Beam :: Model :: Fn Execution ............... SUCCESS
[  9.176 s]
2018-03-02T00:20:50.439 [INFO] Apache Beam :: SDKs ................................ SUCCESS
[  2.504 s]
2018-03-02T00:20:50.439 [INFO] Apache Beam :: SDKs :: Java ........................ SUCCESS
[  3.271 s]
2018-03-02T00:20:50.439 [INFO] Apache Beam :: SDKs :: Java :: Core ................ SUCCESS
[02:24 min]
2018-03-02T00:20:50.439 [INFO] Apache Beam :: Runners ............................. SUCCESS
[  3.099 s]
2018-03-02T00:20:50.440 [INFO] Apache Beam :: Runners :: Core Construction Java ... SUCCESS
[ 17.019 s]
2018-03-02T00:20:50.440 [INFO] Apache Beam :: Runners :: Core Java ................ SUCCESS
[ 36.181 s]
2018-03-02T00:20:50.440 [INFO] Apache Beam :: Runners :: Flink .................... FAILURE
[ 10.803 s]
2018-03-02T00:20:50.440 [INFO] ------------------------------------------------------------------------
2018-03-02T00:20:50.440 [INFO] BUILD FAILURE
2018-03-02T00:20:50.440 [INFO] ------------------------------------------------------------------------
2018-03-02T00:20:50.440 [INFO] Total time: 05:51 min
2018-03-02T00:20:50.440 [INFO] Finished at: 2018-03-02T00:20:50Z
2018-03-02T00:20:51.109 [INFO] Final Memory: 126M/1695M
2018-03-02T00:20:51.109 [INFO] ------------------------------------------------------------------------
Waiting for Jenkins to finish collecting data
2018-03-02T00:20:51.623 [ERROR] Failed to execute goal org.apache.maven.plugins:maven-compiler-plugin:3.7.0:compile
(default-compile) on project beam-runners-flink_2.11: Compilation failure
2018-03-02T00:20:51.623 [ERROR] <https://builds.apache.org/job/beam_PostCommit_Java_ValidatesRunner_Flink/ws/src/runners/flink/src/main/java/org/apache/beam/runners/flink/translation/wrappers/streaming/DoFnOperator.java>:[359,11]
cannot infer type arguments for org.apache.beam.runners.core.ProcessFnRunner<>
2018-03-02T00:20:51.623 [ERROR] reason: cannot infer type-variable(s) InputT,OutputT,RestrictionT
2018-03-02T00:20:51.623 [ERROR] (argument mismatch; org.apache.beam.runners.core.DoFnRunner
cannot be converted to org.apache.beam.runners.core.SimpleDoFnRunner<org.apache.beam.runners.core.KeyedWorkItem<java.lang.String,org.apache.beam.sdk.values.KV<InputT,RestrictionT>>,OutputT>)
2018-03-02T00:20:51.623 [ERROR] -> [Help 1]
org.apache.maven.lifecycle.LifecycleExecutionException: Failed to execute goal org.apache.maven.plugins:maven-compiler-plugin:3.7.0:compile
(default-compile) on project beam-runners-flink_2.11: Compilation failure
<https://builds.apache.org/job/beam_PostCommit_Java_ValidatesRunner_Flink/ws/src/runners/flink/src/main/java/org/apache/beam/runners/flink/translation/wrappers/streaming/DoFnOperator.java>:[359,11]
cannot infer type arguments for org.apache.beam.runners.core.ProcessFnRunner<>
  reason: cannot infer type-variable(s) InputT,OutputT,RestrictionT
    (argument mismatch; org.apache.beam.runners.core.DoFnRunner cannot be converted to org.apache.beam.runners.core.SimpleDoFnRunner<org.apache.beam.runners.core.KeyedWorkItem<java.lang.String,org.apache.beam.sdk.values.KV<InputT,RestrictionT>>,OutputT>)

    at org.apache.maven.lifecycle.internal.MojoExecutor.execute (MojoExecutor.java:213)
    at org.apache.maven.lifecycle.internal.MojoExecutor.execute (MojoExecutor.java:154)
    at org.apache.maven.lifecycle.internal.MojoExecutor.execute (MojoExecutor.java:146)
    at org.apache.maven.lifecycle.internal.LifecycleModuleBuilder.buildProject (LifecycleModuleBuilder.java:117)
    at org.apache.maven.lifecycle.internal.LifecycleModuleBuilder.buildProject (LifecycleModuleBuilder.java:81)
    at org.apache.maven.lifecycle.internal.builder.singlethreaded.SingleThreadedBuilder.build
(SingleThreadedBuilder.java:51)
    at org.apache.maven.lifecycle.internal.LifecycleStarter.execute (LifecycleStarter.java:128)
    at org.apache.maven.DefaultMaven.doExecute (DefaultMaven.java:309)
    at org.apache.maven.DefaultMaven.doExecute (DefaultMaven.java:194)
    at org.apache.maven.DefaultMaven.execute (DefaultMaven.java:107)
    at org.jvnet.hudson.maven3.launcher.Maven35Launcher.main (Maven35Launcher.java:130)
    at sun.reflect.NativeMethodAccessorImpl.invoke0 (Native Method)
    at sun.reflect.NativeMethodAccessorImpl.invoke (NativeMethodAccessorImpl.java:62)
    at sun.reflect.DelegatingMethodAccessorImpl.invoke (DelegatingMethodAccessorImpl.java:43)
    at java.lang.reflect.Method.invoke (Method.java:498)
    at org.codehaus.plexus.classworlds.launcher.Launcher.launchEnhanced (Launcher.java:289)
    at org.codehaus.plexus.classworlds.launcher.Launcher.launch (Launcher.java:229)
    at jenkins.maven3.agent.Maven35Main.launch (Maven35Main.java:176)
    at sun.reflect.NativeMethodAccessorImpl.invoke0 (Native Method)
    at sun.reflect.NativeMethodAccessorImpl.invoke (NativeMethodAccessorImpl.java:62)
    at sun.reflect.DelegatingMethodAccessorImpl.invoke (DelegatingMethodAccessorImpl.java:43)
    at java.lang.reflect.Method.invoke (Method.java:498)
    at hudson.maven.Maven3Builder.call (Maven3Builder.java:139)
    at hudson.maven.Maven3Builder.call (Maven3Builder.java:70)
    at hudson.remoting.UserRequest.perform (UserRequest.java:207)
    at hudson.remoting.UserRequest.perform (UserRequest.java:53)
    at hudson.remoting.Request$2.run (Request.java:358)
    at hudson.remoting.InterceptingExecutorService$1.call (InterceptingExecutorService.java:72)
    at java.util.concurrent.FutureTask.run (FutureTask.java:266)
    at java.util.concurrent.ThreadPoolExecutor.runWorker (ThreadPoolExecutor.java:1149)
    at java.util.concurrent.ThreadPoolExecutor$Worker.run (ThreadPoolExecutor.java:624)
    at java.lang.Thread.run (Thread.java:748)
Caused by: org.apache.maven.plugin.compiler.CompilationFailureException: Compilation failure
<https://builds.apache.org/job/beam_PostCommit_Java_ValidatesRunner_Flink/ws/src/runners/flink/src/main/java/org/apache/beam/runners/flink/translation/wrappers/streaming/DoFnOperator.java>:[359,11]
cannot infer type arguments for org.apache.beam.runners.core.ProcessFnRunner<>
  reason: cannot infer type-variable(s) InputT,OutputT,RestrictionT
    (argument mismatch; org.apache.beam.runners.core.DoFnRunner cannot be converted to org.apache.beam.runners.core.SimpleDoFnRunner<org.apache.beam.runners.core.KeyedWorkItem<java.lang.String,org.apache.beam.sdk.values.KV<InputT,RestrictionT>>,OutputT>)

    at org.apache.maven.plugin.compiler.AbstractCompilerMojo.execute (AbstractCompilerMojo.java:1161)
    at org.apache.maven.plugin.compiler.CompilerMojo.execute (CompilerMojo.java:168)
    at org.apache.maven.plugin.DefaultBuildPluginManager.executeMojo (DefaultBuildPluginManager.java:134)
    at org.apache.maven.lifecycle.internal.MojoExecutor.execute (MojoExecutor.java:208)
    at org.apache.maven.lifecycle.internal.MojoExecutor.execute (MojoExecutor.java:154)
    at org.apache.maven.lifecycle.internal.MojoExecutor.execute (MojoExecutor.java:146)
    at org.apache.maven.lifecycle.internal.LifecycleModuleBuilder.buildProject (LifecycleModuleBuilder.java:117)
    at org.apache.maven.lifecycle.internal.LifecycleModuleBuilder.buildProject (LifecycleModuleBuilder.java:81)
    at org.apache.maven.lifecycle.internal.builder.singlethreaded.SingleThreadedBuilder.build
(SingleThreadedBuilder.java:51)
    at org.apache.maven.lifecycle.internal.LifecycleStarter.execute (LifecycleStarter.java:128)
    at org.apache.maven.DefaultMaven.doExecute (DefaultMaven.java:309)
    at org.apache.maven.DefaultMaven.doExecute (DefaultMaven.java:194)
    at org.apache.maven.DefaultMaven.execute (DefaultMaven.java:107)
    at org.jvnet.hudson.maven3.launcher.Maven35Launcher.main (Maven35Launcher.java:130)
    at sun.reflect.NativeMethodAccessorImpl.invoke0 (Native Method)
    at sun.reflect.NativeMethodAccessorImpl.invoke (NativeMethodAccessorImpl.java:62)
    at sun.reflect.DelegatingMethodAccessorImpl.invoke (DelegatingMethodAccessorImpl.java:43)
    at java.lang.reflect.Method.invoke (Method.java:498)
    at org.codehaus.plexus.classworlds.launcher.Launcher.launchEnhanced (Launcher.java:289)
    at org.codehaus.plexus.classworlds.launcher.Launcher.launch (Launcher.java:229)
    at jenkins.maven3.agent.Maven35Main.launch (Maven35Main.java:176)
    at sun.reflect.NativeMethodAccessorImpl.invoke0 (Native Method)
    at sun.reflect.NativeMethodAccessorImpl.invoke (NativeMethodAccessorImpl.java:62)
    at sun.reflect.DelegatingMethodAccessorImpl.invoke (DelegatingMethodAccessorImpl.java:43)
    at java.lang.reflect.Method.invoke (Method.java:498)
    at hudson.maven.Maven3Builder.call (Maven3Builder.java:139)
    at hudson.maven.Maven3Builder.call (Maven3Builder.java:70)
    at hudson.remoting.UserRequest.perform (UserRequest.java:207)
    at hudson.remoting.UserRequest.perform (UserRequest.java:53)
    at hudson.remoting.Request$2.run (Request.java:358)
    at hudson.remoting.InterceptingExecutorService$1.call (InterceptingExecutorService.java:72)
    at java.util.concurrent.FutureTask.run (FutureTask.java:266)
    at java.util.concurrent.ThreadPoolExecutor.runWorker (ThreadPoolExecutor.java:1149)
    at java.util.concurrent.ThreadPoolExecutor$Worker.run (ThreadPoolExecutor.java:624)
    at java.lang.Thread.run (Thread.java:748)
2018-03-02T00:20:51.629 [ERROR] 
2018-03-02T00:20:51.630 [ERROR] Re-run Maven using the -X switch to enable full debug logging.
2018-03-02T00:20:51.630 [ERROR] 
2018-03-02T00:20:51.630 [ERROR] For more information about the errors and possible solutions,
please read the following articles:
2018-03-02T00:20:51.630 [ERROR] [Help 1] http://cwiki.apache.org/confluence/display/MAVEN/MojoFailureException
2018-03-02T00:20:51.630 [ERROR] 
2018-03-02T00:20:51.630 [ERROR] After correcting the problems, you can resume the build with
the command
2018-03-02T00:20:51.630 [ERROR]   mvn <goals> -rf :beam-runners-flink_2.11
channel stopped

Mime
View raw message