beam-commits mailing list archives

Site index · List index
Message view « Date » · « Thread »
Top « Date » · « Thread »
From Apache Jenkins Server <jenk...@builds.apache.org>
Subject Build failed in Jenkins: beam_PostCommit_Python_ValidatesRunner_Dataflow #1134
Date Sun, 18 Mar 2018 15:28:51 GMT
See <https://builds.apache.org/job/beam_PostCommit_Python_ValidatesRunner_Dataflow/1134/display/redirect>

------------------------------------------
[...truncated 81.55 KB...]
  File was already downloaded /tmp/dataflow-requirements-cache/setuptools-39.0.1.zip
Collecting six (from pyhamcrest->-r postcommit_requirements.txt (line 1))
  File was already downloaded /tmp/dataflow-requirements-cache/six-1.11.0.tar.gz
Collecting funcsigs>=1 (from mock->-r postcommit_requirements.txt (line 2))
  File was already downloaded /tmp/dataflow-requirements-cache/funcsigs-1.0.2.tar.gz
Collecting pbr>=0.11 (from mock->-r postcommit_requirements.txt (line 2))
  File was already downloaded /tmp/dataflow-requirements-cache/pbr-3.1.1.tar.gz
Successfully downloaded pyhamcrest mock setuptools six funcsigs pbr
test_empty_singleton_side_input (apache_beam.transforms.sideinputs_test.SideInputsTest) ...
ok
test_flattened_side_input (apache_beam.transforms.sideinputs_test.SideInputsTest) ... ok
test_iterable_side_input (apache_beam.transforms.sideinputs_test.SideInputsTest) ... ok
test_multi_valued_singleton_side_input (apache_beam.transforms.sideinputs_test.SideInputsTest)
... ok

======================================================================
ERROR: test_multiple_empty_outputs (apache_beam.transforms.ptransform_test.PTransformTest)
----------------------------------------------------------------------
Traceback (most recent call last):
  File "<https://builds.apache.org/job/beam_PostCommit_Python_ValidatesRunner_Dataflow/ws/src/sdks/python/apache_beam/transforms/ptransform_test.py",>
line 271, in test_multiple_empty_outputs
    pipeline.run()
  File "<https://builds.apache.org/job/beam_PostCommit_Python_ValidatesRunner_Dataflow/ws/src/sdks/python/apache_beam/testing/test_pipeline.py",>
line 102, in run
    result = super(TestPipeline, self).run()
  File "<https://builds.apache.org/job/beam_PostCommit_Python_ValidatesRunner_Dataflow/ws/src/sdks/python/apache_beam/pipeline.py",>
line 369, in run
    self.to_runner_api(), self.runner, self._options).run(False)
  File "<https://builds.apache.org/job/beam_PostCommit_Python_ValidatesRunner_Dataflow/ws/src/sdks/python/apache_beam/pipeline.py",>
line 382, in run
    return self.runner.run_pipeline(self)
  File "<https://builds.apache.org/job/beam_PostCommit_Python_ValidatesRunner_Dataflow/ws/src/sdks/python/apache_beam/runners/dataflow/test_dataflow_runner.py",>
line 39, in run_pipeline
    self.result = super(TestDataflowRunner, self).run_pipeline(pipeline)
  File "<https://builds.apache.org/job/beam_PostCommit_Python_ValidatesRunner_Dataflow/ws/src/sdks/python/apache_beam/runners/dataflow/dataflow_runner.py",>
line 324, in run_pipeline
    self.dataflow_client.create_job(self.job), self)
  File "<https://builds.apache.org/job/beam_PostCommit_Python_ValidatesRunner_Dataflow/ws/src/sdks/python/apache_beam/utils/retry.py",>
line 180, in wrapper
    return fun(*args, **kwargs)
  File "<https://builds.apache.org/job/beam_PostCommit_Python_ValidatesRunner_Dataflow/ws/src/sdks/python/apache_beam/runners/dataflow/internal/apiclient.py",>
line 462, in create_job
    self.create_job_description(job)
  File "<https://builds.apache.org/job/beam_PostCommit_Python_ValidatesRunner_Dataflow/ws/src/sdks/python/apache_beam/runners/dataflow/internal/apiclient.py",>
line 492, in create_job_description
    job.options, file_copy=self._gcs_file_copy)
  File "<https://builds.apache.org/job/beam_PostCommit_Python_ValidatesRunner_Dataflow/ws/src/sdks/python/apache_beam/runners/dataflow/internal/dependency.py",>
line 328, in stage_job_resources
    setup_options.requirements_file, requirements_cache_path)
  File "<https://builds.apache.org/job/beam_PostCommit_Python_ValidatesRunner_Dataflow/ws/src/sdks/python/apache_beam/runners/dataflow/internal/dependency.py",>
line 262, in _populate_requirements_cache
    processes.check_call(cmd_args)
  File "<https://builds.apache.org/job/beam_PostCommit_Python_ValidatesRunner_Dataflow/ws/src/sdks/python/apache_beam/utils/processes.py",>
line 44, in check_call
    return subprocess.check_call(*args, **kwargs)
  File "/usr/lib/python2.7/subprocess.py", line 540, in check_call
    raise CalledProcessError(retcode, cmd)
CalledProcessError: Command '['<https://builds.apache.org/job/beam_PostCommit_Python_ValidatesRunner_Dataflow/ws/src/sdks/python/bin/python',>
'-m', 'pip', 'download', '--dest', '/tmp/dataflow-requirements-cache', '-r', 'postcommit_requirements.txt',
'--no-binary', ':all:']' returned non-zero exit status 2
-------------------- >> begin captured logging << --------------------
root: DEBUG: PValue computed by Some Numbers/Read (tag None): refcount: 1 => 0
root: DEBUG: PValue computed by ClassifyNumbers/FlatMap(<lambda at ptransform_test.py:265>)
(tag None): refcount: 1 => 0
root: DEBUG: PValue computed by assert_that/WindowInto(WindowIntoFn) (tag None): refcount:
1 => 0
root: DEBUG: PValue computed by assert_that/Create/Read (tag None): refcount: 1 => 0
root: DEBUG: PValue computed by assert_that/ToVoidKey (tag None): refcount: 1 => 0
root: DEBUG: PValue computed by assert_that/Group/pair_with_1 (tag None): refcount: 1 =>
0
root: DEBUG: PValue computed by assert_that/Group/pair_with_0 (tag None): refcount: 1 =>
0
root: DEBUG: PValue computed by assert_that/Group/Flatten (tag None): refcount: 1 => 0
root: DEBUG: PValue computed by assert_that/Group/GroupByKey (tag None): refcount: 1 =>
0
root: DEBUG: PValue computed by assert_that/Group/Map(_merge_tagged_vals_under_key) (tag None):
refcount: 1 => 0
root: DEBUG: PValue computed by assert_that/Unkey (tag None): refcount: 1 => 0
root: DEBUG: PValue computed by ClassifyNumbers/FlatMap(<lambda at ptransform_test.py:265>)
(tag odd): refcount: 1 => 0
root: DEBUG: PValue computed by assert:odd/WindowInto(WindowIntoFn) (tag None): refcount:
1 => 0
root: DEBUG: PValue computed by assert:odd/Create/Read (tag None): refcount: 1 => 0
root: DEBUG: PValue computed by assert:odd/ToVoidKey (tag None): refcount: 1 => 0
root: DEBUG: PValue computed by assert:odd/Group/pair_with_0 (tag None): refcount: 1 =>
0
root: DEBUG: PValue computed by assert:odd/Group/pair_with_1 (tag None): refcount: 1 =>
0
root: DEBUG: PValue computed by assert:odd/Group/Flatten (tag None): refcount: 1 => 0
root: DEBUG: PValue computed by assert:odd/Group/GroupByKey (tag None): refcount: 1 =>
0
root: DEBUG: PValue computed by assert:odd/Group/Map(_merge_tagged_vals_under_key) (tag None):
refcount: 1 => 0
root: DEBUG: PValue computed by assert:odd/Unkey (tag None): refcount: 1 => 0
root: DEBUG: PValue computed by ClassifyNumbers/FlatMap(<lambda at ptransform_test.py:265>)
(tag even): refcount: 1 => 0
root: DEBUG: PValue computed by assert:even/WindowInto(WindowIntoFn) (tag None): refcount:
1 => 0
root: DEBUG: PValue computed by assert:even/Create/Read (tag None): refcount: 1 => 0
root: DEBUG: PValue computed by assert:even/ToVoidKey (tag None): refcount: 1 => 0
root: DEBUG: PValue computed by assert:even/Group/pair_with_0 (tag None): refcount: 1 =>
0
root: DEBUG: PValue computed by assert:even/Group/pair_with_1 (tag None): refcount: 1 =>
0
root: DEBUG: PValue computed by assert:even/Group/Flatten (tag None): refcount: 1 => 0
root: DEBUG: PValue computed by assert:even/Group/GroupByKey (tag None): refcount: 1 =>
0
root: DEBUG: PValue computed by assert:even/Group/Map(_merge_tagged_vals_under_key) (tag None):
refcount: 1 => 0
root: DEBUG: PValue computed by assert:even/Unkey (tag None): refcount: 1 => 0
root: DEBUG: Connecting using Google Application Default Credentials.
root: INFO: Starting GCS upload to gs://temp-storage-for-end-to-end-tests/staging-validatesrunner-test/beamapp-jenkins-0318150036-191800.1521385236.192196/pipeline.pb...
oauth2client.transport: INFO: Attempting refresh to obtain initial access_token
root: INFO: Completed GCS upload to gs://temp-storage-for-end-to-end-tests/staging-validatesrunner-test/beamapp-jenkins-0318150036-191800.1521385236.192196/pipeline.pb
root: INFO: Starting GCS upload to gs://temp-storage-for-end-to-end-tests/staging-validatesrunner-test/beamapp-jenkins-0318150036-191800.1521385236.192196/requirements.txt...
root: INFO: Completed GCS upload to gs://temp-storage-for-end-to-end-tests/staging-validatesrunner-test/beamapp-jenkins-0318150036-191800.1521385236.192196/requirements.txt
root: INFO: Executing command: ['<https://builds.apache.org/job/beam_PostCommit_Python_ValidatesRunner_Dataflow/ws/src/sdks/python/bin/python',>
'-m', 'pip', 'download', '--dest', '/tmp/dataflow-requirements-cache', '-r', 'postcommit_requirements.txt',
'--no-binary', ':all:']
--------------------- >> end captured logging << ---------------------

======================================================================
ERROR: test_par_do_with_multiple_outputs_and_using_yield (apache_beam.transforms.ptransform_test.PTransformTest)
----------------------------------------------------------------------
Traceback (most recent call last):
  File "<https://builds.apache.org/job/beam_PostCommit_Python_ValidatesRunner_Dataflow/ws/src/sdks/python/apache_beam/transforms/ptransform_test.py",>
line 228, in test_par_do_with_multiple_outputs_and_using_yield
    pipeline.run()
  File "<https://builds.apache.org/job/beam_PostCommit_Python_ValidatesRunner_Dataflow/ws/src/sdks/python/apache_beam/testing/test_pipeline.py",>
line 102, in run
    result = super(TestPipeline, self).run()
  File "<https://builds.apache.org/job/beam_PostCommit_Python_ValidatesRunner_Dataflow/ws/src/sdks/python/apache_beam/pipeline.py",>
line 369, in run
    self.to_runner_api(), self.runner, self._options).run(False)
  File "<https://builds.apache.org/job/beam_PostCommit_Python_ValidatesRunner_Dataflow/ws/src/sdks/python/apache_beam/pipeline.py",>
line 382, in run
    return self.runner.run_pipeline(self)
  File "<https://builds.apache.org/job/beam_PostCommit_Python_ValidatesRunner_Dataflow/ws/src/sdks/python/apache_beam/runners/dataflow/test_dataflow_runner.py",>
line 39, in run_pipeline
    self.result = super(TestDataflowRunner, self).run_pipeline(pipeline)
  File "<https://builds.apache.org/job/beam_PostCommit_Python_ValidatesRunner_Dataflow/ws/src/sdks/python/apache_beam/runners/dataflow/dataflow_runner.py",>
line 324, in run_pipeline
    self.dataflow_client.create_job(self.job), self)
  File "<https://builds.apache.org/job/beam_PostCommit_Python_ValidatesRunner_Dataflow/ws/src/sdks/python/apache_beam/utils/retry.py",>
line 180, in wrapper
    return fun(*args, **kwargs)
  File "<https://builds.apache.org/job/beam_PostCommit_Python_ValidatesRunner_Dataflow/ws/src/sdks/python/apache_beam/runners/dataflow/internal/apiclient.py",>
line 462, in create_job
    self.create_job_description(job)
  File "<https://builds.apache.org/job/beam_PostCommit_Python_ValidatesRunner_Dataflow/ws/src/sdks/python/apache_beam/runners/dataflow/internal/apiclient.py",>
line 492, in create_job_description
    job.options, file_copy=self._gcs_file_copy)
  File "<https://builds.apache.org/job/beam_PostCommit_Python_ValidatesRunner_Dataflow/ws/src/sdks/python/apache_beam/runners/dataflow/internal/dependency.py",>
line 328, in stage_job_resources
    setup_options.requirements_file, requirements_cache_path)
  File "<https://builds.apache.org/job/beam_PostCommit_Python_ValidatesRunner_Dataflow/ws/src/sdks/python/apache_beam/runners/dataflow/internal/dependency.py",>
line 262, in _populate_requirements_cache
    processes.check_call(cmd_args)
  File "<https://builds.apache.org/job/beam_PostCommit_Python_ValidatesRunner_Dataflow/ws/src/sdks/python/apache_beam/utils/processes.py",>
line 44, in check_call
    return subprocess.check_call(*args, **kwargs)
  File "/usr/lib/python2.7/subprocess.py", line 540, in check_call
    raise CalledProcessError(retcode, cmd)
CalledProcessError: Command '['<https://builds.apache.org/job/beam_PostCommit_Python_ValidatesRunner_Dataflow/ws/src/sdks/python/bin/python',>
'-m', 'pip', 'download', '--dest', '/tmp/dataflow-requirements-cache', '-r', 'postcommit_requirements.txt',
'--no-binary', ':all:']' returned non-zero exit status 2
-------------------- >> begin captured logging << --------------------
root: DEBUG: PValue computed by Some Numbers/Read (tag None): refcount: 1 => 0
root: DEBUG: PValue computed by ClassifyNumbers/ParDo(SomeDoFn) (tag None): refcount: 1 =>
0
root: DEBUG: PValue computed by assert_that/WindowInto(WindowIntoFn) (tag None): refcount:
1 => 0
root: DEBUG: PValue computed by assert_that/Create/Read (tag None): refcount: 1 => 0
root: DEBUG: PValue computed by assert_that/ToVoidKey (tag None): refcount: 1 => 0
root: DEBUG: PValue computed by assert_that/Group/pair_with_1 (tag None): refcount: 1 =>
0
root: DEBUG: PValue computed by assert_that/Group/pair_with_0 (tag None): refcount: 1 =>
0
root: DEBUG: PValue computed by assert_that/Group/Flatten (tag None): refcount: 1 => 0
root: DEBUG: PValue computed by assert_that/Group/GroupByKey (tag None): refcount: 1 =>
0
root: DEBUG: PValue computed by assert_that/Group/Map(_merge_tagged_vals_under_key) (tag None):
refcount: 1 => 0
root: DEBUG: PValue computed by assert_that/Unkey (tag None): refcount: 1 => 0
root: DEBUG: PValue computed by ClassifyNumbers/ParDo(SomeDoFn) (tag odd): refcount: 1 =>
0
root: DEBUG: PValue computed by assert:odd/WindowInto(WindowIntoFn) (tag None): refcount:
1 => 0
root: DEBUG: PValue computed by assert:odd/Create/Read (tag None): refcount: 1 => 0
root: DEBUG: PValue computed by assert:odd/ToVoidKey (tag None): refcount: 1 => 0
root: DEBUG: PValue computed by assert:odd/Group/pair_with_0 (tag None): refcount: 1 =>
0
root: DEBUG: PValue computed by assert:odd/Group/pair_with_1 (tag None): refcount: 1 =>
0
root: DEBUG: PValue computed by assert:odd/Group/Flatten (tag None): refcount: 1 => 0
root: DEBUG: PValue computed by assert:odd/Group/GroupByKey (tag None): refcount: 1 =>
0
root: DEBUG: PValue computed by assert:odd/Group/Map(_merge_tagged_vals_under_key) (tag None):
refcount: 1 => 0
root: DEBUG: PValue computed by assert:odd/Unkey (tag None): refcount: 1 => 0
root: DEBUG: PValue computed by ClassifyNumbers/ParDo(SomeDoFn) (tag even): refcount: 1 =>
0
root: DEBUG: PValue computed by assert:even/WindowInto(WindowIntoFn) (tag None): refcount:
1 => 0
root: DEBUG: PValue computed by assert:even/Create/Read (tag None): refcount: 1 => 0
root: DEBUG: PValue computed by assert:even/ToVoidKey (tag None): refcount: 1 => 0
root: DEBUG: PValue computed by assert:even/Group/pair_with_0 (tag None): refcount: 1 =>
0
root: DEBUG: PValue computed by assert:even/Group/pair_with_1 (tag None): refcount: 1 =>
0
root: DEBUG: PValue computed by assert:even/Group/Flatten (tag None): refcount: 1 => 0
root: DEBUG: PValue computed by assert:even/Group/GroupByKey (tag None): refcount: 1 =>
0
root: DEBUG: PValue computed by assert:even/Group/Map(_merge_tagged_vals_under_key) (tag None):
refcount: 1 => 0
root: DEBUG: PValue computed by assert:even/Unkey (tag None): refcount: 1 => 0
root: DEBUG: Connecting using Google Application Default Credentials.
root: INFO: Starting GCS upload to gs://temp-storage-for-end-to-end-tests/staging-validatesrunner-test/beamapp-jenkins-0318150036-214406.1521385236.214702/pipeline.pb...
oauth2client.transport: INFO: Attempting refresh to obtain initial access_token
root: INFO: Completed GCS upload to gs://temp-storage-for-end-to-end-tests/staging-validatesrunner-test/beamapp-jenkins-0318150036-214406.1521385236.214702/pipeline.pb
root: INFO: Starting GCS upload to gs://temp-storage-for-end-to-end-tests/staging-validatesrunner-test/beamapp-jenkins-0318150036-214406.1521385236.214702/requirements.txt...
root: INFO: Completed GCS upload to gs://temp-storage-for-end-to-end-tests/staging-validatesrunner-test/beamapp-jenkins-0318150036-214406.1521385236.214702/requirements.txt
root: INFO: Executing command: ['<https://builds.apache.org/job/beam_PostCommit_Python_ValidatesRunner_Dataflow/ws/src/sdks/python/bin/python',>
'-m', 'pip', 'download', '--dest', '/tmp/dataflow-requirements-cache', '-r', 'postcommit_requirements.txt',
'--no-binary', ':all:']
--------------------- >> end captured logging << ---------------------

======================================================================
ERROR: test_flatten_multiple_pcollections_having_multiple_consumers (apache_beam.transforms.ptransform_test.PTransformTest)
----------------------------------------------------------------------
Traceback (most recent call last):
  File "<https://builds.apache.org/job/beam_PostCommit_Python_ValidatesRunner_Dataflow/ws/src/sdks/python/apache_beam/transforms/ptransform_test.py",>
line 558, in test_flatten_multiple_pcollections_having_multiple_consumers
    pipeline.run()
  File "<https://builds.apache.org/job/beam_PostCommit_Python_ValidatesRunner_Dataflow/ws/src/sdks/python/apache_beam/testing/test_pipeline.py",>
line 102, in run
    result = super(TestPipeline, self).run()
  File "<https://builds.apache.org/job/beam_PostCommit_Python_ValidatesRunner_Dataflow/ws/src/sdks/python/apache_beam/pipeline.py",>
line 369, in run
    self.to_runner_api(), self.runner, self._options).run(False)
  File "<https://builds.apache.org/job/beam_PostCommit_Python_ValidatesRunner_Dataflow/ws/src/sdks/python/apache_beam/pipeline.py",>
line 382, in run
    return self.runner.run_pipeline(self)
  File "<https://builds.apache.org/job/beam_PostCommit_Python_ValidatesRunner_Dataflow/ws/src/sdks/python/apache_beam/runners/dataflow/test_dataflow_runner.py",>
line 39, in run_pipeline
    self.result = super(TestDataflowRunner, self).run_pipeline(pipeline)
  File "<https://builds.apache.org/job/beam_PostCommit_Python_ValidatesRunner_Dataflow/ws/src/sdks/python/apache_beam/runners/dataflow/dataflow_runner.py",>
line 324, in run_pipeline
    self.dataflow_client.create_job(self.job), self)
  File "<https://builds.apache.org/job/beam_PostCommit_Python_ValidatesRunner_Dataflow/ws/src/sdks/python/apache_beam/utils/retry.py",>
line 180, in wrapper
    return fun(*args, **kwargs)
  File "<https://builds.apache.org/job/beam_PostCommit_Python_ValidatesRunner_Dataflow/ws/src/sdks/python/apache_beam/runners/dataflow/internal/apiclient.py",>
line 462, in create_job
    self.create_job_description(job)
  File "<https://builds.apache.org/job/beam_PostCommit_Python_ValidatesRunner_Dataflow/ws/src/sdks/python/apache_beam/runners/dataflow/internal/apiclient.py",>
line 492, in create_job_description
    job.options, file_copy=self._gcs_file_copy)
  File "<https://builds.apache.org/job/beam_PostCommit_Python_ValidatesRunner_Dataflow/ws/src/sdks/python/apache_beam/runners/dataflow/internal/dependency.py",>
line 328, in stage_job_resources
    setup_options.requirements_file, requirements_cache_path)
  File "<https://builds.apache.org/job/beam_PostCommit_Python_ValidatesRunner_Dataflow/ws/src/sdks/python/apache_beam/runners/dataflow/internal/dependency.py",>
line 262, in _populate_requirements_cache
    processes.check_call(cmd_args)
  File "<https://builds.apache.org/job/beam_PostCommit_Python_ValidatesRunner_Dataflow/ws/src/sdks/python/apache_beam/utils/processes.py",>
line 44, in check_call
    return subprocess.check_call(*args, **kwargs)
  File "/usr/lib/python2.7/subprocess.py", line 540, in check_call
    raise CalledProcessError(retcode, cmd)
CalledProcessError: Command '['<https://builds.apache.org/job/beam_PostCommit_Python_ValidatesRunner_Dataflow/ws/src/sdks/python/bin/python',>
'-m', 'pip', 'download', '--dest', '/tmp/dataflow-requirements-cache', '-r', 'postcommit_requirements.txt',
'--no-binary', ':all:']' returned non-zero exit status 2
-------------------- >> begin captured logging << --------------------
root: DEBUG: PValue computed by Start/Read (tag None): refcount: 1 => 0
root: DEBUG: PValue computed by Map(split_even_odd)/Map(split_even_odd) (tag even_length):
refcount: 2 => 1
root: DEBUG: PValue computed by Map(split_even_odd)/Map(split_even_odd) (tag odd_length):
refcount: 2 => 1
root: DEBUG: PValue computed by Flatten (tag None): refcount: 1 => 0
root: DEBUG: PValue computed by assert_that/WindowInto(WindowIntoFn) (tag None): refcount:
1 => 0
root: DEBUG: PValue computed by assert_that/Create/Read (tag None): refcount: 1 => 0
root: DEBUG: PValue computed by assert_that/ToVoidKey (tag None): refcount: 1 => 0
root: DEBUG: PValue computed by assert_that/Group/pair_with_0 (tag None): refcount: 1 =>
0
root: DEBUG: PValue computed by assert_that/Group/pair_with_1 (tag None): refcount: 1 =>
0
root: DEBUG: PValue computed by assert_that/Group/Flatten (tag None): refcount: 1 => 0
root: DEBUG: PValue computed by assert_that/Group/GroupByKey (tag None): refcount: 1 =>
0
root: DEBUG: PValue computed by assert_that/Group/Map(_merge_tagged_vals_under_key) (tag None):
refcount: 1 => 0
root: DEBUG: PValue computed by assert_that/Unkey (tag None): refcount: 1 => 0
root: DEBUG: PValue computed by Map(split_even_odd)/Map(split_even_odd) (tag even_length):
refcount: 1 => 0
root: DEBUG: PValue computed by assert:even/WindowInto(WindowIntoFn) (tag None): refcount:
1 => 0
root: DEBUG: PValue computed by assert:even/Create/Read (tag None): refcount: 1 => 0
root: DEBUG: PValue computed by assert:even/ToVoidKey (tag None): refcount: 1 => 0
root: DEBUG: PValue computed by assert:even/Group/pair_with_0 (tag None): refcount: 1 =>
0
root: DEBUG: PValue computed by assert:even/Group/pair_with_1 (tag None): refcount: 1 =>
0
root: DEBUG: PValue computed by assert:even/Group/Flatten (tag None): refcount: 1 => 0
root: DEBUG: PValue computed by assert:even/Group/GroupByKey (tag None): refcount: 1 =>
0
root: DEBUG: PValue computed by assert:even/Group/Map(_merge_tagged_vals_under_key) (tag None):
refcount: 1 => 0
root: DEBUG: PValue computed by assert:even/Unkey (tag None): refcount: 1 => 0
root: DEBUG: PValue computed by Map(split_even_odd)/Map(split_even_odd) (tag odd_length):
refcount: 1 => 0
root: DEBUG: PValue computed by assert:odd/WindowInto(WindowIntoFn) (tag None): refcount:
1 => 0
root: DEBUG: PValue computed by assert:odd/Create/Read (tag None): refcount: 1 => 0
root: DEBUG: PValue computed by assert:odd/ToVoidKey (tag None): refcount: 1 => 0
root: DEBUG: PValue computed by assert:odd/Group/pair_with_0 (tag None): refcount: 1 =>
0
root: DEBUG: PValue computed by assert:odd/Group/pair_with_1 (tag None): refcount: 1 =>
0
root: DEBUG: PValue computed by assert:odd/Group/Flatten (tag None): refcount: 1 => 0
root: DEBUG: PValue computed by assert:odd/Group/GroupByKey (tag None): refcount: 1 =>
0
root: DEBUG: PValue computed by assert:odd/Group/Map(_merge_tagged_vals_under_key) (tag None):
refcount: 1 => 0
root: DEBUG: PValue computed by assert:odd/Unkey (tag None): refcount: 1 => 0
root: DEBUG: Connecting using Google Application Default Credentials.
root: INFO: Starting GCS upload to gs://temp-storage-for-end-to-end-tests/staging-validatesrunner-test/beamapp-jenkins-0318150035-901732.1521385235.902013/pipeline.pb...
oauth2client.transport: INFO: Attempting refresh to obtain initial access_token
root: INFO: Completed GCS upload to gs://temp-storage-for-end-to-end-tests/staging-validatesrunner-test/beamapp-jenkins-0318150035-901732.1521385235.902013/pipeline.pb
root: INFO: Starting GCS upload to gs://temp-storage-for-end-to-end-tests/staging-validatesrunner-test/beamapp-jenkins-0318150035-901732.1521385235.902013/requirements.txt...
root: INFO: Completed GCS upload to gs://temp-storage-for-end-to-end-tests/staging-validatesrunner-test/beamapp-jenkins-0318150035-901732.1521385235.902013/requirements.txt
root: INFO: Executing command: ['<https://builds.apache.org/job/beam_PostCommit_Python_ValidatesRunner_Dataflow/ws/src/sdks/python/bin/python',>
'-m', 'pip', 'download', '--dest', '/tmp/dataflow-requirements-cache', '-r', 'postcommit_requirements.txt',
'--no-binary', ':all:']
--------------------- >> end captured logging << ---------------------

----------------------------------------------------------------------
Ran 16 tests in 1696.190s

FAILED (errors=3)
Found: https://console.cloud.google.com/dataflow/jobsDetail/locations/us-central1/jobs/2018-03-18_08_00_51-7806688156085498600?project=apache-beam-testing
Found: https://console.cloud.google.com/dataflow/jobsDetail/locations/us-central1/jobs/2018-03-18_08_07_39-14959790106457826911?project=apache-beam-testing
Found: https://console.cloud.google.com/dataflow/jobsDetail/locations/us-central1/jobs/2018-03-18_08_14_34-1115904946470667991?project=apache-beam-testing
Found: https://console.cloud.google.com/dataflow/jobsDetail/locations/us-central1/jobs/2018-03-18_08_22_14-15809098695296516591?project=apache-beam-testing
Found: https://console.cloud.google.com/dataflow/jobsDetail/locations/us-central1/jobs/2018-03-18_08_00_55-9246161493613455261?project=apache-beam-testing
Found: https://console.cloud.google.com/dataflow/jobsDetail/locations/us-central1/jobs/2018-03-18_08_08_11-18360549562109875445?project=apache-beam-testing
Found: https://console.cloud.google.com/dataflow/jobsDetail/locations/us-central1/jobs/2018-03-18_08_15_20-14092966316990000232?project=apache-beam-testing
Found: https://console.cloud.google.com/dataflow/jobsDetail/locations/us-central1/jobs/2018-03-18_08_00_48-17904772913171598369?project=apache-beam-testing
Found: https://console.cloud.google.com/dataflow/jobsDetail/locations/us-central1/jobs/2018-03-18_08_08_47-17606792269474186463?project=apache-beam-testing
Found: https://console.cloud.google.com/dataflow/jobsDetail/locations/us-central1/jobs/2018-03-18_08_15_46-5474626324175943893?project=apache-beam-testing
Found: https://console.cloud.google.com/dataflow/jobsDetail/locations/us-central1/jobs/2018-03-18_08_00_50-2606120373339479939?project=apache-beam-testing
Found: https://console.cloud.google.com/dataflow/jobsDetail/locations/us-central1/jobs/2018-03-18_08_08_55-12875509952053043741?project=apache-beam-testing
Found: https://console.cloud.google.com/dataflow/jobsDetail/locations/us-central1/jobs/2018-03-18_08_15_29-12128652092349876488?project=apache-beam-testing
Build step 'Execute shell' marked build as failure

Mime
View raw message