beam-commits mailing list archives: March 2018

Site index · List index
Message list« Previous · 1 · 2 · 3 · 4 · 5 · 6 · 7 · 8 · 9 · 10 · 11 · 12 · 13 · 14 · 15 · 16 · 17 · 18 · 19 · 20 · 21 · 22 · Next »Thread · Author · Date
Apache Jenkins Server Build failed in Jenkins: beam_PerformanceTests_JDBC #277 Fri, 02 Mar, 00:23
Apache Jenkins Server   Jenkins build is back to normal : beam_PerformanceTests_JDBC #278 Fri, 02 Mar, 06:17
[jira] [Created] (BEAM-3770) The problem of kafkaIO sdk for data latency
Rick Lin (JIRA)   [jira] [Created] (BEAM-3770) The problem of kafkaIO sdk for data latency Fri, 02 Mar, 01:05
Raghu Angadi (JIRA)   [jira] [Commented] (BEAM-3770) The problem of kafkaIO sdk for data latency Fri, 02 Mar, 22:37
Raghu Angadi (JIRA)   [jira] [Resolved] (BEAM-3770) The problem of kafkaIO sdk for data latency Fri, 02 Mar, 22:38
[jira] [Assigned] (BEAM-3694) [SQL] Update SQL documentation
Anton Kedin (JIRA)   [jira] [Assigned] (BEAM-3694) [SQL] Update SQL documentation Fri, 02 Mar, 01:34
[jira] [Closed] (BEAM-3345) [SQL] Reject Unsupported Joins
Anton Kedin (JIRA)   [jira] [Closed] (BEAM-3345) [SQL] Reject Unsupported Joins Fri, 02 Mar, 01:35
[jira] [Assigned] (BEAM-3449) [SQL] Document joins
Anton Kedin (JIRA)   [jira] [Assigned] (BEAM-3449) [SQL] Document joins Fri, 02 Mar, 01:35
rober...@apache.org [beam] branch master updated (85acc26 -> 5c3ed3a) Fri, 02 Mar, 01:41
rober...@apache.org   [beam] 01/01: Merge pull request #4784 print() is a function in Python 3 Fri, 02 Mar, 01:41
Apache Jenkins Server Build failed in Jenkins: beam_PostCommit_Java_MavenInstall #6101 Fri, 02 Mar, 02:08
Apache Jenkins Server   Build failed in Jenkins: beam_PostCommit_Java_MavenInstall #6102 Fri, 02 Mar, 03:59
Apache Jenkins Server     Build failed in Jenkins: beam_PostCommit_Java_MavenInstall #6103 Fri, 02 Mar, 07:05
Apache Jenkins Server       Build failed in Jenkins: beam_PostCommit_Java_MavenInstall #6104 Fri, 02 Mar, 09:06
Apache Jenkins Server         Build failed in Jenkins: beam_PostCommit_Java_MavenInstall #6105 Fri, 02 Mar, 09:09
rober...@apache.org [beam] branch master updated: [maven-release-plugin] prepare branch release-2.4.0 Fri, 02 Mar, 07:56
rober...@apache.org [beam] branch release-2.4.0 updated (85acc26 -> 12fe363) Fri, 02 Mar, 07:58
rober...@apache.org [beam] branch master updated: [maven-release-plugin] prepare for next development iteration Fri, 02 Mar, 07:58
rober...@apache.org [beam] branch master updated: Bump Python dev version. Fri, 02 Mar, 08:03
Apache Jenkins Server Build failed in Jenkins: beam_PostCommit_Java_MavenInstall #6106 Fri, 02 Mar, 09:04
Apache Jenkins Server   Build failed in Jenkins: beam_PostCommit_Java_MavenInstall #6107 Fri, 02 Mar, 13:51
Apache Jenkins Server     Build failed in Jenkins: beam_PostCommit_Java_MavenInstall #6108 Fri, 02 Mar, 19:09
Apache Jenkins Server       Build failed in Jenkins: beam_PostCommit_Java_MavenInstall #6109 Fri, 02 Mar, 22:23
Apache Jenkins Server         Jenkins build is back to normal : beam_PostCommit_Java_MavenInstall #6110 Fri, 02 Mar, 23:59
Apache Jenkins Server Build failed in Jenkins: beam_PostRelease_NightlySnapshot #63 Fri, 02 Mar, 11:07
Apache Jenkins Server   Build failed in Jenkins: beam_PostRelease_NightlySnapshot #64 Fri, 02 Mar, 20:25
Apache Jenkins Server     Build failed in Jenkins: beam_PostRelease_NightlySnapshot #65 Fri, 02 Mar, 21:02
Apache Jenkins Server       Build failed in Jenkins: beam_PostRelease_NightlySnapshot #66 Fri, 02 Mar, 21:56
Apache Jenkins Server         Build failed in Jenkins: beam_PostRelease_NightlySnapshot #67 Sat, 03 Mar, 11:09
Apache Jenkins Server           Build failed in Jenkins: beam_PostRelease_NightlySnapshot #68 Sun, 04 Mar, 11:07
Apache Jenkins Server             Build failed in Jenkins: beam_PostRelease_NightlySnapshot #69 Mon, 05 Mar, 11:07
Apache Jenkins Server               Build failed in Jenkins: beam_PostRelease_NightlySnapshot #70 Mon, 05 Mar, 18:33
Apache Jenkins Server                 Build failed in Jenkins: beam_PostRelease_NightlySnapshot #71 Mon, 05 Mar, 18:56
Apache Jenkins Server                   Build failed in Jenkins: beam_PostRelease_NightlySnapshot #72 Mon, 05 Mar, 19:27
Apache Jenkins Server                     Jenkins build is back to normal : beam_PostRelease_NightlySnapshot #73 Mon, 05 Mar, 19:43
Apache Jenkins Server Build failed in Jenkins: beam_PerformanceTests_TextIOIT #219 Fri, 02 Mar, 12:20
Apache Jenkins Server   Jenkins build is back to normal : beam_PerformanceTests_TextIOIT #220 Fri, 02 Mar, 18:06
[jira] [Commented] (BEAM-3726) Kinesis Reader: java.lang.IllegalArgumentException: Attempting to move backwards
Pawel Bartoszek (JIRA)   [jira] [Commented] (BEAM-3726) Kinesis Reader: java.lang.IllegalArgumentException: Attempting to move backwards Fri, 02 Mar, 13:30
Pawel Bartoszek (JIRA)   [jira] [Updated] (BEAM-3726) Kinesis Reader: java.lang.IllegalArgumentException: Attempting to move backwards Fri, 02 Mar, 13:32
Pawel Bartoszek (JIRA)   [jira] [Commented] (BEAM-3726) Kinesis Reader: java.lang.IllegalArgumentException: Attempting to move backwards Fri, 02 Mar, 15:58
Pawel Bartoszek (JIRA)   [jira] [Updated] (BEAM-3726) Kinesis Reader: java.lang.IllegalArgumentException: Attempting to move backwards Fri, 02 Mar, 16:09
Pawel Bartoszek (JIRA)   [jira] [Commented] (BEAM-3726) Kinesis Reader: java.lang.IllegalArgumentException: Attempting to move backwards Fri, 02 Mar, 16:13
Pawel Bartoszek (JIRA)   [jira] [Comment Edited] (BEAM-3726) Kinesis Reader: java.lang.IllegalArgumentException: Attempting to move backwards Fri, 02 Mar, 17:52
Pawel Bartoszek (JIRA)   [jira] [Commented] (BEAM-3726) Kinesis Reader: java.lang.IllegalArgumentException: Attempting to move backwards Fri, 02 Mar, 17:52
Pawel Bartoszek (JIRA)   [jira] [Comment Edited] (BEAM-3726) Kinesis Reader: java.lang.IllegalArgumentException: Attempting to move backwards Fri, 02 Mar, 17:58
Pawel Bartoszek (JIRA)   [jira] [Comment Edited] (BEAM-3726) Kinesis Reader: java.lang.IllegalArgumentException: Attempting to move backwards Fri, 02 Mar, 18:07
Pawel Bartoszek (JIRA)   [jira] [Commented] (BEAM-3726) Kinesis Reader: java.lang.IllegalArgumentException: Attempting to move backwards Sat, 03 Mar, 08:41
Pawel Bartoszek (JIRA)   [jira] [Comment Edited] (BEAM-3726) Kinesis Reader: java.lang.IllegalArgumentException: Attempting to move backwards Sat, 03 Mar, 09:01
Alexey Romanenko (JIRA)   [jira] [Commented] (BEAM-3726) Kinesis Reader: java.lang.IllegalArgumentException: Attempting to move backwards Thu, 15 Mar, 10:05
Alexey Romanenko (JIRA)   [jira] [Updated] (BEAM-3726) Kinesis Reader: java.lang.IllegalArgumentException: Attempting to move backwards Tue, 27 Mar, 07:58
Alexey Romanenko (JIRA)   [jira] [Assigned] (BEAM-3726) Kinesis Reader: java.lang.IllegalArgumentException: Attempting to move backwards Tue, 27 Mar, 07:59
Alexey Romanenko (JIRA)   [jira] [Commented] (BEAM-3726) Kinesis Reader: java.lang.IllegalArgumentException: Attempting to move backwards Tue, 27 Mar, 08:04
Alexey Romanenko (JIRA)   [jira] [Comment Edited] (BEAM-3726) Kinesis Reader: java.lang.IllegalArgumentException: Attempting to move backwards Tue, 27 Mar, 15:17
[jira] [Created] (BEAM-3771) Unable to write using AvroIO without schema
Darshan Mehta (JIRA)   [jira] [Created] (BEAM-3771) Unable to write using AvroIO without schema Fri, 02 Mar, 16:44
Kenneth Knowles (JIRA)   [jira] [Assigned] (BEAM-3771) Unable to write using AvroIO without schema Tue, 06 Mar, 04:59
Kenneth Knowles (JIRA)   [jira] [Updated] (BEAM-3771) Unable to write using AvroIO without schema Tue, 06 Mar, 05:00
Etienne Chauchot (JIRA)   [jira] [Closed] (BEAM-3771) Unable to write using AvroIO without schema Tue, 06 Mar, 10:04
Etienne Chauchot (JIRA)   [jira] [Commented] (BEAM-3771) Unable to write using AvroIO without schema Tue, 06 Mar, 10:04
Darshan Mehta (JIRA)   [jira] [Commented] (BEAM-3771) Unable to write using AvroIO without schema Wed, 07 Mar, 11:22
Etienne Chauchot (JIRA)   [jira] [Commented] (BEAM-3771) Unable to write using AvroIO without schema Wed, 07 Mar, 14:15
[jira] [Commented] (BEAM-3619) Add tests for Python DirectRunner implementation of PubSub I/O
Udi Meiri (JIRA)   [jira] [Commented] (BEAM-3619) Add tests for Python DirectRunner implementation of PubSub I/O Fri, 02 Mar, 16:56
[jira] [Created] (BEAM-3772) BigQueryIO - Can't use DynamicDestination with CREATE_IF_NEEDED for unbounded PCollection and FILE_LOADS
Benjamin BENOIST (JIRA)   [jira] [Created] (BEAM-3772) BigQueryIO - Can't use DynamicDestination with CREATE_IF_NEEDED for unbounded PCollection and FILE_LOADS Fri, 02 Mar, 17:09
Chamikara Jayalath (JIRA)   [jira] [Assigned] (BEAM-3772) BigQueryIO - Can't use DynamicDestination with CREATE_IF_NEEDED for unbounded PCollection and FILE_LOADS Fri, 02 Mar, 17:12
Jonas Grabber (JIRA)   [jira] [Commented] (BEAM-3772) BigQueryIO - Can't use DynamicDestination with CREATE_IF_NEEDED for unbounded PCollection and FILE_LOADS Tue, 06 Mar, 10:49
Reuven Lax (JIRA)   [jira] [Commented] (BEAM-3772) BigQueryIO - Can't use DynamicDestination with CREATE_IF_NEEDED for unbounded PCollection and FILE_LOADS Mon, 19 Mar, 16:41
Benjamin BENOIST (JIRA)   [jira] [Commented] (BEAM-3772) BigQueryIO - Can't use DynamicDestination with CREATE_IF_NEEDED for unbounded PCollection and FILE_LOADS Mon, 19 Mar, 17:14
[jira] [Created] (BEAM-3773) [SQL] Investigate JDBC interface for Beam SQL
Anton Kedin (JIRA)   [jira] [Created] (BEAM-3773) [SQL] Investigate JDBC interface for Beam SQL Fri, 02 Mar, 17:22
[jira] [Commented] (BEAM-3757) Shuffle read failed using python 2.2.0
Jonathan Delfour (JIRA)   [jira] [Commented] (BEAM-3757) Shuffle read failed using python 2.2.0 Fri, 02 Mar, 17:28
Ahmet Altay (JIRA)   [jira] [Resolved] (BEAM-3757) Shuffle read failed using python 2.2.0 Thu, 15 Mar, 23:08
Apache Jenkins Server Build failed in Jenkins: beam_PerformanceTests_JDBC #280 Fri, 02 Mar, 18:08
Apache Jenkins Server   Build failed in Jenkins: beam_PerformanceTests_JDBC #281 Sat, 03 Mar, 00:08
Apache Jenkins Server     Jenkins build is back to normal : beam_PerformanceTests_JDBC #282 Sat, 03 Mar, 06:17
[jira] [Created] (BEAM-3774) Update BigQuery jobs to explicitly specify the region
Chamikara Jayalath (JIRA)   [jira] [Created] (BEAM-3774) Update BigQuery jobs to explicitly specify the region Fri, 02 Mar, 18:32
Chamikara Jayalath (JIRA)   [jira] [Assigned] (BEAM-3774) Update BigQuery jobs to explicitly specify the region Mon, 19 Mar, 01:42
[jira] [Commented] (BEAM-3671) Need Python 3.x interpreter in Jenkins machines
Alan Myrvold (JIRA)   [jira] [Commented] (BEAM-3671) Need Python 3.x interpreter in Jenkins machines Fri, 02 Mar, 19:14
cclauss (JIRA)   [jira] [Commented] (BEAM-3671) Need Python 3.x interpreter in Jenkins machines Mon, 05 Mar, 16:23
Ahmet Altay (JIRA)   [jira] [Resolved] (BEAM-3671) Need Python 3.x interpreter in Jenkins machines Tue, 06 Mar, 00:05
mergebot-r...@apache.org [beam-site] branch mergebot updated (70d586b -> d1f9967) Fri, 02 Mar, 19:19
mergebot-r...@apache.org   [beam-site] 01/03: Update Gemfile.lock Fri, 02 Mar, 19:19
mergebot-r...@apache.org   [beam-site] 02/03: Explicitly define section id due to kramdown id generation changes Fri, 02 Mar, 19:19
mergebot-r...@apache.org   [beam-site] 03/03: This closes #388 Fri, 02 Mar, 19:19
[jira] [Created] (BEAM-3775) Failure in beam_PostCommit_Java_ValidatesRunner_Dataflow/
María GH (JIRA)   [jira] [Created] (BEAM-3775) Failure in beam_PostCommit_Java_ValidatesRunner_Dataflow/ Fri, 02 Mar, 20:29
Alan Myrvold (JIRA)   [jira] [Commented] (BEAM-3775) Failure in beam_PostCommit_Java_ValidatesRunner_Dataflow/ Fri, 02 Mar, 22:10
María GH (JIRA)   [jira] [Commented] (BEAM-3775) Failure in beam_PostCommit_Java_ValidatesRunner_Dataflow/ Fri, 02 Mar, 22:25
[jira] [Updated] (BEAM-2880) Artifact server proxies
Henning Rohde (JIRA)   [jira] [Updated] (BEAM-2880) Artifact server proxies Fri, 02 Mar, 20:39
[jira] [Updated] (BEAM-2882) S3 artifact server proxy
Henning Rohde (JIRA)   [jira] [Updated] (BEAM-2882) S3 artifact server proxy Fri, 02 Mar, 20:42
ieme...@apache.org [beam] branch master updated (90e9ee1 -> 8c134a1) Fri, 02 Mar, 21:03
ieme...@apache.org   [beam] 01/01: Merge pull request #4778: [BEAM-3620] Update Readme and JavaDoc for KafkaIO Fri, 02 Mar, 21:03
Apache Jenkins Server Build failed in Jenkins: beam_PostCommit_Python_ValidatesRunner_Dataflow #1033 Fri, 02 Mar, 21:33
Apache Jenkins Server   Jenkins build is back to normal : beam_PostCommit_Python_ValidatesRunner_Dataflow #1034 Fri, 02 Mar, 23:22
tg...@apache.org [beam] branch master updated (8c134a1 -> 15018c9) Fri, 02 Mar, 22:26
tg...@apache.org   [beam] 01/01: Merge pull request #4787 Fri, 02 Mar, 22:26
[jira] [Commented] (BEAM-3754) KAFKA - Can't set commitOffsetsInFinalizeEnabled to false with KafkaIO.readBytes()
Raghu Angadi (JIRA)   [jira] [Commented] (BEAM-3754) KAFKA - Can't set commitOffsetsInFinalizeEnabled to false with KafkaIO.readBytes() Fri, 02 Mar, 23:51
Raghu Angadi (JIRA)   [jira] [Resolved] (BEAM-3754) KAFKA - Can't set commitOffsetsInFinalizeEnabled to false with KafkaIO.readBytes() Mon, 05 Mar, 23:53
[jira] [Created] (BEAM-3776) StateMerging.mergeWatermarks sets a late watermark hold for late merging windows that depend only on the window
Sam Whittle (JIRA)   [jira] [Created] (BEAM-3776) StateMerging.mergeWatermarks sets a late watermark hold for late merging windows that depend only on the window Sat, 03 Mar, 00:35
ASF GitHub Bot (JIRA)   [jira] [Work logged] (BEAM-3776) StateMerging.mergeWatermarks sets a late watermark hold for late merging windows that depend only on the window Mon, 12 Mar, 18:06
ASF GitHub Bot (JIRA)   [jira] [Work logged] (BEAM-3776) StateMerging.mergeWatermarks sets a late watermark hold for late merging windows that depend only on the window Mon, 12 Mar, 18:06
ASF GitHub Bot (JIRA)   [jira] [Work logged] (BEAM-3776) StateMerging.mergeWatermarks sets a late watermark hold for late merging windows that depend only on the window Mon, 12 Mar, 18:07
ASF GitHub Bot (JIRA)   [jira] [Work logged] (BEAM-3776) StateMerging.mergeWatermarks sets a late watermark hold for late merging windows that depend only on the window Mon, 12 Mar, 18:47
ASF GitHub Bot (JIRA)   [jira] [Work logged] (BEAM-3776) StateMerging.mergeWatermarks sets a late watermark hold for late merging windows that depend only on the window Mon, 12 Mar, 18:47
ASF GitHub Bot (JIRA)   [jira] [Work logged] (BEAM-3776) StateMerging.mergeWatermarks sets a late watermark hold for late merging windows that depend only on the window Mon, 12 Mar, 18:47
ASF GitHub Bot (JIRA)   [jira] [Work logged] (BEAM-3776) StateMerging.mergeWatermarks sets a late watermark hold for late merging windows that depend only on the window Tue, 13 Mar, 22:29
ASF GitHub Bot (JIRA)   [jira] [Work logged] (BEAM-3776) StateMerging.mergeWatermarks sets a late watermark hold for late merging windows that depend only on the window Tue, 13 Mar, 22:32
ASF GitHub Bot (JIRA)   [jira] [Work logged] (BEAM-3776) StateMerging.mergeWatermarks sets a late watermark hold for late merging windows that depend only on the window Tue, 13 Mar, 22:33
ASF GitHub Bot (JIRA)   [jira] [Work logged] (BEAM-3776) StateMerging.mergeWatermarks sets a late watermark hold for late merging windows that depend only on the window Mon, 19 Mar, 18:42
ASF GitHub Bot (JIRA)   [jira] [Work logged] (BEAM-3776) StateMerging.mergeWatermarks sets a late watermark hold for late merging windows that depend only on the window Mon, 19 Mar, 18:42
ASF GitHub Bot (JIRA)   [jira] [Work logged] (BEAM-3776) StateMerging.mergeWatermarks sets a late watermark hold for late merging windows that depend only on the window Mon, 19 Mar, 18:43
ASF GitHub Bot (JIRA)   [jira] [Work logged] (BEAM-3776) StateMerging.mergeWatermarks sets a late watermark hold for late merging windows that depend only on the window Mon, 19 Mar, 19:59
ASF GitHub Bot (JIRA)   [jira] [Work logged] (BEAM-3776) StateMerging.mergeWatermarks sets a late watermark hold for late merging windows that depend only on the window Mon, 19 Mar, 22:16
ASF GitHub Bot (JIRA)   [jira] [Work logged] (BEAM-3776) StateMerging.mergeWatermarks sets a late watermark hold for late merging windows that depend only on the window Mon, 19 Mar, 22:16
ASF GitHub Bot (JIRA)   [jira] [Work logged] (BEAM-3776) StateMerging.mergeWatermarks sets a late watermark hold for late merging windows that depend only on the window Mon, 19 Mar, 22:16
ASF GitHub Bot (JIRA)   [jira] [Work logged] (BEAM-3776) StateMerging.mergeWatermarks sets a late watermark hold for late merging windows that depend only on the window Mon, 19 Mar, 22:16
ASF GitHub Bot (JIRA)   [jira] [Work logged] (BEAM-3776) StateMerging.mergeWatermarks sets a late watermark hold for late merging windows that depend only on the window Mon, 19 Mar, 22:16
ASF GitHub Bot (JIRA)   [jira] [Work logged] (BEAM-3776) StateMerging.mergeWatermarks sets a late watermark hold for late merging windows that depend only on the window Fri, 23 Mar, 22:24
ASF GitHub Bot (JIRA)   [jira] [Work logged] (BEAM-3776) StateMerging.mergeWatermarks sets a late watermark hold for late merging windows that depend only on the window Fri, 23 Mar, 22:25
ASF GitHub Bot (JIRA)   [jira] [Work logged] (BEAM-3776) StateMerging.mergeWatermarks sets a late watermark hold for late merging windows that depend only on the window Fri, 23 Mar, 22:25
ASF GitHub Bot (JIRA)   [jira] [Work logged] (BEAM-3776) StateMerging.mergeWatermarks sets a late watermark hold for late merging windows that depend only on the window Fri, 23 Mar, 22:26
ASF GitHub Bot (JIRA)   [jira] [Work logged] (BEAM-3776) StateMerging.mergeWatermarks sets a late watermark hold for late merging windows that depend only on the window Fri, 23 Mar, 22:28
ASF GitHub Bot (JIRA)   [jira] [Work logged] (BEAM-3776) StateMerging.mergeWatermarks sets a late watermark hold for late merging windows that depend only on the window Fri, 23 Mar, 22:28
ASF GitHub Bot (JIRA)   [jira] [Work logged] (BEAM-3776) StateMerging.mergeWatermarks sets a late watermark hold for late merging windows that depend only on the window Wed, 28 Mar, 15:48
ASF GitHub Bot (JIRA)   [jira] [Work logged] (BEAM-3776) StateMerging.mergeWatermarks sets a late watermark hold for late merging windows that depend only on the window Wed, 28 Mar, 15:50
ASF GitHub Bot (JIRA)   [jira] [Work logged] (BEAM-3776) StateMerging.mergeWatermarks sets a late watermark hold for late merging windows that depend only on the window Wed, 28 Mar, 15:50
ASF GitHub Bot (JIRA)   [jira] [Work logged] (BEAM-3776) StateMerging.mergeWatermarks sets a late watermark hold for late merging windows that depend only on the window Wed, 28 Mar, 15:50
[jira] [Assigned] (BEAM-3255) Update release process to use Gradle
Alan Myrvold (JIRA)   [jira] [Assigned] (BEAM-3255) Update release process to use Gradle Sat, 03 Mar, 01:22
Alan Myrvold (JIRA)   [jira] [Commented] (BEAM-3255) Update release process to use Gradle Mon, 26 Mar, 23:27
chamik...@apache.org [beam] branch master updated (15018c9 -> 2fd60a2) Sat, 03 Mar, 02:13
chamik...@apache.org   [beam] 01/01: Merge pull request #4744: [BEAM-3744] Add support for Pub/Sub messages with attributes Sat, 03 Mar, 02:13
chamik...@apache.org [beam] branch master updated (2fd60a2 -> c285f51) Sat, 03 Mar, 03:14
chamik...@apache.org   [beam] 01/01: Merge pull request #4794: [BEAM-3744] Address review comment from PR #4744 Sat, 03 Mar, 03:14
Apache Jenkins Server Build failed in Jenkins: beam_PostCommit_Python_Verify #4351 Sat, 03 Mar, 03:31
Apache Jenkins Server   Build failed in Jenkins: beam_PostCommit_Python_Verify #4352 Sat, 03 Mar, 05:24
Apache Jenkins Server     Build failed in Jenkins: beam_PostCommit_Python_Verify #4353 Sat, 03 Mar, 09:58
Apache Jenkins Server       Build failed in Jenkins: beam_PostCommit_Python_Verify #4354 Sat, 03 Mar, 15:43
Apache Jenkins Server         Build failed in Jenkins: beam_PostCommit_Python_Verify #4355 Sat, 03 Mar, 22:16
Apache Jenkins Server           Build failed in Jenkins: beam_PostCommit_Python_Verify #4356 Sun, 04 Mar, 03:43
Apache Jenkins Server             Build failed in Jenkins: beam_PostCommit_Python_Verify #4357 Sun, 04 Mar, 06:31
Apache Jenkins Server               Build failed in Jenkins: beam_PostCommit_Python_Verify #4358 Sun, 04 Mar, 10:11
Apache Jenkins Server                 Build failed in Jenkins: beam_PostCommit_Python_Verify #4359 Sun, 04 Mar, 15:42
Apache Jenkins Server                   Build failed in Jenkins: beam_PostCommit_Python_Verify #4360 Sun, 04 Mar, 19:01
Apache Jenkins Server                     Build failed in Jenkins: beam_PostCommit_Python_Verify #4361 Sun, 04 Mar, 21:50
Apache Jenkins Server                       Build failed in Jenkins: beam_PostCommit_Python_Verify #4362 Mon, 05 Mar, 03:42
Apache Jenkins Server                         Build failed in Jenkins: beam_PostCommit_Python_Verify #4363 Mon, 05 Mar, 10:04
Apache Jenkins Server                           Build failed in Jenkins: beam_PostCommit_Python_Verify #4364 Mon, 05 Mar, 15:44
Apache Jenkins Server                             Build failed in Jenkins: beam_PostCommit_Python_Verify #4365 Mon, 05 Mar, 21:51
Apache Jenkins Server                               Build failed in Jenkins: beam_PostCommit_Python_Verify #4366 Tue, 06 Mar, 00:48
Apache Jenkins Server                                 Build failed in Jenkins: beam_PostCommit_Python_Verify #4367 Tue, 06 Mar, 04:38
Apache Jenkins Server                                   Build failed in Jenkins: beam_PostCommit_Python_Verify #4368 Tue, 06 Mar, 06:07
Apache Jenkins Server                                     Build failed in Jenkins: beam_PostCommit_Python_Verify #4369 Tue, 06 Mar, 09:42
Apache Jenkins Server                                       Build failed in Jenkins: beam_PostCommit_Python_Verify #4370 Tue, 06 Mar, 16:38
Apache Jenkins Server                                         Build failed in Jenkins: beam_PostCommit_Python_Verify #4371 Tue, 06 Mar, 18:47
Apache Jenkins Server                                           Build failed in Jenkins: beam_PostCommit_Python_Verify #4372 Tue, 06 Mar, 20:17
Apache Jenkins Server                                             Build failed in Jenkins: beam_PostCommit_Python_Verify #4373 Tue, 06 Mar, 21:00
Apache Jenkins Server                                               Build failed in Jenkins: beam_PostCommit_Python_Verify #4374 Tue, 06 Mar, 22:10
Apache Jenkins Server                                                 Build failed in Jenkins: beam_PostCommit_Python_Verify #4375 Tue, 06 Mar, 22:53
Apache Jenkins Server                                                   Build failed in Jenkins: beam_PostCommit_Python_Verify #4376 Tue, 06 Mar, 23:35
Apache Jenkins Server                                                     Build failed in Jenkins: beam_PostCommit_Python_Verify #4377 Wed, 07 Mar, 01:42
Apache Jenkins Server                                                       Build failed in Jenkins: beam_PostCommit_Python_Verify #4378 Wed, 07 Mar, 03:32
Apache Jenkins Server                                                         Build failed in Jenkins: beam_PostCommit_Python_Verify #4379 Wed, 07 Mar, 04:38
Apache Jenkins Server                                                           Build failed in Jenkins: beam_PostCommit_Python_Verify #4380 Wed, 07 Mar, 09:43
Apache Jenkins Server                                                             Build failed in Jenkins: beam_PostCommit_Python_Verify #4381 Wed, 07 Mar, 15:15
Apache Jenkins Server                                                               Build failed in Jenkins: beam_PostCommit_Python_Verify #4382 Wed, 07 Mar, 15:58
Apache Jenkins Server                                                                 Build failed in Jenkins: beam_PostCommit_Python_Verify #4383 Wed, 07 Mar, 16:57
Apache Jenkins Server                                                                   Build failed in Jenkins: beam_PostCommit_Python_Verify #4384 Wed, 07 Mar, 20:53
Apache Jenkins Server                                                                     Build failed in Jenkins: beam_PostCommit_Python_Verify #4385 Wed, 07 Mar, 22:36
Apache Jenkins Server                                                                       Build failed in Jenkins: beam_PostCommit_Python_Verify #4386 Thu, 08 Mar, 04:39
Apache Jenkins Server                                                                         Build failed in Jenkins: beam_PostCommit_Python_Verify #4387 Thu, 08 Mar, 09:33
Apache Jenkins Server                                                                           Build failed in Jenkins: beam_PostCommit_Python_Verify #4388 Thu, 08 Mar, 10:15
Apache Jenkins Server                                                                             Build failed in Jenkins: beam_PostCommit_Python_Verify #4389 Thu, 08 Mar, 15:43
Apache Jenkins Server                                                                               Build failed in Jenkins: beam_PostCommit_Python_Verify #4390 Thu, 08 Mar, 18:48
Apache Jenkins Server                                                                                 Build failed in Jenkins: beam_PostCommit_Python_Verify #4391 Fri, 09 Mar, 02:54
Apache Jenkins Server                                                                                   Build failed in Jenkins: beam_PostCommit_Python_Verify #4392 Fri, 09 Mar, 03:42
Apache Jenkins Server                                                                                     Build failed in Jenkins: beam_PostCommit_Python_Verify #4393 Fri, 09 Mar, 04:28
Apache Jenkins Server                                                                                       Build failed in Jenkins: beam_PostCommit_Python_Verify #4394 Fri, 09 Mar, 09:43
Apache Jenkins Server                                                                                         Build failed in Jenkins: beam_PostCommit_Python_Verify #4395 Fri, 09 Mar, 15:42
Apache Jenkins Server                                                                                           Build failed in Jenkins: beam_PostCommit_Python_Verify #4396 Fri, 09 Mar, 18:15
Apache Jenkins Server                                                                                             Build failed in Jenkins: beam_PostCommit_Python_Verify #4397 Fri, 09 Mar, 20:22
Apache Jenkins Server                                                                                               Build failed in Jenkins: beam_PostCommit_Python_Verify #4398 Fri, 09 Mar, 22:11
Apache Jenkins Server                                                                                                 Build failed in Jenkins: beam_PostCommit_Python_Verify #4399 Fri, 09 Mar, 23:17
Apache Jenkins Server                                                                                                   Jenkins build is back to normal : beam_PostCommit_Python_Verify #4400 Sat, 10 Mar, 00:07
Apache Jenkins Server Build failed in Jenkins: beam_PostCommit_Python_ValidatesRunner_Dataflow #1035 Sat, 03 Mar, 03:47
Apache Jenkins Server   Build failed in Jenkins: beam_PostCommit_Python_ValidatesRunner_Dataflow #1036 Sat, 03 Mar, 09:15
Apache Jenkins Server     Build failed in Jenkins: beam_PostCommit_Python_ValidatesRunner_Dataflow #1037 Sat, 03 Mar, 15:15
Apache Jenkins Server       Build failed in Jenkins: beam_PostCommit_Python_ValidatesRunner_Dataflow #1038 Sat, 03 Mar, 21:15
Apache Jenkins Server         Build failed in Jenkins: beam_PostCommit_Python_ValidatesRunner_Dataflow #1039 Sun, 04 Mar, 03:15
Apache Jenkins Server           Build failed in Jenkins: beam_PostCommit_Python_ValidatesRunner_Dataflow #1040 Sun, 04 Mar, 06:17
Apache Jenkins Server             Build failed in Jenkins: beam_PostCommit_Python_ValidatesRunner_Dataflow #1041 Sun, 04 Mar, 09:15
Apache Jenkins Server               Build failed in Jenkins: beam_PostCommit_Python_ValidatesRunner_Dataflow #1042 Sun, 04 Mar, 15:15
Apache Jenkins Server                 Build failed in Jenkins: beam_PostCommit_Python_ValidatesRunner_Dataflow #1043 Sun, 04 Mar, 18:54
Apache Jenkins Server                   Build failed in Jenkins: beam_PostCommit_Python_ValidatesRunner_Dataflow #1044 Sun, 04 Mar, 21:15
Apache Jenkins Server                     Build failed in Jenkins: beam_PostCommit_Python_ValidatesRunner_Dataflow #1045 Mon, 05 Mar, 03:15
Apache Jenkins Server                       Build failed in Jenkins: beam_PostCommit_Python_ValidatesRunner_Dataflow #1046 Mon, 05 Mar, 09:34
Apache Jenkins Server                         Build failed in Jenkins: beam_PostCommit_Python_ValidatesRunner_Dataflow #1047 Mon, 05 Mar, 15:15
Apache Jenkins Server                           Build failed in Jenkins: beam_PostCommit_Python_ValidatesRunner_Dataflow #1048 Mon, 05 Mar, 21:17
Apache Jenkins Server                             Build failed in Jenkins: beam_PostCommit_Python_ValidatesRunner_Dataflow #1049 Mon, 05 Mar, 22:04
Apache Jenkins Server                               Build failed in Jenkins: beam_PostCommit_Python_ValidatesRunner_Dataflow #1050 Tue, 06 Mar, 01:04
Apache Jenkins Server                                 Build failed in Jenkins: beam_PostCommit_Python_ValidatesRunner_Dataflow #1051 Tue, 06 Mar, 03:16
Apache Jenkins Server                                   Build failed in Jenkins: beam_PostCommit_Python_ValidatesRunner_Dataflow #1052 Tue, 06 Mar, 05:14
Apache Jenkins Server                                     Build failed in Jenkins: beam_PostCommit_Python_ValidatesRunner_Dataflow #1053 Tue, 06 Mar, 09:15
Apache Jenkins Server                                       Build failed in Jenkins: beam_PostCommit_Python_ValidatesRunner_Dataflow #1054 Tue, 06 Mar, 15:16
Apache Jenkins Server                                         Build failed in Jenkins: beam_PostCommit_Python_ValidatesRunner_Dataflow #1055 Tue, 06 Mar, 17:46
Apache Jenkins Server                                           Build failed in Jenkins: beam_PostCommit_Python_ValidatesRunner_Dataflow #1056 Tue, 06 Mar, 18:44
Apache Jenkins Server                                             Build failed in Jenkins: beam_PostCommit_Python_ValidatesRunner_Dataflow #1057 Tue, 06 Mar, 20:12
Apache Jenkins Server                                               Build failed in Jenkins: beam_PostCommit_Python_ValidatesRunner_Dataflow #1058 Tue, 06 Mar, 20:28
Apache Jenkins Server                                                 Build failed in Jenkins: beam_PostCommit_Python_ValidatesRunner_Dataflow #1059 Tue, 06 Mar, 21:16
Apache Jenkins Server                                                   Build failed in Jenkins: beam_PostCommit_Python_ValidatesRunner_Dataflow #1060 Tue, 06 Mar, 22:26
Apache Jenkins Server                                                     Build failed in Jenkins: beam_PostCommit_Python_ValidatesRunner_Dataflow #1061 Tue, 06 Mar, 22:41
Apache Jenkins Server                                                       Build failed in Jenkins: beam_PostCommit_Python_ValidatesRunner_Dataflow #1062 Wed, 07 Mar, 01:59
Apache Jenkins Server                                                         Build failed in Jenkins: beam_PostCommit_Python_ValidatesRunner_Dataflow #1063 Wed, 07 Mar, 03:49
Apache Jenkins Server                                                           Build failed in Jenkins: beam_PostCommit_Python_ValidatesRunner_Dataflow #1064 Wed, 07 Mar, 09:15
Apache Jenkins Server                                                             Build failed in Jenkins: beam_PostCommit_Python_ValidatesRunner_Dataflow #1065 Wed, 07 Mar, 14:38
Apache Jenkins Server                                                               Build failed in Jenkins: beam_PostCommit_Python_ValidatesRunner_Dataflow #1066 Wed, 07 Mar, 15:15
Apache Jenkins Server                                                                 Build failed in Jenkins: beam_PostCommit_Python_ValidatesRunner_Dataflow #1067 Wed, 07 Mar, 16:14
Apache Jenkins Server                                                                   Build failed in Jenkins: beam_PostCommit_Python_ValidatesRunner_Dataflow #1068 Wed, 07 Mar, 20:07
Apache Jenkins Server                                                                     Build failed in Jenkins: beam_PostCommit_Python_ValidatesRunner_Dataflow #1069 Wed, 07 Mar, 22:19
Apache Jenkins Server                                                                       Build failed in Jenkins: beam_PostCommit_Python_ValidatesRunner_Dataflow #1070 Thu, 08 Mar, 03:44
Apache Jenkins Server                                                                         Build failed in Jenkins: beam_PostCommit_Python_ValidatesRunner_Dataflow #1071 Thu, 08 Mar, 09:39
Apache Jenkins Server                                                                           Build failed in Jenkins: beam_PostCommit_Python_ValidatesRunner_Dataflow #1072 Thu, 08 Mar, 15:15
Apache Jenkins Server                                                                             Build failed in Jenkins: beam_PostCommit_Python_ValidatesRunner_Dataflow #1073 Thu, 08 Mar, 18:10
Apache Jenkins Server                                                                               Build failed in Jenkins: beam_PostCommit_Python_ValidatesRunner_Dataflow #1074 Fri, 09 Mar, 01:54
Apache Jenkins Server                                                                                 Build failed in Jenkins: beam_PostCommit_Python_ValidatesRunner_Dataflow #1075 Fri, 09 Mar, 03:15
Apache Jenkins Server                                                                                   Build failed in Jenkins: beam_PostCommit_Python_ValidatesRunner_Dataflow #1076 Fri, 09 Mar, 03:44
Apache Jenkins Server                                                                                     Build failed in Jenkins: beam_PostCommit_Python_ValidatesRunner_Dataflow #1077 Fri, 09 Mar, 09:16
Apache Jenkins Server                                                                                       Build failed in Jenkins: beam_PostCommit_Python_ValidatesRunner_Dataflow #1078 Fri, 09 Mar, 15:15
Apache Jenkins Server                                                                                         Build failed in Jenkins: beam_PostCommit_Python_ValidatesRunner_Dataflow #1079 Fri, 09 Mar, 18:21
Apache Jenkins Server                                                                                           Build failed in Jenkins: beam_PostCommit_Python_ValidatesRunner_Dataflow #1080 Fri, 09 Mar, 20:32
Apache Jenkins Server                                                                                             Build failed in Jenkins: beam_PostCommit_Python_ValidatesRunner_Dataflow #1081 Fri, 09 Mar, 21:29
Apache Jenkins Server                                                                                               Build failed in Jenkins: beam_PostCommit_Python_ValidatesRunner_Dataflow #1082 Fri, 09 Mar, 22:27
Apache Jenkins Server                                                                                                 Jenkins build is back to normal : beam_PostCommit_Python_ValidatesRunner_Dataflow #1083 Sat, 10 Mar, 01:19
Apache Jenkins Server Jenkins build became unstable: beam_PostCommit_Java_MavenInstall #6115 Sat, 03 Mar, 13:03
Apache Jenkins Server Jenkins build became unstable: beam_PostCommit_Java_ValidatesRunner_Flink #5147 Sat, 03 Mar, 18:16
Apache Jenkins Server   Jenkins build is back to stable : beam_PostCommit_Java_ValidatesRunner_Flink #5148 Sun, 04 Mar, 00:15
Apache Jenkins Server Build failed in Jenkins: beam_PerformanceTests_TextIOIT #225 Sun, 04 Mar, 00:20
Apache Jenkins Server   Jenkins build is back to normal : beam_PerformanceTests_TextIOIT #226 Sun, 04 Mar, 06:05
Message list« Previous · 1 · 2 · 3 · 4 · 5 · 6 · 7 · 8 · 9 · 10 · 11 · 12 · 13 · 14 · 15 · 16 · 17 · 18 · 19 · 20 · 21 · 22 · Next »Thread · Author · Date
Box list
Jan 2020205
Dec 2019281
Nov 2019299
Oct 2019545
Sep 2019348
Aug 2019351
Jul 2019387
Jun 2019332
May 2019464
Apr 2019336
Mar 2019259
Feb 2019367
Jan 2019518
Dec 2018368
Nov 2018448
Oct 20184197
Sep 20184689
Aug 20184453
Jul 20184320
Jun 20186163
May 20185547
Apr 20185962
Mar 20184479
Feb 20181955
Jan 20182670
Dec 20171428
Nov 20172364
Oct 20171972
Sep 20172095
Aug 20172291
Jul 20172998
Jun 20172879
May 20175577
Apr 20175171
Mar 20174068
Feb 20172908
Jan 20171848
Dec 20163374
Nov 20162900
Oct 20162712
Sep 20161298
Aug 20161500
Jul 20161550
Jun 20161725
May 20161092
Apr 20161731
Mar 20161158
Feb 2016294