beam-commits mailing list archives: March 2018

Site index · List index
Message list« Previous · 1 · 2 · 3 · 4 · 5 · 6 · 7 · 8 · 9 · 10 · 11 · 12 · 13 · 14 · 15 · 16 · 17 · 18 · 19 · 20 · 21 · 22 · Next »Thread · Author · Date
[jira] [Created] (BEAM-3854) Add Go SDK support for PubSubIO
Willy Lulciuc (JIRA)   [jira] [Created] (BEAM-3854) Add Go SDK support for PubSubIO Wed, 14 Mar, 23:26
Henning Rohde (JIRA)   [jira] [Commented] (BEAM-3854) Add Go SDK support for PubSubIO Thu, 22 Mar, 20:29
[jira] [Created] (BEAM-3856) Add prototype support for Go SDK streaming
Willy Lulciuc (JIRA)   [jira] [Created] (BEAM-3856) Add prototype support for Go SDK streaming Wed, 14 Mar, 23:28
ASF GitHub Bot (JIRA)   [jira] [Work logged] (BEAM-3856) Add prototype support for Go SDK streaming Thu, 22 Mar, 20:25
ASF GitHub Bot (JIRA)   [jira] [Work logged] (BEAM-3856) Add prototype support for Go SDK streaming Thu, 22 Mar, 20:27
ASF GitHub Bot (JIRA)   [jira] [Work logged] (BEAM-3856) Add prototype support for Go SDK streaming Fri, 30 Mar, 05:03
[jira] [Assigned] (BEAM-3532) Add Distinct cookbook example to Go SDK
Henning Rohde (JIRA)   [jira] [Assigned] (BEAM-3532) Add Distinct cookbook example to Go SDK Wed, 14 Mar, 23:46
Henning Rohde (JIRA)   [jira] [Assigned] (BEAM-3532) Add Distinct cookbook example to Go SDK Wed, 14 Mar, 23:47
[jira] [Created] (BEAM-3857) Dynamic output support for python
Eila Arich-Landkof (JIRA)   [jira] [Created] (BEAM-3857) Dynamic output support for python Thu, 15 Mar, 00:02
Apache Jenkins Server Build failed in Jenkins: beam_PerformanceTests_Compressed_TextIOIT #252 Thu, 15 Mar, 00:07
Apache Jenkins Server   Jenkins build is back to normal : beam_PerformanceTests_Compressed_TextIOIT #253 Thu, 15 Mar, 06:06
Apache Jenkins Server Build failed in Jenkins: beam_PerformanceTests_JDBC #330 Thu, 15 Mar, 00:19
Apache Jenkins Server   Jenkins build is back to normal : beam_PerformanceTests_JDBC #331 Thu, 15 Mar, 06:18
Apache Jenkins Server Jenkins build became unstable: beam_PostCommit_Java_ValidatesRunner_Flink #5236 Thu, 15 Mar, 00:38
Apache Jenkins Server   Jenkins build is back to stable : beam_PostCommit_Java_ValidatesRunner_Flink #5237 Thu, 15 Mar, 04:58
Apache Jenkins Server Build failed in Jenkins: beam_PostCommit_Java_MavenInstall #6206 Thu, 15 Mar, 01:05
Apache Jenkins Server   Jenkins build is back to normal : beam_PostCommit_Java_MavenInstall #6207 Thu, 15 Mar, 05:16
[jira] [Created] (BEAM-3858) Data from JdbcIO.read() cannot pass to next transform on ApexRunner
huangjianhuang (JIRA)   [jira] [Created] (BEAM-3858) Data from JdbcIO.read() cannot pass to next transform on ApexRunner Thu, 15 Mar, 03:18
Jean-Baptiste Onofré (JIRA)   [jira] [Commented] (BEAM-3858) Data from JdbcIO.read() cannot pass to next transform on ApexRunner Thu, 15 Mar, 20:39
huangjianhuang (JIRA)   [jira] [Commented] (BEAM-3858) Data from JdbcIO.read() cannot pass to next transform on ApexRunner Thu, 29 Mar, 03:56
ming...@apache.org [beam] branch master updated: [SQL] Add support for arrays of rows (#4857) Thu, 15 Mar, 04:20
Apache Jenkins Server Jenkins build became unstable: beam_PostCommit_Java_ValidatesRunner_Apex #3695 Thu, 15 Mar, 05:11
Apache Jenkins Server   Jenkins build is back to stable : beam_PostCommit_Java_ValidatesRunner_Apex #3696 Thu, 15 Mar, 06:24
ming...@apache.org [beam] branch master updated: [BEAM-2281][Sql] Use SqlFunctions.toBigDecimal not toString (#4865) Thu, 15 Mar, 06:09
Apache Jenkins Server Build failed in Jenkins: beam_PerformanceTests_XmlIOIT_HDFS #1 Thu, 15 Mar, 12:04
Apache Jenkins Server   Jenkins build is back to normal : beam_PerformanceTests_XmlIOIT_HDFS #2 Sat, 24 Mar, 11:45
Build failed in Jenkins: beam_PerformanceTests_Compressed_TextIOIT_HDFS #2
Apache Jenkins Server   Build failed in Jenkins: beam_PerformanceTests_Compressed_TextIOIT_HDFS #2 Thu, 15 Mar, 12:04
Apache Jenkins Server     Jenkins build is back to normal : beam_PerformanceTests_Compressed_TextIOIT_HDFS #3 Sat, 24 Mar, 11:34
Build failed in Jenkins: beam_PerformanceTests_AvroIOIT_HDFS #2
Apache Jenkins Server   Build failed in Jenkins: beam_PerformanceTests_AvroIOIT_HDFS #2 Thu, 15 Mar, 12:11
Apache Jenkins Server     Jenkins build is back to normal : beam_PerformanceTests_AvroIOIT_HDFS #3 Sat, 24 Mar, 11:38
Build failed in Jenkins: beam_PerformanceTests_TFRecordIOIT_HDFS #2
Apache Jenkins Server   Build failed in Jenkins: beam_PerformanceTests_TFRecordIOIT_HDFS #2 Thu, 15 Mar, 12:12
Apache Jenkins Server     Build failed in Jenkins: beam_PerformanceTests_TFRecordIOIT_HDFS #3 Sat, 24 Mar, 11:54
Apache Jenkins Server       Build failed in Jenkins: beam_PerformanceTests_TFRecordIOIT_HDFS #4 Sat, 24 Mar, 12:01
Apache Jenkins Server Build failed in Jenkins: beam_PerformanceTests_HadoopInputFormat #21 Thu, 15 Mar, 12:13
Apache Jenkins Server   Build failed in Jenkins: beam_PerformanceTests_HadoopInputFormat #22 Thu, 15 Mar, 18:03
Apache Jenkins Server     Jenkins build is back to normal : beam_PerformanceTests_HadoopInputFormat #23 Fri, 16 Mar, 01:02
Apache Jenkins Server Build failed in Jenkins: beam_PerformanceTests_XmlIOIT #24 Thu, 15 Mar, 12:16
Apache Jenkins Server   Jenkins build is back to normal : beam_PerformanceTests_XmlIOIT #25 Thu, 15 Mar, 18:14
[jira] [Work logged] (BEAM-3089) Issue with setting the parallelism at client level using Flink runner
ASF GitHub Bot (JIRA)   [jira] [Work logged] (BEAM-3089) Issue with setting the parallelism at client level using Flink runner Thu, 15 Mar, 14:11
ASF GitHub Bot (JIRA)   [jira] [Work logged] (BEAM-3089) Issue with setting the parallelism at client level using Flink runner Thu, 22 Mar, 12:03
[jira] [Commented] (BEAM-1107) Display user names for steps in the Flink Web UI
Dawid Wysakowicz (JIRA)   [jira] [Commented] (BEAM-1107) Display user names for steps in the Flink Web UI Thu, 15 Mar, 14:31
Dawid Wysakowicz (JIRA)   [jira] [Updated] (BEAM-1107) Display user names for steps in the Flink Web UI Thu, 15 Mar, 14:32
Dawid Wysakowicz (JIRA)   [jira] [Resolved] (BEAM-1107) Display user names for steps in the Flink Web UI Thu, 15 Mar, 14:32
[jira] [Resolved] (BEAM-3281) PTransform name not being propagated to the Flink Web UI
Dawid Wysakowicz (JIRA)   [jira] [Resolved] (BEAM-3281) PTransform name not being propagated to the Flink Web UI Thu, 15 Mar, 14:33
Dawid Wysakowicz (JIRA)   [jira] [Commented] (BEAM-3281) PTransform name not being propagated to the Flink Web UI Thu, 15 Mar, 14:33
[jira] [Updated] (BEAM-3703) java.io.IOException: KafkaWriter : failed to send 1 records (since last report)
Dawid Wysakowicz (JIRA)   [jira] [Updated] (BEAM-3703) java.io.IOException: KafkaWriter : failed to send 1 records (since last report) Thu, 15 Mar, 14:39
Raghu Angadi (JIRA)   [jira] [Commented] (BEAM-3703) java.io.IOException: KafkaWriter : failed to send 1 records (since last report) Thu, 15 Mar, 17:34
Raghu Angadi (JIRA)   [jira] [Resolved] (BEAM-3703) java.io.IOException: KafkaWriter : failed to send 1 records (since last report) Thu, 15 Mar, 17:34
rober...@apache.org [beam] branch master updated (5b6ca47 -> 4319fdb) Thu, 15 Mar, 17:12
rober...@apache.org   [beam] 01/01: Merge pull request #4856 from markflyhigh/fix-test-dataflow-runner Thu, 15 Mar, 17:12
[jira] [Work logged] (BEAM-3759) Add support for PaneInfo descriptor in Python SDK
ASF GitHub Bot (JIRA)   [jira] [Work logged] (BEAM-3759) Add support for PaneInfo descriptor in Python SDK Thu, 15 Mar, 17:25
ASF GitHub Bot (JIRA)   [jira] [Work logged] (BEAM-3759) Add support for PaneInfo descriptor in Python SDK Sat, 17 Mar, 00:20
ASF GitHub Bot (JIRA)   [jira] [Work logged] (BEAM-3759) Add support for PaneInfo descriptor in Python SDK Mon, 19 Mar, 06:44
ASF GitHub Bot (JIRA)   [jira] [Work logged] (BEAM-3759) Add support for PaneInfo descriptor in Python SDK Mon, 19 Mar, 06:44
ASF GitHub Bot (JIRA)   [jira] [Work logged] (BEAM-3759) Add support for PaneInfo descriptor in Python SDK Mon, 19 Mar, 06:44
ASF GitHub Bot (JIRA)   [jira] [Work logged] (BEAM-3759) Add support for PaneInfo descriptor in Python SDK Mon, 19 Mar, 06:44
ASF GitHub Bot (JIRA)   [jira] [Work logged] (BEAM-3759) Add support for PaneInfo descriptor in Python SDK Mon, 19 Mar, 06:44
ASF GitHub Bot (JIRA)   [jira] [Work logged] (BEAM-3759) Add support for PaneInfo descriptor in Python SDK Mon, 19 Mar, 06:44
ASF GitHub Bot (JIRA)   [jira] [Work logged] (BEAM-3759) Add support for PaneInfo descriptor in Python SDK Mon, 19 Mar, 06:44
ASF GitHub Bot (JIRA)   [jira] [Work logged] (BEAM-3759) Add support for PaneInfo descriptor in Python SDK Mon, 19 Mar, 20:51
ASF GitHub Bot (JIRA)   [jira] [Work logged] (BEAM-3759) Add support for PaneInfo descriptor in Python SDK Mon, 19 Mar, 20:58
ASF GitHub Bot (JIRA)   [jira] [Work logged] (BEAM-3759) Add support for PaneInfo descriptor in Python SDK Mon, 19 Mar, 20:58
Apache Jenkins Server Build failed in Jenkins: beam_PerformanceTests_TFRecordIOIT #253 Thu, 15 Mar, 18:04
Apache Jenkins Server   Jenkins build is back to normal : beam_PerformanceTests_TFRecordIOIT #254 Fri, 16 Mar, 01:12
Apache Jenkins Server Build failed in Jenkins: beam_PerformanceTests_JDBC #333 Thu, 15 Mar, 18:09
Apache Jenkins Server   Jenkins build is back to normal : beam_PerformanceTests_JDBC #334 Fri, 16 Mar, 01:12
ming...@apache.org [beam] branch master updated: [SQL] Add support for DOT expression (#4863) Thu, 15 Mar, 18:29
tg...@apache.org [beam] branch master updated (52d40ff -> bc9c97a) Thu, 15 Mar, 18:48
tg...@apache.org   [beam] 01/01: Merge pull request #4776: Add impulse override for read transforms Thu, 15 Mar, 18:48
[jira] [Work logged] (BEAM-2898) Flink supports chaining/fusion of single-SDK stages
ASF GitHub Bot (JIRA)   [jira] [Work logged] (BEAM-2898) Flink supports chaining/fusion of single-SDK stages Thu, 15 Mar, 18:52
ASF GitHub Bot (JIRA)   [jira] [Work logged] (BEAM-2898) Flink supports chaining/fusion of single-SDK stages Thu, 15 Mar, 19:02
ASF GitHub Bot (JIRA)   [jira] [Work logged] (BEAM-2898) Flink supports chaining/fusion of single-SDK stages Thu, 15 Mar, 19:02
ASF GitHub Bot (JIRA)   [jira] [Work logged] (BEAM-2898) Flink supports chaining/fusion of single-SDK stages Thu, 15 Mar, 19:02
ASF GitHub Bot (JIRA)   [jira] [Work logged] (BEAM-2898) Flink supports chaining/fusion of single-SDK stages Thu, 15 Mar, 19:02
ASF GitHub Bot (JIRA)   [jira] [Work logged] (BEAM-2898) Flink supports chaining/fusion of single-SDK stages Thu, 15 Mar, 19:02
ASF GitHub Bot (JIRA)   [jira] [Work logged] (BEAM-2898) Flink supports chaining/fusion of single-SDK stages Thu, 15 Mar, 19:02
ASF GitHub Bot (JIRA)   [jira] [Work logged] (BEAM-2898) Flink supports chaining/fusion of single-SDK stages Thu, 15 Mar, 19:02
ASF GitHub Bot (JIRA)   [jira] [Work logged] (BEAM-2898) Flink supports chaining/fusion of single-SDK stages Thu, 15 Mar, 19:02
ASF GitHub Bot (JIRA)   [jira] [Work logged] (BEAM-2898) Flink supports chaining/fusion of single-SDK stages Thu, 15 Mar, 19:02
[jira] [Created] (BEAM-3859) Add an override to read from an Unbounded Source via Impulse and ParDo
Thomas Groh (JIRA)   [jira] [Created] (BEAM-3859) Add an override to read from an Unbounded Source via Impulse and ParDo Thu, 15 Mar, 18:56
Apache Jenkins Server Jenkins build became unstable: beam_PostCommit_Java_ValidatesRunner_Dataflow #5158 Thu, 15 Mar, 19:20
Apache Jenkins Server   Jenkins build is still unstable: beam_PostCommit_Java_ValidatesRunner_Dataflow #5159 Thu, 15 Mar, 21:26
Apache Jenkins Server     Jenkins build is still unstable: beam_PostCommit_Java_ValidatesRunner_Dataflow #5160 Fri, 16 Mar, 00:28
Apache Jenkins Server       Jenkins build is still unstable: beam_PostCommit_Java_ValidatesRunner_Dataflow #5161 Fri, 16 Mar, 03:12
Apache Jenkins Server         Jenkins build is still unstable: beam_PostCommit_Java_ValidatesRunner_Dataflow #5162 Fri, 16 Mar, 08:06
Apache Jenkins Server           Jenkins build is still unstable: beam_PostCommit_Java_ValidatesRunner_Dataflow #5163 Fri, 16 Mar, 13:53
Apache Jenkins Server             Jenkins build is still unstable: beam_PostCommit_Java_ValidatesRunner_Dataflow #5164 Fri, 16 Mar, 18:53
Apache Jenkins Server               Jenkins build is still unstable: beam_PostCommit_Java_ValidatesRunner_Dataflow #5165 Fri, 16 Mar, 22:12
Apache Jenkins Server                 Jenkins build is still unstable: beam_PostCommit_Java_ValidatesRunner_Dataflow #5166 Sat, 17 Mar, 01:14
Apache Jenkins Server                   Build failed in Jenkins: beam_PostCommit_Java_ValidatesRunner_Dataflow #5167 Sat, 17 Mar, 01:26
Apache Jenkins Server                     Build failed in Jenkins: beam_PostCommit_Java_ValidatesRunner_Dataflow #5168 Sat, 17 Mar, 06:08
Apache Jenkins Server                       Build failed in Jenkins: beam_PostCommit_Java_ValidatesRunner_Dataflow #5169 Sat, 17 Mar, 12:08
Apache Jenkins Server                         Build failed in Jenkins: beam_PostCommit_Java_ValidatesRunner_Dataflow #5170 Sat, 17 Mar, 18:08
Apache Jenkins Server                           Build failed in Jenkins: beam_PostCommit_Java_ValidatesRunner_Dataflow #5171 Sun, 18 Mar, 00:07
Apache Jenkins Server                             Build failed in Jenkins: beam_PostCommit_Java_ValidatesRunner_Dataflow #5172 Sun, 18 Mar, 06:07
Apache Jenkins Server                               Build failed in Jenkins: beam_PostCommit_Java_ValidatesRunner_Dataflow #5173 Sun, 18 Mar, 12:08
Apache Jenkins Server                                 Build failed in Jenkins: beam_PostCommit_Java_ValidatesRunner_Dataflow #5174 Sun, 18 Mar, 17:28
Apache Jenkins Server                                   Build failed in Jenkins: beam_PostCommit_Java_ValidatesRunner_Dataflow #5175 Sun, 18 Mar, 18:06
Apache Jenkins Server                                     Jenkins build is unstable: beam_PostCommit_Java_ValidatesRunner_Dataflow #5176 Sun, 18 Mar, 20:21
Apache Jenkins Server                                       Jenkins build is still unstable: beam_PostCommit_Java_ValidatesRunner_Dataflow #5177 Sun, 18 Mar, 22:08
Apache Jenkins Server                                         Jenkins build is still unstable: beam_PostCommit_Java_ValidatesRunner_Dataflow #5178 Sun, 18 Mar, 23:55
Apache Jenkins Server                                           Jenkins build is still unstable: beam_PostCommit_Java_ValidatesRunner_Dataflow #5179 Mon, 19 Mar, 01:48
Apache Jenkins Server                                             Jenkins build is still unstable: beam_PostCommit_Java_ValidatesRunner_Dataflow #5180 Mon, 19 Mar, 07:54
Apache Jenkins Server                                               Jenkins build is still unstable: beam_PostCommit_Java_ValidatesRunner_Dataflow #5181 Mon, 19 Mar, 13:51
Apache Jenkins Server                                                 Jenkins build is still unstable: beam_PostCommit_Java_ValidatesRunner_Dataflow #5182 Mon, 19 Mar, 18:44
Apache Jenkins Server                                                   Jenkins build is still unstable: beam_PostCommit_Java_ValidatesRunner_Dataflow #5183 Mon, 19 Mar, 21:11
Apache Jenkins Server                                                     Jenkins build is still unstable: beam_PostCommit_Java_ValidatesRunner_Dataflow #5184 Mon, 19 Mar, 23:25
Apache Jenkins Server                                                       Jenkins build is still unstable: beam_PostCommit_Java_ValidatesRunner_Dataflow #5185 Tue, 20 Mar, 01:54
Apache Jenkins Server                                                         Jenkins build is still unstable: beam_PostCommit_Java_ValidatesRunner_Dataflow #5186 Tue, 20 Mar, 07:45
Apache Jenkins Server                                                           Jenkins build is still unstable: beam_PostCommit_Java_ValidatesRunner_Dataflow #5187 Tue, 20 Mar, 13:57
Apache Jenkins Server                                                             Jenkins build is still unstable: beam_PostCommit_Java_ValidatesRunner_Dataflow #5188 Tue, 20 Mar, 15:45
Apache Jenkins Server                                                               Jenkins build is still unstable: beam_PostCommit_Java_ValidatesRunner_Dataflow #5189 Tue, 20 Mar, 20:53
Apache Jenkins Server                                                                 Jenkins build is still unstable: beam_PostCommit_Java_ValidatesRunner_Dataflow #5190 Wed, 21 Mar, 00:32
Apache Jenkins Server                                                                   Jenkins build is still unstable: beam_PostCommit_Java_ValidatesRunner_Dataflow #5191 Wed, 21 Mar, 06:00
Apache Jenkins Server                                                                     Jenkins build is still unstable: beam_PostCommit_Java_ValidatesRunner_Dataflow #5192 Wed, 21 Mar, 08:01
Apache Jenkins Server                                                                       Jenkins build is still unstable: beam_PostCommit_Java_ValidatesRunner_Dataflow #5193 Wed, 21 Mar, 14:03
Apache Jenkins Server                                                                         Jenkins build is still unstable: beam_PostCommit_Java_ValidatesRunner_Dataflow #5194 Wed, 21 Mar, 17:35
Apache Jenkins Server                                                                           Jenkins build is still unstable: beam_PostCommit_Java_ValidatesRunner_Dataflow #5195 Wed, 21 Mar, 20:04
Apache Jenkins Server                                                                             Jenkins build is still unstable: beam_PostCommit_Java_ValidatesRunner_Dataflow #5196 Wed, 21 Mar, 23:13
Apache Jenkins Server                                                                               Jenkins build is still unstable: beam_PostCommit_Java_ValidatesRunner_Dataflow #5197 Thu, 22 Mar, 02:54
Apache Jenkins Server                                                                                 Jenkins build is still unstable: beam_PostCommit_Java_ValidatesRunner_Dataflow #5198 Thu, 22 Mar, 09:07
Apache Jenkins Server                                                                                   Jenkins build is still unstable: beam_PostCommit_Java_ValidatesRunner_Dataflow #5199 Thu, 22 Mar, 11:06
Apache Jenkins Server                                                                                     Jenkins build is still unstable: beam_PostCommit_Java_ValidatesRunner_Dataflow #5200 Thu, 22 Mar, 14:00
Apache Jenkins Server                                                                                       Jenkins build is still unstable: beam_PostCommit_Java_ValidatesRunner_Dataflow #5201 Thu, 22 Mar, 18:42
Apache Jenkins Server                                                                                         Jenkins build is still unstable: beam_PostCommit_Java_ValidatesRunner_Dataflow #5202 Thu, 22 Mar, 21:08
Apache Jenkins Server                                                                                           Jenkins build is still unstable: beam_PostCommit_Java_ValidatesRunner_Dataflow #5203 Fri, 23 Mar, 03:01
Apache Jenkins Server                                                                                             Jenkins build is still unstable: beam_PostCommit_Java_ValidatesRunner_Dataflow #5204 Fri, 23 Mar, 04:53
Apache Jenkins Server                                                                                               Jenkins build is still unstable: beam_PostCommit_Java_ValidatesRunner_Dataflow #5205 Fri, 23 Mar, 07:21
Apache Jenkins Server                                                                                                 Jenkins build is still unstable: beam_PostCommit_Java_ValidatesRunner_Dataflow #5206 Fri, 23 Mar, 09:36
Apache Jenkins Server                                                                                                   Jenkins build is still unstable: beam_PostCommit_Java_ValidatesRunner_Dataflow #5207 Fri, 23 Mar, 13:59
Apache Jenkins Server                                                                                                     Jenkins build is still unstable: beam_PostCommit_Java_ValidatesRunner_Dataflow #5208 Fri, 23 Mar, 19:30
Apache Jenkins Server                                                                                                       Jenkins build is still unstable: beam_PostCommit_Java_ValidatesRunner_Dataflow #5209 Fri, 23 Mar, 21:35
Apache Jenkins Server                                                                                                         Jenkins build is still unstable: beam_PostCommit_Java_ValidatesRunner_Dataflow #5210 Sat, 24 Mar, 01:38
Apache Jenkins Server                                                                                                           Jenkins build is still unstable: beam_PostCommit_Java_ValidatesRunner_Dataflow #5211 Sat, 24 Mar, 03:32
Apache Jenkins Server                                                                                                             Jenkins build is still unstable: beam_PostCommit_Java_ValidatesRunner_Dataflow #5212 Sat, 24 Mar, 07:51
Apache Jenkins Server                                                                                                               Jenkins build is still unstable: beam_PostCommit_Java_ValidatesRunner_Dataflow #5213 Sat, 24 Mar, 13:53
Apache Jenkins Server                                                                                                                 Jenkins build is still unstable: beam_PostCommit_Java_ValidatesRunner_Dataflow #5214 Sat, 24 Mar, 19:57
Apache Jenkins Server                                                                                                                   Jenkins build is still unstable: beam_PostCommit_Java_ValidatesRunner_Dataflow #5215 Sun, 25 Mar, 01:51
Apache Jenkins Server                                                                                                                     Jenkins build is still unstable: beam_PostCommit_Java_ValidatesRunner_Dataflow #5216 Sun, 25 Mar, 07:57
Apache Jenkins Server                                                                                                                       Jenkins build is still unstable: beam_PostCommit_Java_ValidatesRunner_Dataflow #5217 Sun, 25 Mar, 13:49
Apache Jenkins Server                                                                                                                         Jenkins build is still unstable: beam_PostCommit_Java_ValidatesRunner_Dataflow #5218 Sun, 25 Mar, 19:58
Apache Jenkins Server                                                                                                                           Jenkins build is still unstable: beam_PostCommit_Java_ValidatesRunner_Dataflow #5219 Mon, 26 Mar, 01:49
Apache Jenkins Server                                                                                                                             Jenkins build is still unstable: beam_PostCommit_Java_ValidatesRunner_Dataflow #5220 Mon, 26 Mar, 07:50
Apache Jenkins Server                                                                                                                               Jenkins build is still unstable: beam_PostCommit_Java_ValidatesRunner_Dataflow #5221 Mon, 26 Mar, 13:13
Apache Jenkins Server                                                                                                                                 Jenkins build is still unstable: beam_PostCommit_Java_ValidatesRunner_Dataflow #5222 Mon, 26 Mar, 15:07
Apache Jenkins Server Build failed in Jenkins: beam_PostCommit_Python_ValidatesRunner_Dataflow #1118 Thu, 15 Mar, 19:32
Apache Jenkins Server   Jenkins build is back to normal : beam_PostCommit_Python_ValidatesRunner_Dataflow #1119 Thu, 15 Mar, 21:47
[jira] [Created] (BEAM-3860) Use side input for Go text/bigquery IO
Henning Rohde (JIRA)   [jira] [Created] (BEAM-3860) Use side input for Go text/bigquery IO Thu, 15 Mar, 19:37
Henning Rohde (JIRA)   [jira] [Assigned] (BEAM-3860) Use side input for Go text/bigquery IO Thu, 15 Mar, 19:37
Henning Rohde (JIRA)   [jira] [Assigned] (BEAM-3860) Use side input for Go text/bigquery IO Thu, 15 Mar, 21:13
Apache Jenkins Server Jenkins build became unstable: beam_PostCommit_Java_MavenInstall #6213 Thu, 15 Mar, 20:24
Apache Jenkins Server Build failed in Jenkins: beam_PostRelease_NightlySnapshot #127 Thu, 15 Mar, 21:18
Apache Jenkins Server   Build failed in Jenkins: beam_PostRelease_NightlySnapshot #128 Thu, 15 Mar, 23:19
Apache Jenkins Server     Build failed in Jenkins: beam_PostRelease_NightlySnapshot #129 Fri, 16 Mar, 01:22
Apache Jenkins Server       Build failed in Jenkins: beam_PostRelease_NightlySnapshot #130 Fri, 16 Mar, 02:21
Apache Jenkins Server         Build failed in Jenkins: beam_PostRelease_NightlySnapshot #131 Fri, 16 Mar, 03:20
Apache Jenkins Server           Build failed in Jenkins: beam_PostRelease_NightlySnapshot #132 Fri, 16 Mar, 04:03
Apache Jenkins Server             Build failed in Jenkins: beam_PostRelease_NightlySnapshot #133 Fri, 16 Mar, 04:27
Apache Jenkins Server               Build failed in Jenkins: beam_PostRelease_NightlySnapshot #134 Fri, 16 Mar, 04:49
Apache Jenkins Server                 Jenkins build is back to normal : beam_PostRelease_NightlySnapshot #135 Fri, 16 Mar, 05:24
tg...@apache.org [beam] branch master updated (bc9c97a -> ba2c648) Thu, 15 Mar, 21:59
tg...@apache.org   [beam] 01/01: Merge pull request #4815: Replace size() == 0 with isEmpty() Thu, 15 Mar, 21:59
[jira] [Assigned] (BEAM-2339) Jenkins cross JDK version test on Windows
Mark Liu (JIRA)   [jira] [Assigned] (BEAM-2339) Jenkins cross JDK version test on Windows Thu, 15 Mar, 22:22
Davor Bonaci (JIRA)   [jira] [Assigned] (BEAM-2339) Jenkins cross JDK version test on Windows Thu, 15 Mar, 22:31
[jira] [Resolved] (BEAM-1584) Support clean-up step in integration test
Mark Liu (JIRA)   [jira] [Resolved] (BEAM-1584) Support clean-up step in integration test Thu, 15 Mar, 22:23
[jira] [Created] (BEAM-3861) Build test infra for end-to-end streaming test in Python SDK
Mark Liu (JIRA)   [jira] [Created] (BEAM-3861) Build test infra for end-to-end streaming test in Python SDK Thu, 15 Mar, 22:27
ASF GitHub Bot (JIRA)   [jira] [Work logged] (BEAM-3861) Build test infra for end-to-end streaming test in Python SDK Fri, 16 Mar, 17:16
ASF GitHub Bot (JIRA)   [jira] [Work logged] (BEAM-3861) Build test infra for end-to-end streaming test in Python SDK Fri, 16 Mar, 21:46
ASF GitHub Bot (JIRA)   [jira] [Work logged] (BEAM-3861) Build test infra for end-to-end streaming test in Python SDK Mon, 19 Mar, 23:28
ASF GitHub Bot (JIRA)   [jira] [Work logged] (BEAM-3861) Build test infra for end-to-end streaming test in Python SDK Mon, 19 Mar, 23:28
ASF GitHub Bot (JIRA)   [jira] [Work logged] (BEAM-3861) Build test infra for end-to-end streaming test in Python SDK Mon, 19 Mar, 23:28
ASF GitHub Bot (JIRA)   [jira] [Work logged] (BEAM-3861) Build test infra for end-to-end streaming test in Python SDK Mon, 19 Mar, 23:28
ASF GitHub Bot (JIRA)   [jira] [Work logged] (BEAM-3861) Build test infra for end-to-end streaming test in Python SDK Mon, 19 Mar, 23:28
ASF GitHub Bot (JIRA)   [jira] [Work logged] (BEAM-3861) Build test infra for end-to-end streaming test in Python SDK Mon, 19 Mar, 23:28
ASF GitHub Bot (JIRA)   [jira] [Work logged] (BEAM-3861) Build test infra for end-to-end streaming test in Python SDK Mon, 19 Mar, 23:28
ASF GitHub Bot (JIRA)   [jira] [Work logged] (BEAM-3861) Build test infra for end-to-end streaming test in Python SDK Mon, 19 Mar, 23:28
ASF GitHub Bot (JIRA)   [jira] [Work logged] (BEAM-3861) Build test infra for end-to-end streaming test in Python SDK Tue, 20 Mar, 18:37
ASF GitHub Bot (JIRA)   [jira] [Work logged] (BEAM-3861) Build test infra for end-to-end streaming test in Python SDK Tue, 20 Mar, 18:44
ASF GitHub Bot (JIRA)   [jira] [Work logged] (BEAM-3861) Build test infra for end-to-end streaming test in Python SDK Tue, 20 Mar, 18:54
ASF GitHub Bot (JIRA)   [jira] [Work logged] (BEAM-3861) Build test infra for end-to-end streaming test in Python SDK Tue, 20 Mar, 19:35
ASF GitHub Bot (JIRA)   [jira] [Work logged] (BEAM-3861) Build test infra for end-to-end streaming test in Python SDK Tue, 20 Mar, 19:40
ASF GitHub Bot (JIRA)   [jira] [Work logged] (BEAM-3861) Build test infra for end-to-end streaming test in Python SDK Tue, 20 Mar, 19:43
ASF GitHub Bot (JIRA)   [jira] [Work logged] (BEAM-3861) Build test infra for end-to-end streaming test in Python SDK Tue, 20 Mar, 19:56
ASF GitHub Bot (JIRA)   [jira] [Work logged] (BEAM-3861) Build test infra for end-to-end streaming test in Python SDK Tue, 20 Mar, 19:56
ASF GitHub Bot (JIRA)   [jira] [Work logged] (BEAM-3861) Build test infra for end-to-end streaming test in Python SDK Tue, 20 Mar, 19:56
ASF GitHub Bot (JIRA)   [jira] [Work logged] (BEAM-3861) Build test infra for end-to-end streaming test in Python SDK Tue, 20 Mar, 20:05
ASF GitHub Bot (JIRA)   [jira] [Work logged] (BEAM-3861) Build test infra for end-to-end streaming test in Python SDK Tue, 20 Mar, 20:05
ASF GitHub Bot (JIRA)   [jira] [Work logged] (BEAM-3861) Build test infra for end-to-end streaming test in Python SDK Tue, 20 Mar, 20:07
ASF GitHub Bot (JIRA)   [jira] [Work logged] (BEAM-3861) Build test infra for end-to-end streaming test in Python SDK Tue, 20 Mar, 20:11
ASF GitHub Bot (JIRA)   [jira] [Work logged] (BEAM-3861) Build test infra for end-to-end streaming test in Python SDK Tue, 20 Mar, 20:54
ASF GitHub Bot (JIRA)   [jira] [Work logged] (BEAM-3861) Build test infra for end-to-end streaming test in Python SDK Tue, 20 Mar, 21:01
ASF GitHub Bot (JIRA)   [jira] [Work logged] (BEAM-3861) Build test infra for end-to-end streaming test in Python SDK Wed, 21 Mar, 01:59
ASF GitHub Bot (JIRA)   [jira] [Work logged] (BEAM-3861) Build test infra for end-to-end streaming test in Python SDK Thu, 22 Mar, 00:31
ASF GitHub Bot (JIRA)   [jira] [Work logged] (BEAM-3861) Build test infra for end-to-end streaming test in Python SDK Thu, 22 Mar, 00:34
ASF GitHub Bot (JIRA)   [jira] [Work logged] (BEAM-3861) Build test infra for end-to-end streaming test in Python SDK Thu, 22 Mar, 00:34
ASF GitHub Bot (JIRA)   [jira] [Work logged] (BEAM-3861) Build test infra for end-to-end streaming test in Python SDK Thu, 22 Mar, 04:20
ASF GitHub Bot (JIRA)   [jira] [Work logged] (BEAM-3861) Build test infra for end-to-end streaming test in Python SDK Thu, 22 Mar, 04:20
ASF GitHub Bot (JIRA)   [jira] [Work logged] (BEAM-3861) Build test infra for end-to-end streaming test in Python SDK Thu, 22 Mar, 04:20
ASF GitHub Bot (JIRA)   [jira] [Work logged] (BEAM-3861) Build test infra for end-to-end streaming test in Python SDK Thu, 22 Mar, 04:20
ASF GitHub Bot (JIRA)   [jira] [Work logged] (BEAM-3861) Build test infra for end-to-end streaming test in Python SDK Thu, 22 Mar, 04:20
ASF GitHub Bot (JIRA)   [jira] [Work logged] (BEAM-3861) Build test infra for end-to-end streaming test in Python SDK Thu, 22 Mar, 04:20
ASF GitHub Bot (JIRA)   [jira] [Work logged] (BEAM-3861) Build test infra for end-to-end streaming test in Python SDK Thu, 22 Mar, 16:42
ASF GitHub Bot (JIRA)   [jira] [Work logged] (BEAM-3861) Build test infra for end-to-end streaming test in Python SDK Thu, 22 Mar, 16:42
ASF GitHub Bot (JIRA)   [jira] [Work logged] (BEAM-3861) Build test infra for end-to-end streaming test in Python SDK Thu, 22 Mar, 16:42
ASF GitHub Bot (JIRA)   [jira] [Work logged] (BEAM-3861) Build test infra for end-to-end streaming test in Python SDK Thu, 22 Mar, 16:48
ASF GitHub Bot (JIRA)   [jira] [Work logged] (BEAM-3861) Build test infra for end-to-end streaming test in Python SDK Thu, 22 Mar, 17:16
ASF GitHub Bot (JIRA)   [jira] [Work logged] (BEAM-3861) Build test infra for end-to-end streaming test in Python SDK Thu, 22 Mar, 17:43
ASF GitHub Bot (JIRA)   [jira] [Work logged] (BEAM-3861) Build test infra for end-to-end streaming test in Python SDK Thu, 22 Mar, 18:38
ASF GitHub Bot (JIRA)   [jira] [Work logged] (BEAM-3861) Build test infra for end-to-end streaming test in Python SDK Thu, 22 Mar, 19:55
ASF GitHub Bot (JIRA)   [jira] [Work logged] (BEAM-3861) Build test infra for end-to-end streaming test in Python SDK Thu, 22 Mar, 21:05
ASF GitHub Bot (JIRA)   [jira] [Work logged] (BEAM-3861) Build test infra for end-to-end streaming test in Python SDK Thu, 22 Mar, 23:57
ASF GitHub Bot (JIRA)   [jira] [Work logged] (BEAM-3861) Build test infra for end-to-end streaming test in Python SDK Fri, 23 Mar, 00:02
ASF GitHub Bot (JIRA)   [jira] [Work logged] (BEAM-3861) Build test infra for end-to-end streaming test in Python SDK Fri, 23 Mar, 00:02
ASF GitHub Bot (JIRA)   [jira] [Work logged] (BEAM-3861) Build test infra for end-to-end streaming test in Python SDK Fri, 23 Mar, 00:02
ASF GitHub Bot (JIRA)   [jira] [Work logged] (BEAM-3861) Build test infra for end-to-end streaming test in Python SDK Fri, 23 Mar, 00:04
ASF GitHub Bot (JIRA)   [jira] [Work logged] (BEAM-3861) Build test infra for end-to-end streaming test in Python SDK Fri, 23 Mar, 00:06
ASF GitHub Bot (JIRA)   [jira] [Work logged] (BEAM-3861) Build test infra for end-to-end streaming test in Python SDK Fri, 23 Mar, 00:53
ASF GitHub Bot (JIRA)   [jira] [Work logged] (BEAM-3861) Build test infra for end-to-end streaming test in Python SDK Fri, 23 Mar, 05:13
ASF GitHub Bot (JIRA)   [jira] [Work logged] (BEAM-3861) Build test infra for end-to-end streaming test in Python SDK Fri, 23 Mar, 06:24
ASF GitHub Bot (JIRA)   [jira] [Work logged] (BEAM-3861) Build test infra for end-to-end streaming test in Python SDK Fri, 23 Mar, 15:55
ASF GitHub Bot (JIRA)   [jira] [Work logged] (BEAM-3861) Build test infra for end-to-end streaming test in Python SDK Fri, 23 Mar, 17:22
ASF GitHub Bot (JIRA)   [jira] [Work logged] (BEAM-3861) Build test infra for end-to-end streaming test in Python SDK Fri, 23 Mar, 17:22
ASF GitHub Bot (JIRA)   [jira] [Work logged] (BEAM-3861) Build test infra for end-to-end streaming test in Python SDK Fri, 23 Mar, 17:23
ASF GitHub Bot (JIRA)   [jira] [Work logged] (BEAM-3861) Build test infra for end-to-end streaming test in Python SDK Fri, 23 Mar, 17:29
ASF GitHub Bot (JIRA)   [jira] [Work logged] (BEAM-3861) Build test infra for end-to-end streaming test in Python SDK Fri, 23 Mar, 17:29
ASF GitHub Bot (JIRA)   [jira] [Work logged] (BEAM-3861) Build test infra for end-to-end streaming test in Python SDK Fri, 23 Mar, 17:29
lc...@apache.org [beam] branch master updated (ba2c648 -> 9f21706) Thu, 15 Mar, 23:26
lc...@apache.org   [beam] 01/01: [BEAM-3798] Remove error check on dataflow when getting batch job state Thu, 15 Mar, 23:26
Message list« Previous · 1 · 2 · 3 · 4 · 5 · 6 · 7 · 8 · 9 · 10 · 11 · 12 · 13 · 14 · 15 · 16 · 17 · 18 · 19 · 20 · 21 · 22 · Next »Thread · Author · Date
Box list
Jan 2020205
Dec 2019281
Nov 2019299
Oct 2019545
Sep 2019348
Aug 2019351
Jul 2019387
Jun 2019332
May 2019464
Apr 2019336
Mar 2019259
Feb 2019367
Jan 2019518
Dec 2018368
Nov 2018448
Oct 20184197
Sep 20184689
Aug 20184453
Jul 20184320
Jun 20186163
May 20185547
Apr 20185962
Mar 20184479
Feb 20181955
Jan 20182670
Dec 20171428
Nov 20172364
Oct 20171972
Sep 20172095
Aug 20172291
Jul 20172998
Jun 20172879
May 20175577
Apr 20175171
Mar 20174068
Feb 20172908
Jan 20171848
Dec 20163374
Nov 20162900
Oct 20162712
Sep 20161298
Aug 20161500
Jul 20161550
Jun 20161725
May 20161092
Apr 20161731
Mar 20161158
Feb 2016294