beam-commits mailing list archives

Site index · List index
Message view « Date » · « Thread »
Top « Date » · « Thread »
From Apache Jenkins Server <jenk...@builds.apache.org>
Subject Build failed in Jenkins: beam_PreCommit_Java_Cron #263
Date Fri, 24 Aug 2018 00:22:20 GMT
See <https://builds.apache.org/job/beam_PreCommit_Java_Cron/263/display/redirect?page=changes>

Changes:

[jiangkai] Support datetime type minus time interval

[jiangkai] address comments

[jiangkai] add unit test for DatetimeMinusIntervalExpression

[jiangkai] add license header

[ankurgoenka] Fix Pipeline options with multi value deserialization from map

[ajhalaria] SNS Sink

[ankurgoenka] Fixing Python SDK thread count for Portable Runners

------------------------------------------
[...truncated 17.30 MB...]
    INFO: 2018-08-24T00:18:34.071Z: Fusing consumer WriteOneFilePerWindow/TextIO.Write/WriteFiles/FinalizeTempFileBundles/Reshuffle.ViaRandomKey/Pair
with random key into WriteOneFilePerWindow/TextIO.Write/WriteFiles/FinalizeTempFileBundles/Finalize
    Aug 24, 2018 12:18:43 AM org.apache.beam.runners.dataflow.util.MonitoringUtil$LoggingHandler
process
    INFO: 2018-08-24T00:18:34.115Z: Fusing consumer WriteOneFilePerWindow/TextIO.Write/WriteFiles/FinalizeTempFileBundles/Reshuffle.ViaRandomKey/Reshuffle/ExpandIterable
into WriteOneFilePerWindow/TextIO.Write/WriteFiles/FinalizeTempFileBundles/Reshuffle.ViaRandomKey/Reshuffle/GroupByKey/GroupByWindow
    Aug 24, 2018 12:18:43 AM org.apache.beam.runners.dataflow.util.MonitoringUtil$LoggingHandler
process
    INFO: 2018-08-24T00:18:34.151Z: Fusing consumer WriteOneFilePerWindow/TextIO.Write/WriteFiles/FinalizeTempFileBundles/Reshuffle.ViaRandomKey/Values/Values/Map
into WriteOneFilePerWindow/TextIO.Write/WriteFiles/FinalizeTempFileBundles/Reshuffle.ViaRandomKey/Reshuffle/ExpandIterable
    Aug 24, 2018 12:18:43 AM org.apache.beam.runners.dataflow.util.MonitoringUtil$LoggingHandler
process
    INFO: 2018-08-24T00:18:34.199Z: Fusing consumer WriteOneFilePerWindow/TextIO.Write/WriteFiles/GatherTempFileResults/Reshuffle.ViaRandomKey/Reshuffle/ExpandIterable
into WriteOneFilePerWindow/TextIO.Write/WriteFiles/GatherTempFileResults/Reshuffle.ViaRandomKey/Reshuffle/GroupByKey/GroupByWindow
    Aug 24, 2018 12:18:43 AM org.apache.beam.runners.dataflow.util.MonitoringUtil$LoggingHandler
process
    INFO: 2018-08-24T00:18:34.235Z: Fusing consumer WriteOneFilePerWindow/TextIO.Write/WriteFiles/FinalizeTempFileBundles/Reshuffle.ViaRandomKey/Reshuffle/Window.Into()/Window.Assign
into WriteOneFilePerWindow/TextIO.Write/WriteFiles/FinalizeTempFileBundles/Reshuffle.ViaRandomKey/Pair
with random key
    Aug 24, 2018 12:18:43 AM org.apache.beam.runners.dataflow.util.MonitoringUtil$LoggingHandler
process
    INFO: 2018-08-24T00:18:34.279Z: Fusing consumer WriteOneFilePerWindow/TextIO.Write/WriteFiles/FinalizeTempFileBundles/Reshuffle.ViaRandomKey/Reshuffle/GroupByKey/Write
into WriteOneFilePerWindow/TextIO.Write/WriteFiles/FinalizeTempFileBundles/Reshuffle.ViaRandomKey/Reshuffle/GroupByKey/Reify
    Aug 24, 2018 12:18:43 AM org.apache.beam.runners.dataflow.util.MonitoringUtil$LoggingHandler
process
    INFO: 2018-08-24T00:18:34.316Z: Fusing consumer WriteOneFilePerWindow/TextIO.Write/WriteFiles/FinalizeTempFileBundles/Reshuffle.ViaRandomKey/Reshuffle/GroupByKey/Reify
into WriteOneFilePerWindow/TextIO.Write/WriteFiles/FinalizeTempFileBundles/Reshuffle.ViaRandomKey/Reshuffle/Window.Into()/Window.Assign
    Aug 24, 2018 12:18:43 AM org.apache.beam.runners.dataflow.util.MonitoringUtil$LoggingHandler
process
    INFO: 2018-08-24T00:18:34.352Z: Fusing consumer WriteOneFilePerWindow/TextIO.Write/WriteFiles/GatherTempFileResults/Reshuffle.ViaRandomKey/Values/Values/Map
into WriteOneFilePerWindow/TextIO.Write/WriteFiles/GatherTempFileResults/Reshuffle.ViaRandomKey/Reshuffle/ExpandIterable
    Aug 24, 2018 12:18:43 AM org.apache.beam.runners.dataflow.util.MonitoringUtil$LoggingHandler
process
    INFO: 2018-08-24T00:18:34.395Z: Fusing consumer WriteOneFilePerWindow/TextIO.Write/WriteFiles/FinalizeTempFileBundles/Finalize
into WriteOneFilePerWindow/TextIO.Write/WriteFiles/GatherTempFileResults/Reshuffle.ViaRandomKey/Values/Values/Map
    Aug 24, 2018 12:18:43 AM org.apache.beam.runners.dataflow.util.MonitoringUtil$LoggingHandler
process
    INFO: 2018-08-24T00:18:34.432Z: Fusing consumer WriteOneFilePerWindow/TextIO.Write/WriteFiles/GatherTempFileResults/Add
void key/AddKeys/Map into WriteOneFilePerWindow/TextIO.Write/WriteFiles/WriteUnshardedBundlesToTempFiles/WriteUnshardedBundles
    Aug 24, 2018 12:18:43 AM org.apache.beam.runners.dataflow.util.MonitoringUtil$LoggingHandler
process
    INFO: 2018-08-24T00:18:34.475Z: Fusing consumer WriteOneFilePerWindow/TextIO.Write/WriteFiles/GatherTempFileResults/Reshuffle/Window.Into()/Window.Assign
into WriteOneFilePerWindow/TextIO.Write/WriteFiles/GatherTempFileResults/Add void key/AddKeys/Map
    Aug 24, 2018 12:18:43 AM org.apache.beam.runners.dataflow.util.MonitoringUtil$LoggingHandler
process
    INFO: 2018-08-24T00:18:34.519Z: Fusing consumer WordCount.CountWords/Count.PerElement/Combine.perKey(Count)/GroupByKey+WordCount.CountWords/Count.PerElement/Combine.perKey(Count)/Combine.GroupedValues/Partial
into WordCount.CountWords/Count.PerElement/Init/Map
    Aug 24, 2018 12:18:43 AM org.apache.beam.runners.dataflow.util.MonitoringUtil$LoggingHandler
process
    INFO: 2018-08-24T00:18:34.568Z: Fusing consumer WriteOneFilePerWindow/TextIO.Write/WriteFiles/WriteUnshardedBundlesToTempFiles/GroupUnwritten/Reify
into WriteOneFilePerWindow/TextIO.Write/WriteFiles/WriteUnshardedBundlesToTempFiles/WriteUnshardedBundles
    Aug 24, 2018 12:18:43 AM org.apache.beam.runners.dataflow.util.MonitoringUtil$LoggingHandler
process
    INFO: 2018-08-24T00:18:34.609Z: Fusing consumer Window.Into()/Window.Assign into ParDo(AddTimestamp)
    Aug 24, 2018 12:18:43 AM org.apache.beam.runners.dataflow.util.MonitoringUtil$LoggingHandler
process
    INFO: 2018-08-24T00:18:34.654Z: Fusing consumer WordCount.CountWords/Count.PerElement/Combine.perKey(Count)/Combine.GroupedValues
into WordCount.CountWords/Count.PerElement/Combine.perKey(Count)/GroupByKey/Read
    Aug 24, 2018 12:18:43 AM org.apache.beam.runners.dataflow.util.MonitoringUtil$LoggingHandler
process
    INFO: 2018-08-24T00:18:34.699Z: Fusing consumer WordCount.CountWords/Count.PerElement/Combine.perKey(Count)/GroupByKey/Reify
into WordCount.CountWords/Count.PerElement/Combine.perKey(Count)/GroupByKey+WordCount.CountWords/Count.PerElement/Combine.perKey(Count)/Combine.GroupedValues/Partial
    Aug 24, 2018 12:18:43 AM org.apache.beam.runners.dataflow.util.MonitoringUtil$LoggingHandler
process
    INFO: 2018-08-24T00:18:34.734Z: Fusing consumer WriteOneFilePerWindow/TextIO.Write/WriteFiles/WriteUnshardedBundlesToTempFiles/WriteUnwritten
into WriteOneFilePerWindow/TextIO.Write/WriteFiles/WriteUnshardedBundlesToTempFiles/GroupUnwritten/GroupByWindow
    Aug 24, 2018 12:18:43 AM org.apache.beam.runners.dataflow.util.MonitoringUtil$LoggingHandler
process
    INFO: 2018-08-24T00:18:34.774Z: Fusing consumer WriteOneFilePerWindow/TextIO.Write/WriteFiles/WriteUnshardedBundlesToTempFiles/GroupUnwritten/Write
into WriteOneFilePerWindow/TextIO.Write/WriteFiles/WriteUnshardedBundlesToTempFiles/GroupUnwritten/Reify
    Aug 24, 2018 12:18:43 AM org.apache.beam.runners.dataflow.util.MonitoringUtil$LoggingHandler
process
    INFO: 2018-08-24T00:18:34.818Z: Fusing consumer WordCount.CountWords/Count.PerElement/Combine.perKey(Count)/GroupByKey/Write
into WordCount.CountWords/Count.PerElement/Combine.perKey(Count)/GroupByKey/Reify
    Aug 24, 2018 12:18:43 AM org.apache.beam.runners.dataflow.util.MonitoringUtil$LoggingHandler
process
    INFO: 2018-08-24T00:18:34.860Z: Fusing consumer MapElements/Map into WordCount.CountWords/Count.PerElement/Combine.perKey(Count)/Combine.GroupedValues/Extract
    Aug 24, 2018 12:18:43 AM org.apache.beam.runners.dataflow.util.MonitoringUtil$LoggingHandler
process
    INFO: 2018-08-24T00:18:34.904Z: Fusing consumer ParDo(AddTimestamp) into TextIO.Read/Read
    Aug 24, 2018 12:18:43 AM org.apache.beam.runners.dataflow.util.MonitoringUtil$LoggingHandler
process
    INFO: 2018-08-24T00:18:34.945Z: Fusing consumer WordCount.CountWords/ParDo(ExtractWords)
into Window.Into()/Window.Assign
    Aug 24, 2018 12:18:43 AM org.apache.beam.runners.dataflow.util.MonitoringUtil$LoggingHandler
process
    INFO: 2018-08-24T00:18:34.989Z: Fusing consumer WriteOneFilePerWindow/TextIO.Write/WriteFiles/WriteUnshardedBundlesToTempFiles/DropShardNum
into WriteOneFilePerWindow/TextIO.Write/WriteFiles/WriteUnshardedBundlesToTempFiles/WriteUnwritten
    Aug 24, 2018 12:18:43 AM org.apache.beam.runners.dataflow.util.MonitoringUtil$LoggingHandler
process
    INFO: 2018-08-24T00:18:35.030Z: Fusing consumer WriteOneFilePerWindow/TextIO.Write/WriteFiles/WriteUnshardedBundlesToTempFiles/WriteUnshardedBundles
into MapElements/Map
    Aug 24, 2018 12:18:43 AM org.apache.beam.runners.dataflow.util.MonitoringUtil$LoggingHandler
process
    INFO: 2018-08-24T00:18:35.073Z: Fusing consumer WriteOneFilePerWindow/TextIO.Write/WriteFiles/WriteUnshardedBundlesToTempFiles/GroupUnwritten/GroupByWindow
into WriteOneFilePerWindow/TextIO.Write/WriteFiles/WriteUnshardedBundlesToTempFiles/GroupUnwritten/Read
    Aug 24, 2018 12:18:43 AM org.apache.beam.runners.dataflow.util.MonitoringUtil$LoggingHandler
process
    INFO: 2018-08-24T00:18:35.114Z: Fusing consumer WordCount.CountWords/Count.PerElement/Init/Map
into WordCount.CountWords/ParDo(ExtractWords)
    Aug 24, 2018 12:18:43 AM org.apache.beam.runners.dataflow.util.MonitoringUtil$LoggingHandler
process
    INFO: 2018-08-24T00:18:35.162Z: Fusing consumer WordCount.CountWords/Count.PerElement/Combine.perKey(Count)/Combine.GroupedValues/Extract
into WordCount.CountWords/Count.PerElement/Combine.perKey(Count)/Combine.GroupedValues
    Aug 24, 2018 12:18:43 AM org.apache.beam.runners.dataflow.util.MonitoringUtil$LoggingHandler
process
    INFO: 2018-08-24T00:18:35.616Z: Executing operation WriteOneFilePerWindow/TextIO.Write/WriteFiles/WriteUnshardedBundlesToTempFiles/GroupUnwritten/Create
    Aug 24, 2018 12:18:43 AM org.apache.beam.runners.dataflow.util.MonitoringUtil$LoggingHandler
process
    INFO: 2018-08-24T00:18:35.652Z: Executing operation WriteOneFilePerWindow/TextIO.Write/WriteFiles/GatherTempFileResults/Reshuffle/GroupByKey/Create
    Aug 24, 2018 12:18:43 AM org.apache.beam.runners.dataflow.util.MonitoringUtil$LoggingHandler
process
    INFO: 2018-08-24T00:18:35.700Z: Executing operation WriteOneFilePerWindow/TextIO.Write/WriteFiles/GatherTempFileResults/Reshuffle.ViaRandomKey/Reshuffle/GroupByKey/Create
    Aug 24, 2018 12:18:43 AM org.apache.beam.runners.dataflow.util.MonitoringUtil$LoggingHandler
process
    INFO: 2018-08-24T00:18:35.711Z: Starting 1 workers in us-central1-b...
    Aug 24, 2018 12:18:43 AM org.apache.beam.runners.dataflow.util.MonitoringUtil$LoggingHandler
process
    INFO: 2018-08-24T00:18:35.731Z: Executing operation WriteOneFilePerWindow/TextIO.Write/WriteFiles/FinalizeTempFileBundles/Reshuffle.ViaRandomKey/Reshuffle/GroupByKey/Create
    Aug 24, 2018 12:18:43 AM org.apache.beam.runners.dataflow.util.MonitoringUtil$LoggingHandler
process
    INFO: 2018-08-24T00:18:35.777Z: Executing operation WordCount.CountWords/Count.PerElement/Combine.perKey(Count)/GroupByKey/Create
    Aug 24, 2018 12:18:43 AM org.apache.beam.runners.dataflow.util.MonitoringUtil$LoggingHandler
process
    INFO: 2018-08-24T00:18:36.115Z: Executing operation TextIO.Read/Read+ParDo(AddTimestamp)+Window.Into()/Window.Assign+WordCount.CountWords/ParDo(ExtractWords)+WordCount.CountWords/Count.PerElement/Init/Map+WordCount.CountWords/Count.PerElement/Combine.perKey(Count)/GroupByKey+WordCount.CountWords/Count.PerElement/Combine.perKey(Count)/Combine.GroupedValues/Partial+WordCount.CountWords/Count.PerElement/Combine.perKey(Count)/GroupByKey/Reify+WordCount.CountWords/Count.PerElement/Combine.perKey(Count)/GroupByKey/Write
    Aug 24, 2018 12:18:50 AM org.apache.beam.runners.dataflow.util.MonitoringUtil$LoggingHandler
process
    INFO: 2018-08-24T00:18:50.413Z: Autoscaling: Raised the number of workers to 0 based on
the rate of progress in the currently running step(s).
    Aug 24, 2018 12:19:12 AM org.apache.beam.runners.dataflow.util.MonitoringUtil$LoggingHandler
process
    INFO: 2018-08-24T00:19:12.232Z: Autoscaling: Raised the number of workers to 1 based on
the rate of progress in the currently running step(s).
    Aug 24, 2018 12:19:12 AM org.apache.beam.runners.dataflow.util.MonitoringUtil$LoggingHandler
process
    INFO: 2018-08-24T00:19:12.282Z: Autoscaling: Would further reduce the number of workers
but reached the minimum number allowed for the job.
    Aug 24, 2018 12:19:36 AM org.apache.beam.runners.dataflow.util.MonitoringUtil$LoggingHandler
process
    INFO: 2018-08-24T00:19:36.198Z: Workers have started successfully.
    Aug 24, 2018 12:19:36 AM org.apache.beam.runners.dataflow.util.MonitoringUtil$LoggingHandler
process
    INFO: 2018-08-24T00:19:36.245Z: Workers have started successfully.
    Aug 24, 2018 12:20:13 AM org.apache.beam.runners.dataflow.util.MonitoringUtil$LoggingHandler
process
    INFO: 2018-08-24T00:20:12.662Z: Executing operation WordCount.CountWords/Count.PerElement/Combine.perKey(Count)/GroupByKey/Close
    Aug 24, 2018 12:20:13 AM org.apache.beam.runners.dataflow.util.MonitoringUtil$LoggingHandler
process
    INFO: 2018-08-24T00:20:12.855Z: Executing operation WordCount.CountWords/Count.PerElement/Combine.perKey(Count)/GroupByKey/Read+WordCount.CountWords/Count.PerElement/Combine.perKey(Count)/Combine.GroupedValues+WordCount.CountWords/Count.PerElement/Combine.perKey(Count)/Combine.GroupedValues/Extract+MapElements/Map+WriteOneFilePerWindow/TextIO.Write/WriteFiles/WriteUnshardedBundlesToTempFiles/WriteUnshardedBundles+WriteOneFilePerWindow/TextIO.Write/WriteFiles/GatherTempFileResults/Add
void key/AddKeys/Map+WriteOneFilePerWindow/TextIO.Write/WriteFiles/GatherTempFileResults/Reshuffle/Window.Into()/Window.Assign+WriteOneFilePerWindow/TextIO.Write/WriteFiles/GatherTempFileResults/Reshuffle/GroupByKey/Reify+WriteOneFilePerWindow/TextIO.Write/WriteFiles/GatherTempFileResults/Reshuffle/GroupByKey/Write+WriteOneFilePerWindow/TextIO.Write/WriteFiles/WriteUnshardedBundlesToTempFiles/GroupUnwritten/Reify+WriteOneFilePerWindow/TextIO.Write/WriteFiles/WriteUnshardedBundlesToTempFiles/GroupUnwritten/Write
    Aug 24, 2018 12:20:24 AM org.apache.beam.runners.dataflow.util.MonitoringUtil$LoggingHandler
process
    INFO: 2018-08-24T00:20:22.994Z: Executing operation WriteOneFilePerWindow/TextIO.Write/WriteFiles/WriteUnshardedBundlesToTempFiles/GroupUnwritten/Close
    Aug 24, 2018 12:20:24 AM org.apache.beam.runners.dataflow.util.MonitoringUtil$LoggingHandler
process
    INFO: 2018-08-24T00:20:23.082Z: Executing operation WriteOneFilePerWindow/TextIO.Write/WriteFiles/WriteUnshardedBundlesToTempFiles/GroupUnwritten/Read+WriteOneFilePerWindow/TextIO.Write/WriteFiles/WriteUnshardedBundlesToTempFiles/GroupUnwritten/GroupByWindow+WriteOneFilePerWindow/TextIO.Write/WriteFiles/WriteUnshardedBundlesToTempFiles/WriteUnwritten+WriteOneFilePerWindow/TextIO.Write/WriteFiles/WriteUnshardedBundlesToTempFiles/DropShardNum+WriteOneFilePerWindow/TextIO.Write/WriteFiles/GatherTempFileResults/Add
void key/AddKeys/Map+WriteOneFilePerWindow/TextIO.Write/WriteFiles/GatherTempFileResults/Reshuffle/Window.Into()/Window.Assign+WriteOneFilePerWindow/TextIO.Write/WriteFiles/GatherTempFileResults/Reshuffle/GroupByKey/Reify+WriteOneFilePerWindow/TextIO.Write/WriteFiles/GatherTempFileResults/Reshuffle/GroupByKey/Write
    Aug 24, 2018 12:20:26 AM org.apache.beam.runners.dataflow.util.MonitoringUtil$LoggingHandler
process
    INFO: 2018-08-24T00:20:24.211Z: Executing operation WriteOneFilePerWindow/TextIO.Write/WriteFiles/GatherTempFileResults/Reshuffle/GroupByKey/Close
    Aug 24, 2018 12:20:26 AM org.apache.beam.runners.dataflow.util.MonitoringUtil$LoggingHandler
process
    INFO: 2018-08-24T00:20:24.283Z: Executing operation WriteOneFilePerWindow/TextIO.Write/WriteFiles/GatherTempFileResults/Reshuffle/GroupByKey/Read+WriteOneFilePerWindow/TextIO.Write/WriteFiles/GatherTempFileResults/Reshuffle/GroupByKey/GroupByWindow+WriteOneFilePerWindow/TextIO.Write/WriteFiles/GatherTempFileResults/Reshuffle/ExpandIterable+WriteOneFilePerWindow/TextIO.Write/WriteFiles/GatherTempFileResults/Drop
key/Values/Map+WriteOneFilePerWindow/TextIO.Write/WriteFiles/GatherTempFileResults/Gather
bundles+WriteOneFilePerWindow/TextIO.Write/WriteFiles/GatherTempFileResults/Reshuffle.ViaRandomKey/Pair
with random key+WriteOneFilePerWindow/TextIO.Write/WriteFiles/GatherTempFileResults/Reshuffle.ViaRandomKey/Reshuffle/Window.Into()/Window.Assign+WriteOneFilePerWindow/TextIO.Write/WriteFiles/GatherTempFileResults/Reshuffle.ViaRandomKey/Reshuffle/GroupByKey/Reify+WriteOneFilePerWindow/TextIO.Write/WriteFiles/GatherTempFileResults/Reshuffle.ViaRandomKey/Reshuffle/GroupByKey/Write
    Aug 24, 2018 12:20:31 AM org.apache.beam.runners.dataflow.util.MonitoringUtil$LoggingHandler
process
    INFO: 2018-08-24T00:20:29.961Z: Executing operation WriteOneFilePerWindow/TextIO.Write/WriteFiles/GatherTempFileResults/Reshuffle.ViaRandomKey/Reshuffle/GroupByKey/Close
    Aug 24, 2018 12:20:31 AM org.apache.beam.runners.dataflow.util.MonitoringUtil$LoggingHandler
process
    INFO: 2018-08-24T00:20:30.054Z: Executing operation WriteOneFilePerWindow/TextIO.Write/WriteFiles/GatherTempFileResults/Reshuffle.ViaRandomKey/Reshuffle/GroupByKey/Read+WriteOneFilePerWindow/TextIO.Write/WriteFiles/GatherTempFileResults/Reshuffle.ViaRandomKey/Reshuffle/GroupByKey/GroupByWindow+WriteOneFilePerWindow/TextIO.Write/WriteFiles/GatherTempFileResults/Reshuffle.ViaRandomKey/Reshuffle/ExpandIterable+WriteOneFilePerWindow/TextIO.Write/WriteFiles/GatherTempFileResults/Reshuffle.ViaRandomKey/Values/Values/Map+WriteOneFilePerWindow/TextIO.Write/WriteFiles/FinalizeTempFileBundles/Finalize+WriteOneFilePerWindow/TextIO.Write/WriteFiles/FinalizeTempFileBundles/Reshuffle.ViaRandomKey/Pair
with random key+WriteOneFilePerWindow/TextIO.Write/WriteFiles/FinalizeTempFileBundles/Reshuffle.ViaRandomKey/Reshuffle/Window.Into()/Window.Assign+WriteOneFilePerWindow/TextIO.Write/WriteFiles/FinalizeTempFileBundles/Reshuffle.ViaRandomKey/Reshuffle/GroupByKey/Reify+WriteOneFilePerWindow/TextIO.Write/WriteFiles/FinalizeTempFileBundles/Reshuffle.ViaRandomKey/Reshuffle/GroupByKey/Write
    Aug 24, 2018 12:20:38 AM org.apache.beam.runners.dataflow.util.MonitoringUtil$LoggingHandler
process
    INFO: 2018-08-24T00:20:36.973Z: Executing operation WriteOneFilePerWindow/TextIO.Write/WriteFiles/FinalizeTempFileBundles/Reshuffle.ViaRandomKey/Reshuffle/GroupByKey/Close
    Aug 24, 2018 12:20:38 AM org.apache.beam.runners.dataflow.util.MonitoringUtil$LoggingHandler
process
    INFO: 2018-08-24T00:20:37.075Z: Executing operation WriteOneFilePerWindow/TextIO.Write/WriteFiles/FinalizeTempFileBundles/Reshuffle.ViaRandomKey/Reshuffle/GroupByKey/Read+WriteOneFilePerWindow/TextIO.Write/WriteFiles/FinalizeTempFileBundles/Reshuffle.ViaRandomKey/Reshuffle/GroupByKey/GroupByWindow+WriteOneFilePerWindow/TextIO.Write/WriteFiles/FinalizeTempFileBundles/Reshuffle.ViaRandomKey/Reshuffle/ExpandIterable+WriteOneFilePerWindow/TextIO.Write/WriteFiles/FinalizeTempFileBundles/Reshuffle.ViaRandomKey/Values/Values/Map
    Aug 24, 2018 12:20:39 AM org.apache.beam.runners.dataflow.util.MonitoringUtil$LoggingHandler
process
    INFO: 2018-08-24T00:20:39.527Z: Cleaning up.
    Aug 24, 2018 12:20:40 AM org.apache.beam.runners.dataflow.util.MonitoringUtil$LoggingHandler
process
    INFO: 2018-08-24T00:20:39.647Z: Stopping worker pool...
    Aug 24, 2018 12:22:02 AM org.apache.beam.runners.dataflow.util.MonitoringUtil$LoggingHandler
process
    INFO: 2018-08-24T00:22:01.972Z: Autoscaling: Resized worker pool from 1 to 0.
    Aug 24, 2018 12:22:02 AM org.apache.beam.runners.dataflow.util.MonitoringUtil$LoggingHandler
process
    INFO: 2018-08-24T00:22:02.009Z: Autoscaling: Would further reduce the number of workers
but reached the minimum number allowed for the job.
    Aug 24, 2018 12:22:02 AM org.apache.beam.runners.dataflow.util.MonitoringUtil$LoggingHandler
process
    INFO: 2018-08-24T00:22:02.074Z: Worker pool stopped.
    Aug 24, 2018 12:22:11 AM org.apache.beam.runners.dataflow.DataflowPipelineJob waitUntilFinish
    INFO: Job 2018-08-23_17_18_25-18373950337223529140 finished with status DONE.
    Aug 24, 2018 12:22:11 AM org.apache.beam.runners.dataflow.TestDataflowRunner checkForPAssertSuccess
    INFO: Success result for Dataflow job 2018-08-23_17_18_25-18373950337223529140. Found
0 success, 0 failures out of 0 expected assertions.
    Aug 24, 2018 12:22:13 AM org.apache.beam.runners.dataflow.DataflowPipelineJob waitUntilFinish
    INFO: Job 2018-08-23_17_18_25-18373950337223529140 finished with status DONE.

Gradle Test Executor 95 finished executing tests.

> Task :beam-runners-google-cloud-dataflow-java-examples:preCommit
Finished generating test XML results (0.008 secs) into: <https://builds.apache.org/job/beam_PreCommit_Java_Cron/ws/src/runners/google-cloud-dataflow-java/examples/build/test-results/preCommit>
Generating HTML test report...
Finished generating test html results (0.007 secs) into: <https://builds.apache.org/job/beam_PreCommit_Java_Cron/ws/src/runners/google-cloud-dataflow-java/examples/build/reports/tests/preCommit>
Packing task ':beam-runners-google-cloud-dataflow-java-examples:preCommit'
:beam-runners-google-cloud-dataflow-java-examples:preCommit (Thread[Task worker for ':' Thread
7,5,main]) completed. Took 12 mins 28.372 secs.
:beam-examples-java:preCommit (Thread[Task worker for ':' Thread 7,5,main]) started.
:beam-runners-google-cloud-dataflow-java-examples:test (Thread[Task worker for ':' Thread
9,5,main]) started.

> Task :beam-examples-java:preCommit
Skipping task ':beam-examples-java:preCommit' as it has no actions.
:beam-examples-java:preCommit (Thread[Task worker for ':' Thread 7,5,main]) completed. Took
0.0 secs.

> Task :beam-runners-google-cloud-dataflow-java-examples:test NO-SOURCE
Skipping task ':beam-runners-google-cloud-dataflow-java-examples:test' as it has no source
files and no previous output files.
:beam-runners-google-cloud-dataflow-java-examples:test (Thread[Task worker for ':' Thread
9,5,main]) completed. Took 0.001 secs.
:beam-runners-google-cloud-dataflow-java-examples:check (Thread[Task worker for ':' Thread
9,5,main]) started.

> Task :beam-runners-google-cloud-dataflow-java-examples:check
Skipping task ':beam-runners-google-cloud-dataflow-java-examples:check' as it has no actions.
:beam-runners-google-cloud-dataflow-java-examples:check (Thread[Task worker for ':' Thread
9,5,main]) completed. Took 0.0 secs.
:beam-runners-google-cloud-dataflow-java-examples:build (Thread[Task worker for ':',5,main])
started.

> Task :beam-runners-google-cloud-dataflow-java-examples:build
Skipping task ':beam-runners-google-cloud-dataflow-java-examples:build' as it has no actions.
:beam-runners-google-cloud-dataflow-java-examples:build (Thread[Task worker for ':',5,main])
completed. Took 0.0 secs.
:beam-runners-google-cloud-dataflow-java-examples:buildDependents (Thread[Task worker for
':',5,main]) started.

> Task :beam-runners-google-cloud-dataflow-java-examples:buildDependents
Caching disabled for task ':beam-runners-google-cloud-dataflow-java-examples:buildDependents':
Caching has not been enabled for the task
Task ':beam-runners-google-cloud-dataflow-java-examples:buildDependents' is not up-to-date
because:
  Task has not declared any outputs despite executing actions.
:beam-runners-google-cloud-dataflow-java-examples:buildDependents (Thread[Task worker for
':',5,main]) completed. Took 0.0 secs.
:beam-examples-java:buildDependents (Thread[Task worker for ':',5,main]) started.
:beam-runners-google-cloud-dataflow-java:buildDependents (Thread[Task worker for ':' Thread
11,5,main]) started.

> Task :beam-examples-java:buildDependents
Caching disabled for task ':beam-examples-java:buildDependents': Caching has not been enabled
for the task
Task ':beam-examples-java:buildDependents' is not up-to-date because:
  Task has not declared any outputs despite executing actions.
:beam-examples-java:buildDependents (Thread[Task worker for ':',5,main]) completed. Took 0.0
secs.

> Task :beam-runners-google-cloud-dataflow-java:buildDependents
Caching disabled for task ':beam-runners-google-cloud-dataflow-java:buildDependents': Caching
has not been enabled for the task
Task ':beam-runners-google-cloud-dataflow-java:buildDependents' is not up-to-date because:
  Task has not declared any outputs despite executing actions.
:beam-runners-google-cloud-dataflow-java:buildDependents (Thread[Task worker for ':' Thread
11,5,main]) completed. Took 0.0 secs.
:beam-sdks-java-io-google-cloud-platform:buildDependents (Thread[Task worker for ':' Thread
11,5,main]) started.

> Task :beam-sdks-java-io-google-cloud-platform:buildDependents
Caching disabled for task ':beam-sdks-java-io-google-cloud-platform:buildDependents': Caching
has not been enabled for the task
Task ':beam-sdks-java-io-google-cloud-platform:buildDependents' is not up-to-date because:
  Task has not declared any outputs despite executing actions.
:beam-sdks-java-io-google-cloud-platform:buildDependents (Thread[Task worker for ':' Thread
11,5,main]) completed. Took 0.0 secs.
:beam-runners-direct-java:buildDependents (Thread[Task worker for ':' Thread 8,5,main]) started.
:beam-sdks-java-extensions-protobuf:buildDependents (Thread[Task worker for ':' Thread 2,5,main])
started.

> Task :beam-sdks-java-extensions-protobuf:buildDependents
Caching disabled for task ':beam-sdks-java-extensions-protobuf:buildDependents': Caching has
not been enabled for the task
Task ':beam-sdks-java-extensions-protobuf:buildDependents' is not up-to-date because:
  Task has not declared any outputs despite executing actions.
:beam-sdks-java-extensions-protobuf:buildDependents (Thread[Task worker for ':' Thread 2,5,main])
completed. Took 0.0 secs.

> Task :beam-runners-direct-java:buildDependents
Caching disabled for task ':beam-runners-direct-java:buildDependents': Caching has not been
enabled for the task
Task ':beam-runners-direct-java:buildDependents' is not up-to-date because:
  Task has not declared any outputs despite executing actions.
:beam-runners-direct-java:buildDependents (Thread[Task worker for ':' Thread 8,5,main]) completed.
Took 0.0 secs.
:beam-runners-java-fn-execution:buildDependents (Thread[Task worker for ':' Thread 8,5,main])
started.
:beam-runners-local-java-core:buildDependents (Thread[Task worker for ':' Thread 4,5,main])
started.

> Task :beam-runners-java-fn-execution:buildDependents
Caching disabled for task ':beam-runners-java-fn-execution:buildDependents': Caching has not
been enabled for the task
Task ':beam-runners-java-fn-execution:buildDependents' is not up-to-date because:
  Task has not declared any outputs despite executing actions.
:beam-runners-java-fn-execution:buildDependents (Thread[Task worker for ':' Thread 8,5,main])
completed. Took 0.0 secs.

> Task :beam-runners-local-java-core:buildDependents
Caching disabled for task ':beam-runners-local-java-core:buildDependents': Caching has not
been enabled for the task
Task ':beam-runners-local-java-core:buildDependents' is not up-to-date because:
  Task has not declared any outputs despite executing actions.
:beam-sdks-java-harness:buildDependents (Thread[Task worker for ':' Thread 8,5,main]) started.
:beam-runners-local-java-core:buildDependents (Thread[Task worker for ':' Thread 4,5,main])
completed. Took 0.0 secs.
:beam-vendor-sdks-java-extensions-protobuf:buildDependents (Thread[Task worker for ':' Thread
2,5,main]) started.

> Task :beam-sdks-java-harness:buildDependents
Caching disabled for task ':beam-sdks-java-harness:buildDependents': Caching has not been
enabled for the task
Task ':beam-sdks-java-harness:buildDependents' is not up-to-date because:
  Task has not declared any outputs despite executing actions.
:beam-sdks-java-harness:buildDependents (Thread[Task worker for ':' Thread 8,5,main]) completed.
Took 0.0 secs.

> Task :beam-vendor-sdks-java-extensions-protobuf:buildDependents
Caching disabled for task ':beam-vendor-sdks-java-extensions-protobuf:buildDependents': Caching
has not been enabled for the task
Task ':beam-vendor-sdks-java-extensions-protobuf:buildDependents' is not up-to-date because:
  Task has not declared any outputs despite executing actions.
:beam-vendor-sdks-java-extensions-protobuf:buildDependents (Thread[Task worker for ':' Thread
2,5,main]) completed. Took 0.0 secs.
:beam-sdks-java-extensions-google-cloud-platform-core:buildDependents (Thread[Task worker
for ':' Thread 8,5,main]) started.
:beam-sdks-java-fn-execution:buildDependents (Thread[Task worker for ':' Thread 2,5,main])
started.

> Task :beam-sdks-java-extensions-google-cloud-platform-core:buildDependents
Caching disabled for task ':beam-sdks-java-extensions-google-cloud-platform-core:buildDependents':
Caching has not been enabled for the task
Task ':beam-sdks-java-extensions-google-cloud-platform-core:buildDependents' is not up-to-date
because:
  Task has not declared any outputs despite executing actions.
:beam-sdks-java-extensions-google-cloud-platform-core:buildDependents (Thread[Task worker
for ':' Thread 8,5,main]) completed. Took 0.0 secs.

> Task :beam-sdks-java-fn-execution:buildDependents
Caching disabled for task ':beam-sdks-java-fn-execution:buildDependents': Caching has not
been enabled for the task
Task ':beam-sdks-java-fn-execution:buildDependents' is not up-to-date because:
  Task has not declared any outputs despite executing actions.
:beam-sdks-java-fn-execution:buildDependents (Thread[Task worker for ':' Thread 2,5,main])
completed. Took 0.0 secs.

FAILURE: Build failed with an exception.

* What went wrong:
Execution failed for task ':beam-runners-apex:compileTestJava'.
> Compilation failed with exit code 1; see the compiler error output for details.

* Try:
Run with --stacktrace option to get the stack trace. Run with --debug option to get more log
output. Run with --scan to get full insights.

* Get more help at https://help.gradle.org

Deprecated Gradle features were used in this build, making it incompatible with Gradle 5.0.
See https://docs.gradle.org/4.8/userguide/command_line_interface.html#sec:command_line_warnings

BUILD FAILED in 21m 58s
804 actionable tasks: 800 executed, 4 from cache

Publishing build scan...
https://gradle.com/s/mudaabbfq65e2

Build step 'Invoke Gradle script' changed build result to FAILURE
Build step 'Invoke Gradle script' marked build as failure

Mime
View raw message