beam-commits mailing list archives

Site index · List index
Message view « Date » · « Thread »
Top « Date » · « Thread »
From Apache Jenkins Server <jenk...@builds.apache.org>
Subject Build failed in Jenkins: beam_PostCommit_Go_GradleBuild #805
Date Mon, 27 Aug 2018 22:39:50 GMT
See <https://builds.apache.org/job/beam_PostCommit_Go_GradleBuild/805/display/redirect?page=changes>

Changes:

[Ankur] Set test name in the pipeline name

------------------------------------------
[...truncated 536.50 KB...]
        "output_info": [
          {
            "user_name": "i0",
            "output_name": "i0",
            "encoding": {
              "@type": "kind:windowed_value",
              "component_encodings": [
                {
                  "@type": "kind:pair",
                  "component_encodings": [
                    {
                      "@type": "kind:length_prefix",
                      "component_encodings": [
                        {
                          "@type": "Cgd2YXJpbnR6EgIIAhqFAQpxZ2l0aHViLmNvbS9hcGFjaGUvYmVhbS9zZGtzL2dvL3Rlc3QvdmVuZG9yL2dpdGh1Yi5jb20vYXBhY2hlL2JlYW0vc2Rrcy9nby9wa2cvYmVhbS9jb3JlL3J1bnRpbWUvY29kZXJ4LmVuY1ZhckludFoSEAgWIgQIGUAPKgYIFBICCAgikQEKcWdpdGh1Yi5jb20vYXBhY2hlL2JlYW0vc2Rrcy9nby90ZXN0L3ZlbmRvci9naXRodWIuY29tL2FwYWNoZS9iZWFtL3Nka3MvZ28vcGtnL2JlYW0vY29yZS9ydW50aW1lL2NvZGVyeC5kZWNWYXJJbnRaEhwIFiIECBlAAyIGCBQSAggIKgQIGUAPKgQIGUAB"
                        }
                      ]
                    },
                    {
                      "@type": "kind:length_prefix",
                      "component_encodings": [
                        {
                          "@type": "Cgd2YXJpbnR6EgIIAhqFAQpxZ2l0aHViLmNvbS9hcGFjaGUvYmVhbS9zZGtzL2dvL3Rlc3QvdmVuZG9yL2dpdGh1Yi5jb20vYXBhY2hlL2JlYW0vc2Rrcy9nby9wa2cvYmVhbS9jb3JlL3J1bnRpbWUvY29kZXJ4LmVuY1ZhckludFoSEAgWIgQIGUAPKgYIFBICCAgikQEKcWdpdGh1Yi5jb20vYXBhY2hlL2JlYW0vc2Rrcy9nby90ZXN0L3ZlbmRvci9naXRodWIuY29tL2FwYWNoZS9iZWFtL3Nka3MvZ28vcGtnL2JlYW0vY29yZS9ydW50aW1lL2NvZGVyeC5kZWNWYXJJbnRaEhwIFiIECBlAAyIGCBQSAggIKgQIGUAPKgQIGUAB"
                        }
                      ]
                    }
                  ],
                  "is_pair_like": true
                },
                {
                  "@type": "kind:global_window"
                }
              ],
              "is_wrapper": true
            }
          }
        ],
        "parallel_input": {
          "@type": "OutputReference",
          "step_name": "e7",
          "output_name": "i1"
        },
        "serialized_fn": "e11"
      }
    },
    {
      "kind": "GroupByKey",
      "name": "e12",
      "properties": {
        "user_name": "passert.Sum(b)/CoGBK",
        "output_info": [
          {
            "user_name": "i0",
            "output_name": "i0",
            "encoding": {
              "@type": "kind:windowed_value",
              "component_encodings": [
                {
                  "@type": "kind:pair",
                  "component_encodings": [
                    {
                      "@type": "kind:length_prefix",
                      "component_encodings": [
                        {
                          "@type": "Cgd2YXJpbnR6EgIIAhqFAQpxZ2l0aHViLmNvbS9hcGFjaGUvYmVhbS9zZGtzL2dvL3Rlc3QvdmVuZG9yL2dpdGh1Yi5jb20vYXBhY2hlL2JlYW0vc2Rrcy9nby9wa2cvYmVhbS9jb3JlL3J1bnRpbWUvY29kZXJ4LmVuY1ZhckludFoSEAgWIgQIGUAPKgYIFBICCAgikQEKcWdpdGh1Yi5jb20vYXBhY2hlL2JlYW0vc2Rrcy9nby90ZXN0L3ZlbmRvci9naXRodWIuY29tL2FwYWNoZS9iZWFtL3Nka3MvZ28vcGtnL2JlYW0vY29yZS9ydW50aW1lL2NvZGVyeC5kZWNWYXJJbnRaEhwIFiIECBlAAyIGCBQSAggIKgQIGUAPKgQIGUAB"
                        }
                      ]
                    },
                    {
                      "@type": "kind:stream",
                      "component_encodings": [
                        {
                          "@type": "kind:length_prefix",
                          "component_encodings": [
                            {
                              "@type": "Cgd2YXJpbnR6EgIIAhqFAQpxZ2l0aHViLmNvbS9hcGFjaGUvYmVhbS9zZGtzL2dvL3Rlc3QvdmVuZG9yL2dpdGh1Yi5jb20vYXBhY2hlL2JlYW0vc2Rrcy9nby9wa2cvYmVhbS9jb3JlL3J1bnRpbWUvY29kZXJ4LmVuY1ZhckludFoSEAgWIgQIGUAPKgYIFBICCAgikQEKcWdpdGh1Yi5jb20vYXBhY2hlL2JlYW0vc2Rrcy9nby90ZXN0L3ZlbmRvci9naXRodWIuY29tL2FwYWNoZS9iZWFtL3Nka3MvZ28vcGtnL2JlYW0vY29yZS9ydW50aW1lL2NvZGVyeC5kZWNWYXJJbnRaEhwIFiIECBlAAyIGCBQSAggIKgQIGUAPKgQIGUAB"
                            }
                          ]
                        }
                      ],
                      "is_stream_like": true
                    }
                  ],
                  "is_pair_like": true
                },
                {
                  "@type": "kind:global_window"
                }
              ],
              "is_wrapper": true
            }
          }
        ],
        "parallel_input": {
          "@type": "OutputReference",
          "step_name": "e11",
          "output_name": "i0"
        },
        "serialized_fn": "%0A%29%22%27%0A%02c1%12%21%0A%1F%0A%1D%0A%1Bbeam:coder:global_window:v1j9%0A%25%0A%23%0A%21beam:windowfn:global_windows:v0.1%10%01%1A%02c1%22%02:%00%28%010%018%02H%01"
      }
    },
    {
      "kind": "ParallelDo",
      "name": "e13",
      "properties": {
        "user_name": "passert.Sum(b)/passert.sumFn'1",
        "output_info": [
          {
            "user_name": "bogus",
            "output_name": "bogus",
            "encoding": {
              "@type": "kind:windowed_value",
              "component_encodings": [
                {
                  "@type": "kind:bytes"
                },
                {
                  "@type": "kind:global_window"
                }
              ],
              "is_wrapper": true
            }
          }
        ],
        "parallel_input": {
          "@type": "OutputReference",
          "step_name": "e12",
          "output_name": "i0"
        },
        "serialized_fn": "e13"
      }
    }
  ],
  "type": "JOB_TYPE_BATCH"
}
2018/08/27 22:35:45 Submitted job: 2018-08-27_15_35_44-6958679095557680288
2018/08/27 22:35:45 Console: https://console.cloud.google.com/dataflow/job/2018-08-27_15_35_44-6958679095557680288?project=apache-beam-testing
2018/08/27 22:35:45 Logs: https://console.cloud.google.com/logs/viewer?project=apache-beam-testing&resource=dataflow_step%2Fjob_id%2F2018-08-27_15_35_44-6958679095557680288
2018/08/27 22:35:45 Submitted job: 2018-08-27_15_35_45-4499190570209211275
2018/08/27 22:35:45 Console: https://console.cloud.google.com/dataflow/job/2018-08-27_15_35_45-4499190570209211275?project=apache-beam-testing
2018/08/27 22:35:45 Logs: https://console.cloud.google.com/logs/viewer?project=apache-beam-testing&resource=dataflow_step%2Fjob_id%2F2018-08-27_15_35_45-4499190570209211275
2018/08/27 22:35:45 Submitted job: 2018-08-27_15_35_44-14704768241333214124
2018/08/27 22:35:45 Console: https://console.cloud.google.com/dataflow/job/2018-08-27_15_35_44-14704768241333214124?project=apache-beam-testing
2018/08/27 22:35:45 Logs: https://console.cloud.google.com/logs/viewer?project=apache-beam-testing&resource=dataflow_step%2Fjob_id%2F2018-08-27_15_35_44-14704768241333214124
2018/08/27 22:35:45 Submitted job: 2018-08-27_15_35_45-234412790828446666
2018/08/27 22:35:45 Console: https://console.cloud.google.com/dataflow/job/2018-08-27_15_35_45-234412790828446666?project=apache-beam-testing
2018/08/27 22:35:45 Logs: https://console.cloud.google.com/logs/viewer?project=apache-beam-testing&resource=dataflow_step%2Fjob_id%2F2018-08-27_15_35_45-234412790828446666
2018/08/27 22:35:46 Job state: JOB_STATE_PENDING ...
2018/08/27 22:35:46 Job state: JOB_STATE_PENDING ...
2018/08/27 22:35:46 Submitted job: 2018-08-27_15_35_45-7909151966644260606
2018/08/27 22:35:46 Console: https://console.cloud.google.com/dataflow/job/2018-08-27_15_35_45-7909151966644260606?project=apache-beam-testing
2018/08/27 22:35:46 Logs: https://console.cloud.google.com/logs/viewer?project=apache-beam-testing&resource=dataflow_step%2Fjob_id%2F2018-08-27_15_35_45-7909151966644260606
2018/08/27 22:35:46 Job state: JOB_STATE_PENDING ...
2018/08/27 22:35:46 Job state: JOB_STATE_PENDING ...
2018/08/27 22:35:46 Job state: JOB_STATE_PENDING ...
2018/08/27 22:36:16 Job still running ...
2018/08/27 22:36:16 Job still running ...
2018/08/27 22:36:16 Job still running ...
2018/08/27 22:36:16 Job still running ...
2018/08/27 22:36:16 Job still running ...
2018/08/27 22:36:46 Job still running ...
2018/08/27 22:36:46 Job still running ...
2018/08/27 22:36:46 Job still running ...
2018/08/27 22:36:46 Job still running ...
2018/08/27 22:36:46 Job still running ...
2018/08/27 22:37:16 Job still running ...
2018/08/27 22:37:16 Job still running ...
2018/08/27 22:37:16 Job still running ...
2018/08/27 22:37:16 Job still running ...
2018/08/27 22:37:16 Job still running ...
2018/08/27 22:37:46 Job still running ...
2018/08/27 22:37:46 Job still running ...
2018/08/27 22:37:46 Job still running ...
2018/08/27 22:37:46 Job still running ...
2018/08/27 22:37:46 Job still running ...
2018/08/27 22:38:16 Job still running ...
2018/08/27 22:38:16 Job still running ...
2018/08/27 22:38:16 Job still running ...
2018/08/27 22:38:16 Job still running ...
2018/08/27 22:38:16 Job still running ...
2018/08/27 22:38:46 Job still running ...
2018/08/27 22:38:46 Job still running ...
2018/08/27 22:38:46 Job succeeded!
2018/08/27 22:38:46 Test wordcount:memfs completed
2018/08/27 22:38:46 Job still running ...
2018/08/27 22:38:46 Job still running ...
2018/08/27 22:39:16 Job succeeded!
2018/08/27 22:39:16 Test wordcount:kinglear completed
2018/08/27 22:39:16 Job succeeded!
2018/08/27 22:39:16 Test pardo:multioutput completed
2018/08/27 22:39:16 Job still running ...
2018/08/27 22:39:16 Job still running ...
2018/08/27 22:39:46 Job succeeded!
2018/08/27 22:39:46 Test flatten:flatten completed
2018/08/27 22:39:46 Job succeeded!
2018/08/27 22:39:46 Test cogbk:cogbk completed
2018/08/27 22:39:46 Result: all tests passed!

# TODO(herohde) 5/9/2018: run other runner tests here to reuse the container image?

# Delete the container locally and remotely
docker rmi $CONTAINER:$TAG || echo "Failed to remove container"
Untagged: us.gcr.io/apache-beam-testing/jenkins/go:20180827-223447
Untagged: us.gcr.io/apache-beam-testing/jenkins/go@sha256:cf1d802ceb58066f85575029c0f3f967f3331b46dab23b3f83747d3b4f9ed2a4
Deleted: sha256:209d2c4c0b24a88a19826faaaed6a2504d2045446fd90a5a3c1afbf21b818934
Deleted: sha256:d81759c16c3c1fe3ef526b79cb71b7ab31793cc55c34752a9a3911573d375799
Deleted: sha256:f577c458f8f863fa931f106676cc6bef41585c33de08c0d3411e973f752caa1c
Deleted: sha256:047ebc33562893bf577c27a107588a3aff60f9bb84ebff46f7d7a4448cff6d61
Deleted: sha256:e3a1f46169c7c5490a9ddffc3aea8512ad11d9dc069e7bb1536bf3fc48d85d53
Deleted: sha256:a726977e9e1b7d5d82019f80f06819994714f5dc0f61f142438a78575595891e
gcloud --quiet container images delete $CONTAINER:$TAG || echo "Failed to delete container"
Digests:
- us.gcr.io/apache-beam-testing/jenkins/go@sha256:cf1d802ceb58066f85575029c0f3f967f3331b46dab23b3f83747d3b4f9ed2a4
  Associated tags:
 - 20180827-223447
Tags:
- us.gcr.io/apache-beam-testing/jenkins/go:20180827-223447
Deleted [us.gcr.io/apache-beam-testing/jenkins/go:20180827-223447].
Deleted [us.gcr.io/apache-beam-testing/jenkins/go@sha256:cf1d802ceb58066f85575029c0f3f967f3331b46dab23b3f83747d3b4f9ed2a4].

# Clean up tempdir
rm -rf $TMPDIR

echo ">>> SUCCESS"
>>> SUCCESS
:goIntegrationTests (Thread[Task worker for ':',5,main]) completed. Took 5 mins 3.012 secs.

FAILURE: Build failed with an exception.

* What went wrong:
Execution failed for task ':beam-sdks-go:test'.
> There are 1 failed tests. Please see <https://builds.apache.org/job/beam_PostCommit_Go_GradleBuild/ws/src/sdks/go/.gogradle/reports/test/index.html>
for more details.

* Try:
Run with --stacktrace option to get the stack trace. Run with --debug option to get more log
output. Run with --scan to get full insights.

* Get more help at https://help.gradle.org

Deprecated Gradle features were used in this build, making it incompatible with Gradle 5.0.
See https://docs.gradle.org/4.8/userguide/command_line_interface.html#sec:command_line_warnings

BUILD FAILED in 7m 1s
44 actionable tasks: 44 executed

Publishing build scan...
https://gradle.com/s/gfhveebwacs62

Build step 'Invoke Gradle script' changed build result to FAILURE
Build step 'Invoke Gradle script' marked build as failure

Mime
View raw message