beam-commits mailing list archives

Site index · List index
Message view « Date » · « Thread »
Top « Date » · « Thread »
From Apache Jenkins Server <jenk...@builds.apache.org>
Subject Build failed in Jenkins: beam_PostCommit_Go_GradleBuild #789
Date Sat, 25 Aug 2018 00:07:19 GMT
See <https://builds.apache.org/job/beam_PostCommit_Go_GradleBuild/789/display/redirect>

------------------------------------------
[...truncated 537.98 KB...]
        "parallel_input": {
          "@type": "OutputReference",
          "step_name": "e8",
          "output_name": "i0"
        },
        "serialized_fn": "e9"
      }
    },
    {
      "kind": "ParallelDo",
      "name": "e10",
      "properties": {
        "user_name": "passert.Hash(out)/beam.addFixedKeyFn",
        "output_info": [
          {
            "user_name": "i0",
            "output_name": "i0",
            "encoding": {
              "@type": "kind:windowed_value",
              "component_encodings": [
                {
                  "@type": "kind:pair",
                  "component_encodings": [
                    {
                      "@type": "kind:length_prefix",
                      "component_encodings": [
                        {
                          "@type": "Cgd2YXJpbnR6EgIIAhqFAQpxZ2l0aHViLmNvbS9hcGFjaGUvYmVhbS9zZGtzL2dvL3Rlc3QvdmVuZG9yL2dpdGh1Yi5jb20vYXBhY2hlL2JlYW0vc2Rrcy9nby9wa2cvYmVhbS9jb3JlL3J1bnRpbWUvY29kZXJ4LmVuY1ZhckludFoSEAgWIgQIGUAPKgYIFBICCAgikQEKcWdpdGh1Yi5jb20vYXBhY2hlL2JlYW0vc2Rrcy9nby90ZXN0L3ZlbmRvci9naXRodWIuY29tL2FwYWNoZS9iZWFtL3Nka3MvZ28vcGtnL2JlYW0vY29yZS9ydW50aW1lL2NvZGVyeC5kZWNWYXJJbnRaEhwIFiIECBlAAyIGCBQSAggIKgQIGUAPKgQIGUAB"
                        }
                      ]
                    },
                    {
                      "@type": "kind:bytes"
                    }
                  ],
                  "is_pair_like": true
                },
                {
                  "@type": "kind:global_window"
                }
              ],
              "is_wrapper": true
            }
          }
        ],
        "parallel_input": {
          "@type": "OutputReference",
          "step_name": "e9",
          "output_name": "i0"
        },
        "serialized_fn": "e10"
      }
    },
    {
      "kind": "GroupByKey",
      "name": "e11",
      "properties": {
        "user_name": "passert.Hash(out)/CoGBK",
        "output_info": [
          {
            "user_name": "i0",
            "output_name": "i0",
            "encoding": {
              "@type": "kind:windowed_value",
              "component_encodings": [
                {
                  "@type": "kind:pair",
                  "component_encodings": [
                    {
                      "@type": "kind:length_prefix",
                      "component_encodings": [
                        {
                          "@type": "Cgd2YXJpbnR6EgIIAhqFAQpxZ2l0aHViLmNvbS9hcGFjaGUvYmVhbS9zZGtzL2dvL3Rlc3QvdmVuZG9yL2dpdGh1Yi5jb20vYXBhY2hlL2JlYW0vc2Rrcy9nby9wa2cvYmVhbS9jb3JlL3J1bnRpbWUvY29kZXJ4LmVuY1ZhckludFoSEAgWIgQIGUAPKgYIFBICCAgikQEKcWdpdGh1Yi5jb20vYXBhY2hlL2JlYW0vc2Rrcy9nby90ZXN0L3ZlbmRvci9naXRodWIuY29tL2FwYWNoZS9iZWFtL3Nka3MvZ28vcGtnL2JlYW0vY29yZS9ydW50aW1lL2NvZGVyeC5kZWNWYXJJbnRaEhwIFiIECBlAAyIGCBQSAggIKgQIGUAPKgQIGUAB"
                        }
                      ]
                    },
                    {
                      "@type": "kind:stream",
                      "component_encodings": [
                        {
                          "@type": "kind:bytes"
                        }
                      ],
                      "is_stream_like": true
                    }
                  ],
                  "is_pair_like": true
                },
                {
                  "@type": "kind:global_window"
                }
              ],
              "is_wrapper": true
            }
          }
        ],
        "parallel_input": {
          "@type": "OutputReference",
          "step_name": "e10",
          "output_name": "i0"
        },
        "serialized_fn": "%0A%29%22%27%0A%02c4%12%21%0A%1F%0A%1D%0A%1Bbeam:coder:global_window:v1j9%0A%25%0A%23%0A%21beam:windowfn:global_windows:v0.1%10%01%1A%02c4%22%02:%00%28%010%018%02H%01"
      }
    },
    {
      "kind": "ParallelDo",
      "name": "e12",
      "properties": {
        "user_name": "passert.Hash(out)/passert.hashFn",
        "output_info": [
          {
            "user_name": "bogus",
            "output_name": "bogus",
            "encoding": {
              "@type": "kind:windowed_value",
              "component_encodings": [
                {
                  "@type": "kind:bytes"
                },
                {
                  "@type": "kind:global_window"
                }
              ],
              "is_wrapper": true
            }
          }
        ],
        "parallel_input": {
          "@type": "OutputReference",
          "step_name": "e11",
          "output_name": "i0"
        },
        "serialized_fn": "e12"
      }
    }
  ],
  "type": "JOB_TYPE_BATCH"
}
2018/08/25 00:03:14 Submitted job: 2018-08-24_17_03_13-17965242792057870920
2018/08/25 00:03:14 Console: https://console.cloud.google.com/dataflow/job/2018-08-24_17_03_13-17965242792057870920?project=apache-beam-testing
2018/08/25 00:03:14 Logs: https://console.cloud.google.com/logs/viewer?project=apache-beam-testing&resource=dataflow_step%2Fjob_id%2F2018-08-24_17_03_13-17965242792057870920
2018/08/25 00:03:14 Submitted job: 2018-08-24_17_03_13-11398438477975452138
2018/08/25 00:03:14 Console: https://console.cloud.google.com/dataflow/job/2018-08-24_17_03_13-11398438477975452138?project=apache-beam-testing
2018/08/25 00:03:14 Logs: https://console.cloud.google.com/logs/viewer?project=apache-beam-testing&resource=dataflow_step%2Fjob_id%2F2018-08-24_17_03_13-11398438477975452138
2018/08/25 00:03:14 Job state: JOB_STATE_PENDING ...
2018/08/25 00:03:14 Submitted job: 2018-08-24_17_03_13-3273323743239723963
2018/08/25 00:03:14 Console: https://console.cloud.google.com/dataflow/job/2018-08-24_17_03_13-3273323743239723963?project=apache-beam-testing
2018/08/25 00:03:14 Logs: https://console.cloud.google.com/logs/viewer?project=apache-beam-testing&resource=dataflow_step%2Fjob_id%2F2018-08-24_17_03_13-3273323743239723963
2018/08/25 00:03:14 Submitted job: 2018-08-24_17_03_13-10522924859300038426
2018/08/25 00:03:14 Console: https://console.cloud.google.com/dataflow/job/2018-08-24_17_03_13-10522924859300038426?project=apache-beam-testing
2018/08/25 00:03:14 Logs: https://console.cloud.google.com/logs/viewer?project=apache-beam-testing&resource=dataflow_step%2Fjob_id%2F2018-08-24_17_03_13-10522924859300038426
2018/08/25 00:03:14 Job state: JOB_STATE_PENDING ...
2018/08/25 00:03:14 Job state: JOB_STATE_PENDING ...
2018/08/25 00:03:14 Job state: JOB_STATE_PENDING ...
2018/08/25 00:03:14 Submitted job: 2018-08-24_17_03_13-12823140105456871291
2018/08/25 00:03:14 Console: https://console.cloud.google.com/dataflow/job/2018-08-24_17_03_13-12823140105456871291?project=apache-beam-testing
2018/08/25 00:03:14 Logs: https://console.cloud.google.com/logs/viewer?project=apache-beam-testing&resource=dataflow_step%2Fjob_id%2F2018-08-24_17_03_13-12823140105456871291
2018/08/25 00:03:14 Job state: JOB_STATE_PENDING ...
2018/08/25 00:03:44 Job still running ...
2018/08/25 00:03:44 Job still running ...
2018/08/25 00:03:44 Job still running ...
2018/08/25 00:03:44 Job still running ...
2018/08/25 00:03:44 Job still running ...
2018/08/25 00:04:14 Job still running ...
2018/08/25 00:04:14 Job still running ...
2018/08/25 00:04:14 Job still running ...
2018/08/25 00:04:14 Job still running ...
2018/08/25 00:04:14 Job still running ...
2018/08/25 00:04:44 Job still running ...
2018/08/25 00:04:44 Job still running ...
2018/08/25 00:04:44 Job still running ...
2018/08/25 00:04:44 Job still running ...
2018/08/25 00:04:44 Job still running ...
2018/08/25 00:05:14 Job still running ...
2018/08/25 00:05:14 Job still running ...
2018/08/25 00:05:14 Job still running ...
2018/08/25 00:05:14 Job still running ...
2018/08/25 00:05:14 Job still running ...
2018/08/25 00:05:44 Job succeeded!
2018/08/25 00:05:44 Test pardo:multioutput completed
2018/08/25 00:05:44 Job still running ...
2018/08/25 00:05:44 Job still running ...
2018/08/25 00:05:44 Job still running ...
2018/08/25 00:05:44 Job still running ...
2018/08/25 00:06:14 Job succeeded!
2018/08/25 00:06:14 Test cogbk:cogbk completed
2018/08/25 00:06:15 Job still running ...
2018/08/25 00:06:15 Job still running ...
2018/08/25 00:06:15 Job still running ...
2018/08/25 00:06:45 Job succeeded!
2018/08/25 00:06:45 Test wordcount:memfs completed
2018/08/25 00:06:45 Job still running ...
2018/08/25 00:06:45 Job succeeded!
2018/08/25 00:06:45 Test flatten:flatten completed
2018/08/25 00:07:15 Job succeeded!
2018/08/25 00:07:15 Test wordcount:kinglear completed
2018/08/25 00:07:15 Result: all tests passed!

# TODO(herohde) 5/9/2018: run other runner tests here to reuse the container image?

# Delete the container locally and remotely
docker rmi $CONTAINER:$TAG || echo "Failed to remove container"
Untagged: us.gcr.io/apache-beam-testing/jenkins/go:20180825-000209
Untagged: us.gcr.io/apache-beam-testing/jenkins/go@sha256:fc27ef669a7db5127c945da8336290d2a58712f81588c339eec86faee4444cae
Deleted: sha256:072532729fd6979ab165d66ec47df2f636047ef7b2c6f2b131541699d40aada2
Deleted: sha256:7777f678a9dac13b6c939f4ce9a72f78c0f0d0b70b0314ebd4bfd893f2ddeb17
Deleted: sha256:74fe19c65953e8c322fd7363f6617f58a126e5a36e65118fe88b0d5324fb7d0a
Deleted: sha256:ba448394a85a8bf135d491cf66a5b702183274957ceeec4d36e0458f3e50ae28
Deleted: sha256:6c3a5795d28c43c4314cfcbaf8fd9d08ac48b65d0a2f76f6ae1be756471f403c
Deleted: sha256:c60077d0b032a07822d2b7ca4847968ce4156e99b843b5ee7a7226cd4de85c2b
gcloud --quiet container images delete $CONTAINER:$TAG || echo "Failed to delete container"
Digests:
- us.gcr.io/apache-beam-testing/jenkins/go@sha256:fc27ef669a7db5127c945da8336290d2a58712f81588c339eec86faee4444cae
  Associated tags:
 - 20180825-000209
Tags:
- us.gcr.io/apache-beam-testing/jenkins/go:20180825-000209
Deleted [us.gcr.io/apache-beam-testing/jenkins/go:20180825-000209].
Deleted [us.gcr.io/apache-beam-testing/jenkins/go@sha256:fc27ef669a7db5127c945da8336290d2a58712f81588c339eec86faee4444cae].

# Clean up tempdir
rm -rf $TMPDIR

echo ">>> SUCCESS"
>>> SUCCESS
:goIntegrationTests (Thread[Task worker for ':',5,main]) completed. Took 5 mins 9.838 secs.

FAILURE: Build failed with an exception.

* What went wrong:
Execution failed for task ':beam-sdks-go:test'.
> There are 1 failed tests. Please see <https://builds.apache.org/job/beam_PostCommit_Go_GradleBuild/ws/src/sdks/go/.gogradle/reports/test/index.html>
for more details.

* Try:
Run with --stacktrace option to get the stack trace. Run with --debug option to get more log
output. Run with --scan to get full insights.

* Get more help at https://help.gradle.org

Deprecated Gradle features were used in this build, making it incompatible with Gradle 5.0.
See https://docs.gradle.org/4.8/userguide/command_line_interface.html#sec:command_line_warnings

BUILD FAILED in 7m 7s
44 actionable tasks: 44 executed

Publishing build scan...
https://gradle.com/s/4zx7g5a42qeys

Build step 'Invoke Gradle script' changed build result to FAILURE
Build step 'Invoke Gradle script' marked build as failure

Mime
View raw message