beam-commits mailing list archives

Site index · List index
Message view « Date » · « Thread »
Top « Date » · « Thread »
From Apache Jenkins Server <jenk...@builds.apache.org>
Subject Build failed in Jenkins: beam_PostCommit_Py_VR_Dataflow #884
Date Fri, 24 Aug 2018 00:16:33 GMT
See <https://builds.apache.org/job/beam_PostCommit_Py_VR_Dataflow/884/display/redirect?page=changes>

Changes:

[jiangkai] Support datetime type minus time interval

[jiangkai] address comments

[jiangkai] add unit test for DatetimeMinusIntervalExpression

[jiangkai] add license header

------------------------------------------
[...truncated 74.92 KB...]
Collecting pyhamcrest (from -r postcommit_requirements.txt (line 1))
  File was already downloaded /tmp/dataflow-requirements-cache/PyHamcrest-1.9.0.tar.gz
  File was already downloaded /tmp/dataflow-requirements-cache/PyHamcrest-1.9.0.tar.gz
Collecting mock (from -r postcommit_requirements.txt (line 2))
Collecting mock (from -r postcommit_requirements.txt (line 2))
Collecting mock (from -r postcommit_requirements.txt (line 2))
  File was already downloaded /tmp/dataflow-requirements-cache/mock-2.0.0.tar.gz
  File was already downloaded /tmp/dataflow-requirements-cache/mock-2.0.0.tar.gz
  File was already downloaded /tmp/dataflow-requirements-cache/mock-2.0.0.tar.gz
Collecting mock (from -r postcommit_requirements.txt (line 2))
  File was already downloaded /tmp/dataflow-requirements-cache/mock-2.0.0.tar.gz
Collecting mock (from -r postcommit_requirements.txt (line 2))
Collecting mock (from -r postcommit_requirements.txt (line 2))
  File was already downloaded /tmp/dataflow-requirements-cache/mock-2.0.0.tar.gz
  File was already downloaded /tmp/dataflow-requirements-cache/mock-2.0.0.tar.gz
Collecting pyhamcrest (from -r postcommit_requirements.txt (line 1))
Collecting mock (from -r postcommit_requirements.txt (line 2))
  File was already downloaded /tmp/dataflow-requirements-cache/mock-2.0.0.tar.gz
  File was already downloaded /tmp/dataflow-requirements-cache/PyHamcrest-1.9.0.tar.gz
Collecting setuptools (from pyhamcrest->-r postcommit_requirements.txt (line 1))
Collecting setuptools (from pyhamcrest->-r postcommit_requirements.txt (line 1))
Collecting mock (from -r postcommit_requirements.txt (line 2))
Collecting setuptools (from pyhamcrest->-r postcommit_requirements.txt (line 1))
  File was already downloaded /tmp/dataflow-requirements-cache/mock-2.0.0.tar.gz
Collecting setuptools (from pyhamcrest->-r postcommit_requirements.txt (line 1))
Collecting setuptools (from pyhamcrest->-r postcommit_requirements.txt (line 1))
Collecting setuptools (from pyhamcrest->-r postcommit_requirements.txt (line 1))
Collecting setuptools (from pyhamcrest->-r postcommit_requirements.txt (line 1))
  File was already downloaded /tmp/dataflow-requirements-cache/setuptools-40.2.0.zip
  File was already downloaded /tmp/dataflow-requirements-cache/setuptools-40.2.0.zip
  File was already downloaded /tmp/dataflow-requirements-cache/setuptools-40.2.0.zip
  File was already downloaded /tmp/dataflow-requirements-cache/setuptools-40.2.0.zip
  File was already downloaded /tmp/dataflow-requirements-cache/setuptools-40.2.0.zip
  File was already downloaded /tmp/dataflow-requirements-cache/setuptools-40.2.0.zip
  File was already downloaded /tmp/dataflow-requirements-cache/setuptools-40.2.0.zip
Collecting setuptools (from pyhamcrest->-r postcommit_requirements.txt (line 1))
Collecting six (from pyhamcrest->-r postcommit_requirements.txt (line 1))
  File was already downloaded /tmp/dataflow-requirements-cache/six-1.11.0.tar.gz
Collecting six (from pyhamcrest->-r postcommit_requirements.txt (line 1))
  File was already downloaded /tmp/dataflow-requirements-cache/six-1.11.0.tar.gz
Collecting six (from pyhamcrest->-r postcommit_requirements.txt (line 1))
Collecting six (from pyhamcrest->-r postcommit_requirements.txt (line 1))
  File was already downloaded /tmp/dataflow-requirements-cache/six-1.11.0.tar.gz
  File was already downloaded /tmp/dataflow-requirements-cache/six-1.11.0.tar.gz
  File was already downloaded /tmp/dataflow-requirements-cache/setuptools-40.2.0.zip
Collecting six (from pyhamcrest->-r postcommit_requirements.txt (line 1))
  File was already downloaded /tmp/dataflow-requirements-cache/six-1.11.0.tar.gz
Collecting six (from pyhamcrest->-r postcommit_requirements.txt (line 1))
Collecting six (from pyhamcrest->-r postcommit_requirements.txt (line 1))
  File was already downloaded /tmp/dataflow-requirements-cache/six-1.11.0.tar.gz
  File was already downloaded /tmp/dataflow-requirements-cache/six-1.11.0.tar.gz
Collecting funcsigs>=1 (from mock->-r postcommit_requirements.txt (line 2))
Collecting funcsigs>=1 (from mock->-r postcommit_requirements.txt (line 2))
  File was already downloaded /tmp/dataflow-requirements-cache/funcsigs-1.0.2.tar.gz
  File was already downloaded /tmp/dataflow-requirements-cache/funcsigs-1.0.2.tar.gz
Collecting funcsigs>=1 (from mock->-r postcommit_requirements.txt (line 2))
  File was already downloaded /tmp/dataflow-requirements-cache/funcsigs-1.0.2.tar.gz
Collecting funcsigs>=1 (from mock->-r postcommit_requirements.txt (line 2))
Collecting funcsigs>=1 (from mock->-r postcommit_requirements.txt (line 2))
  File was already downloaded /tmp/dataflow-requirements-cache/funcsigs-1.0.2.tar.gz
  File was already downloaded /tmp/dataflow-requirements-cache/funcsigs-1.0.2.tar.gz
Collecting funcsigs>=1 (from mock->-r postcommit_requirements.txt (line 2))
Collecting funcsigs>=1 (from mock->-r postcommit_requirements.txt (line 2))
  File was already downloaded /tmp/dataflow-requirements-cache/funcsigs-1.0.2.tar.gz
  File was already downloaded /tmp/dataflow-requirements-cache/funcsigs-1.0.2.tar.gz
Collecting pbr>=0.11 (from mock->-r postcommit_requirements.txt (line 2))
Collecting pbr>=0.11 (from mock->-r postcommit_requirements.txt (line 2))
Collecting six (from pyhamcrest->-r postcommit_requirements.txt (line 1))
  File was already downloaded /tmp/dataflow-requirements-cache/six-1.11.0.tar.gz
Collecting pbr>=0.11 (from mock->-r postcommit_requirements.txt (line 2))
  File was already downloaded /tmp/dataflow-requirements-cache/pbr-4.2.0.tar.gz
  File was already downloaded /tmp/dataflow-requirements-cache/pbr-4.2.0.tar.gz
Collecting pbr>=0.11 (from mock->-r postcommit_requirements.txt (line 2))
  File was already downloaded /tmp/dataflow-requirements-cache/pbr-4.2.0.tar.gz
Collecting pbr>=0.11 (from mock->-r postcommit_requirements.txt (line 2))
Collecting pbr>=0.11 (from mock->-r postcommit_requirements.txt (line 2))
  File was already downloaded /tmp/dataflow-requirements-cache/pbr-4.2.0.tar.gz
  File was already downloaded /tmp/dataflow-requirements-cache/pbr-4.2.0.tar.gz
  File was already downloaded /tmp/dataflow-requirements-cache/pbr-4.2.0.tar.gz
Collecting pbr>=0.11 (from mock->-r postcommit_requirements.txt (line 2))
  File was already downloaded /tmp/dataflow-requirements-cache/pbr-4.2.0.tar.gz
Collecting funcsigs>=1 (from mock->-r postcommit_requirements.txt (line 2))
  File was already downloaded /tmp/dataflow-requirements-cache/funcsigs-1.0.2.tar.gz
Successfully downloaded pyhamcrest mock setuptools six funcsigs pbr
Successfully downloaded pyhamcrest mock setuptools six funcsigs pbr
Successfully downloaded pyhamcrest mock setuptools six funcsigs pbr
Successfully downloaded pyhamcrest mock setuptools six funcsigs pbr
Successfully downloaded pyhamcrest mock setuptools six funcsigs pbr
Collecting pbr>=0.11 (from mock->-r postcommit_requirements.txt (line 2))
Successfully downloaded pyhamcrest mock setuptools six funcsigs pbr
Successfully downloaded pyhamcrest mock setuptools six funcsigs pbr
  File was already downloaded /tmp/dataflow-requirements-cache/pbr-4.2.0.tar.gz
Successfully downloaded pyhamcrest mock setuptools six funcsigs pbr
<https://builds.apache.org/job/beam_PostCommit_Py_VR_Dataflow/ws/src/sdks/python/apache_beam/runners/dataflow/test_dataflow_runner.py>:54:
DeprecationWarning: options is deprecated since First stable release. References to <pipeline>.options
will not be supported
  print('Found: %s.' % self.build_console_url(pipeline.options))
<https://builds.apache.org/job/beam_PostCommit_Py_VR_Dataflow/ws/src/sdks/python/apache_beam/runners/dataflow/test_dataflow_runner.py>:54:
DeprecationWarning: options is deprecated since First stable release. References to <pipeline>.options
will not be supported
  print('Found: %s.' % self.build_console_url(pipeline.options))
<https://builds.apache.org/job/beam_PostCommit_Py_VR_Dataflow/ws/src/sdks/python/apache_beam/runners/dataflow/test_dataflow_runner.py>:54:
DeprecationWarning: options is deprecated since First stable release. References to <pipeline>.options
will not be supported
  print('Found: %s.' % self.build_console_url(pipeline.options))
<https://builds.apache.org/job/beam_PostCommit_Py_VR_Dataflow/ws/src/sdks/python/apache_beam/runners/dataflow/test_dataflow_runner.py>:54:
DeprecationWarning: options is deprecated since First stable release. References to <pipeline>.options
will not be supported
  print('Found: %s.' % self.build_console_url(pipeline.options))
<https://builds.apache.org/job/beam_PostCommit_Py_VR_Dataflow/ws/src/sdks/python/apache_beam/runners/dataflow/test_dataflow_runner.py>:54:
DeprecationWarning: options is deprecated since First stable release. References to <pipeline>.options
will not be supported
  print('Found: %s.' % self.build_console_url(pipeline.options))
<https://builds.apache.org/job/beam_PostCommit_Py_VR_Dataflow/ws/src/sdks/python/apache_beam/runners/dataflow/test_dataflow_runner.py>:54:
DeprecationWarning: options is deprecated since First stable release. References to <pipeline>.options
will not be supported
  print('Found: %s.' % self.build_console_url(pipeline.options))
<https://builds.apache.org/job/beam_PostCommit_Py_VR_Dataflow/ws/src/sdks/python/apache_beam/runners/dataflow/test_dataflow_runner.py>:54:
DeprecationWarning: options is deprecated since First stable release. References to <pipeline>.options
will not be supported
  print('Found: %s.' % self.build_console_url(pipeline.options))
<https://builds.apache.org/job/beam_PostCommit_Py_VR_Dataflow/ws/src/sdks/python/apache_beam/runners/dataflow/test_dataflow_runner.py>:54:
DeprecationWarning: options is deprecated since First stable release. References to <pipeline>.options
will not be supported
  print('Found: %s.' % self.build_console_url(pipeline.options))
WARNING:root:Waiting indefinitely for streaming job.
WARNING:root:Waiting indefinitely for streaming job.
WARNING:root:Waiting indefinitely for streaming job.
WARNING:root:Waiting indefinitely for streaming job.
WARNING:root:Waiting indefinitely for streaming job.
WARNING:root:Waiting indefinitely for streaming job.
WARNING:root:Waiting indefinitely for streaming job.
WARNING:root:Waiting indefinitely for streaming job.
test_as_dict_twice (apache_beam.transforms.sideinputs_test.SideInputsTest) ... ok
Collecting pyhamcrest (from -r postcommit_requirements.txt (line 1))
  File was already downloaded /tmp/dataflow-requirements-cache/PyHamcrest-1.9.0.tar.gz
Collecting mock (from -r postcommit_requirements.txt (line 2))
  File was already downloaded /tmp/dataflow-requirements-cache/mock-2.0.0.tar.gz
Collecting setuptools (from pyhamcrest->-r postcommit_requirements.txt (line 1))
  File was already downloaded /tmp/dataflow-requirements-cache/setuptools-40.2.0.zip
Collecting six (from pyhamcrest->-r postcommit_requirements.txt (line 1))
  File was already downloaded /tmp/dataflow-requirements-cache/six-1.11.0.tar.gz
Collecting funcsigs>=1 (from mock->-r postcommit_requirements.txt (line 2))
  File was already downloaded /tmp/dataflow-requirements-cache/funcsigs-1.0.2.tar.gz
Collecting pbr>=0.11 (from mock->-r postcommit_requirements.txt (line 2))
  File was already downloaded /tmp/dataflow-requirements-cache/pbr-4.2.0.tar.gz
Successfully downloaded pyhamcrest mock setuptools six funcsigs pbr
WARNING:root:Waiting indefinitely for streaming job.
test_par_do_with_multiple_outputs_and_using_return (apache_beam.transforms.ptransform_test.PTransformTest)
... ok
Collecting pyhamcrest (from -r postcommit_requirements.txt (line 1))
  File was already downloaded /tmp/dataflow-requirements-cache/PyHamcrest-1.9.0.tar.gz
Collecting mock (from -r postcommit_requirements.txt (line 2))
  File was already downloaded /tmp/dataflow-requirements-cache/mock-2.0.0.tar.gz
Collecting setuptools (from pyhamcrest->-r postcommit_requirements.txt (line 1))
  File was already downloaded /tmp/dataflow-requirements-cache/setuptools-40.2.0.zip
Collecting six (from pyhamcrest->-r postcommit_requirements.txt (line 1))
  File was already downloaded /tmp/dataflow-requirements-cache/six-1.11.0.tar.gz
Collecting funcsigs>=1 (from mock->-r postcommit_requirements.txt (line 2))
  File was already downloaded /tmp/dataflow-requirements-cache/funcsigs-1.0.2.tar.gz
Collecting pbr>=0.11 (from mock->-r postcommit_requirements.txt (line 2))
  File was already downloaded /tmp/dataflow-requirements-cache/pbr-4.2.0.tar.gz
Successfully downloaded pyhamcrest mock setuptools six funcsigs pbr
WARNING:root:Waiting indefinitely for streaming job.
test_undeclared_outputs (apache_beam.transforms.ptransform_test.PTransformTest) ... ok
Collecting pyhamcrest (from -r postcommit_requirements.txt (line 1))
  File was already downloaded /tmp/dataflow-requirements-cache/PyHamcrest-1.9.0.tar.gz
Collecting mock (from -r postcommit_requirements.txt (line 2))
  File was already downloaded /tmp/dataflow-requirements-cache/mock-2.0.0.tar.gz
Collecting setuptools (from pyhamcrest->-r postcommit_requirements.txt (line 1))
  File was already downloaded /tmp/dataflow-requirements-cache/setuptools-40.2.0.zip
Collecting six (from pyhamcrest->-r postcommit_requirements.txt (line 1))
  File was already downloaded /tmp/dataflow-requirements-cache/six-1.11.0.tar.gz
Collecting funcsigs>=1 (from mock->-r postcommit_requirements.txt (line 2))
  File was already downloaded /tmp/dataflow-requirements-cache/funcsigs-1.0.2.tar.gz
Collecting pbr>=0.11 (from mock->-r postcommit_requirements.txt (line 2))
  File was already downloaded /tmp/dataflow-requirements-cache/pbr-4.2.0.tar.gz
Successfully downloaded pyhamcrest mock setuptools six funcsigs pbr
test_multiple_empty_outputs (apache_beam.transforms.ptransform_test.PTransformTest) ... ok
Collecting pyhamcrest (from -r postcommit_requirements.txt (line 1))
  File was already downloaded /tmp/dataflow-requirements-cache/PyHamcrest-1.9.0.tar.gz
Collecting mock (from -r postcommit_requirements.txt (line 2))
  File was already downloaded /tmp/dataflow-requirements-cache/mock-2.0.0.tar.gz
Collecting setuptools (from pyhamcrest->-r postcommit_requirements.txt (line 1))
  File was already downloaded /tmp/dataflow-requirements-cache/setuptools-40.2.0.zip
Collecting six (from pyhamcrest->-r postcommit_requirements.txt (line 1))
  File was already downloaded /tmp/dataflow-requirements-cache/six-1.11.0.tar.gz
Collecting funcsigs>=1 (from mock->-r postcommit_requirements.txt (line 2))
  File was already downloaded /tmp/dataflow-requirements-cache/funcsigs-1.0.2.tar.gz
Collecting pbr>=0.11 (from mock->-r postcommit_requirements.txt (line 2))
  File was already downloaded /tmp/dataflow-requirements-cache/pbr-4.2.0.tar.gz
Successfully downloaded pyhamcrest mock setuptools six funcsigs pbr
test_flatten_multiple_pcollections_having_multiple_consumers (apache_beam.transforms.ptransform_test.PTransformTest)
... ok
Collecting pyhamcrest (from -r postcommit_requirements.txt (line 1))
  File was already downloaded /tmp/dataflow-requirements-cache/PyHamcrest-1.9.0.tar.gz
Collecting mock (from -r postcommit_requirements.txt (line 2))
  File was already downloaded /tmp/dataflow-requirements-cache/mock-2.0.0.tar.gz
Collecting setuptools (from pyhamcrest->-r postcommit_requirements.txt (line 1))
  File was already downloaded /tmp/dataflow-requirements-cache/setuptools-40.2.0.zip
Collecting six (from pyhamcrest->-r postcommit_requirements.txt (line 1))
  File was already downloaded /tmp/dataflow-requirements-cache/six-1.11.0.tar.gz
Collecting funcsigs>=1 (from mock->-r postcommit_requirements.txt (line 2))
  File was already downloaded /tmp/dataflow-requirements-cache/funcsigs-1.0.2.tar.gz
Collecting pbr>=0.11 (from mock->-r postcommit_requirements.txt (line 2))
  File was already downloaded /tmp/dataflow-requirements-cache/pbr-4.2.0.tar.gz
WARNING:root:Waiting indefinitely for streaming job.
Successfully downloaded pyhamcrest mock setuptools six funcsigs pbr
test_as_list_twice (apache_beam.transforms.sideinputs_test.SideInputsTest) ... ok
Collecting pyhamcrest (from -r postcommit_requirements.txt (line 1))
  File was already downloaded /tmp/dataflow-requirements-cache/PyHamcrest-1.9.0.tar.gz
Collecting mock (from -r postcommit_requirements.txt (line 2))
  File was already downloaded /tmp/dataflow-requirements-cache/mock-2.0.0.tar.gz
Collecting setuptools (from pyhamcrest->-r postcommit_requirements.txt (line 1))
  File was already downloaded /tmp/dataflow-requirements-cache/setuptools-40.2.0.zip
Collecting six (from pyhamcrest->-r postcommit_requirements.txt (line 1))
  File was already downloaded /tmp/dataflow-requirements-cache/six-1.11.0.tar.gz
Collecting funcsigs>=1 (from mock->-r postcommit_requirements.txt (line 2))
  File was already downloaded /tmp/dataflow-requirements-cache/funcsigs-1.0.2.tar.gz
WARNING:root:Waiting indefinitely for streaming job.
Collecting pbr>=0.11 (from mock->-r postcommit_requirements.txt (line 2))
  File was already downloaded /tmp/dataflow-requirements-cache/pbr-4.2.0.tar.gz
Successfully downloaded pyhamcrest mock setuptools six funcsigs pbr
test_par_do_with_multiple_outputs_and_using_yield (apache_beam.transforms.ptransform_test.PTransformTest)
... ok
WARNING:root:Waiting indefinitely for streaming job.
WARNING:root:Waiting indefinitely for streaming job.
test_as_list_and_as_dict_side_inputs (apache_beam.transforms.sideinputs_test.SideInputsTest)
... ok
test_as_singleton_with_different_defaults (apache_beam.transforms.sideinputs_test.SideInputsTest)
... ok
test_default_value_singleton_side_input (apache_beam.transforms.sideinputs_test.SideInputsTest)
... ok
test_as_singleton_without_unique_labels (apache_beam.transforms.sideinputs_test.SideInputsTest)
... ok
test_flattened_side_input (apache_beam.transforms.sideinputs_test.SideInputsTest) ... ok
test_iterable_side_input (apache_beam.transforms.sideinputs_test.SideInputsTest) ... ok
test_empty_singleton_side_input (apache_beam.transforms.sideinputs_test.SideInputsTest) ...
ok

----------------------------------------------------------------------
XML: <https://builds.apache.org/job/beam_PostCommit_Py_VR_Dataflow/ws/src/sdks/python/nosetests.xml>
----------------------------------------------------------------------
Ran 14 tests in 853.175s

OK
:beam-sdks-python:validatesRunnerStreamingTests (Thread[Task worker for ':',5,main]) completed.
Took 14 mins 14.593 secs.

FAILURE: Build failed with an exception.

* Where:
Build file '<https://builds.apache.org/job/beam_PostCommit_Py_VR_Dataflow/ws/src/sdks/python/build.gradle'>
line: 242

* What went wrong:
Execution failed for task ':beam-sdks-python:validatesRunnerBatchTests'.
> Process 'command 'sh'' finished with non-zero exit value 1

* Try:
Run with --stacktrace option to get the stack trace. Run with --debug option to get more log
output. Run with --scan to get full insights.

* Get more help at https://help.gradle.org

Deprecated Gradle features were used in this build, making it incompatible with Gradle 5.0.
See https://docs.gradle.org/4.8/userguide/command_line_interface.html#sec:command_line_warnings

BUILD FAILED in 27m 30s
4 actionable tasks: 4 executed

Publishing build scan...
https://gradle.com/s/ujrjxpksdjgw6

Build step 'Invoke Gradle script' changed build result to FAILURE
Build step 'Invoke Gradle script' marked build as failure

Mime
View raw message