beam-commits mailing list archives

Site index · List index
Message view « Date » · « Thread »
Top « Date » · « Thread »
From Apache Jenkins Server <jenk...@builds.apache.org>
Subject Build failed in Jenkins: beam_PostRelease_NightlySnapshot #332
Date Wed, 08 Aug 2018 00:03:57 GMT
See <https://builds.apache.org/job/beam_PostRelease_NightlySnapshot/332/display/redirect>

------------------------------------------
[...truncated 14.10 KB...]
> Task :buildSrc:compileTestGroovy NO-SOURCE
file or directory '<https://builds.apache.org/job/beam_PostRelease_NightlySnapshot/ws/src/buildSrc/src/test/groovy',>
not found
Skipping task ':buildSrc:compileTestGroovy' as it has no source files and no previous output
files.
:compileTestGroovy (Thread[Task worker for ':buildSrc',5,main]) completed. Took 0.002 secs.
:processTestResources (Thread[Task worker for ':buildSrc',5,main]) started.

> Task :buildSrc:processTestResources NO-SOURCE
file or directory '<https://builds.apache.org/job/beam_PostRelease_NightlySnapshot/ws/src/buildSrc/src/test/resources',>
not found
Skipping task ':buildSrc:processTestResources' as it has no source files and no previous output
files.
:processTestResources (Thread[Task worker for ':buildSrc',5,main]) completed. Took 0.002 secs.
:testClasses (Thread[Task worker for ':buildSrc',5,main]) started.

> Task :buildSrc:testClasses UP-TO-DATE
Skipping task ':buildSrc:testClasses' as it has no actions.
:testClasses (Thread[Task worker for ':buildSrc',5,main]) completed. Took 0.0 secs.
:test (Thread[Task worker for ':buildSrc',5,main]) started.

> Task :buildSrc:test NO-SOURCE
Skipping task ':buildSrc:test' as it has no source files and no previous output files.
:test (Thread[Task worker for ':buildSrc',5,main]) completed. Took 0.004 secs.
:check (Thread[Task worker for ':buildSrc',5,main]) started.

> Task :buildSrc:check
Skipping task ':buildSrc:check' as it has no actions.
:check (Thread[Task worker for ':buildSrc',5,main]) completed. Took 0.0 secs.
:build (Thread[Task worker for ':buildSrc',5,main]) started.

> Task :buildSrc:build
Skipping task ':buildSrc:build' as it has no actions.
:build (Thread[Task worker for ':buildSrc',5,main]) completed. Took 0.0 secs.
Settings evaluated using settings file '<https://builds.apache.org/job/beam_PostRelease_NightlySnapshot/ws/src/settings.gradle'.>
Using local directory build cache for the root build (location = /home/jenkins/.gradle/caches/build-cache-1,
removeUnusedEntriesAfter = 7 days).
Projects loaded. Root project using build file '<https://builds.apache.org/job/beam_PostRelease_NightlySnapshot/ws/src/build.gradle'.>
Included projects: [root project 'beam', project ':beam-examples-java', project ':beam-model-fn-execution',
project ':beam-model-job-management', project ':beam-model-pipeline', project ':beam-runners-apex',
project ':beam-runners-core-construction-java', project ':beam-runners-core-java', project
':beam-runners-direct-java', project ':beam-runners-extensions-java-metrics', project ':beam-runners-flink_2.11',
project ':beam-runners-flink_2.11-job-server', project ':beam-runners-gcp-gcemd', project
':beam-runners-gcp-gcsproxy', project ':beam-runners-gearpump', project ':beam-runners-google-cloud-dataflow-java',
project ':beam-runners-google-cloud-dataflow-java-examples', project ':beam-runners-google-cloud-dataflow-java-examples-streaming',
project ':beam-runners-java-fn-execution', project ':beam-runners-local-java-core', project
':beam-runners-reference-java', project ':beam-runners-samza', project ':beam-runners-spark',
project ':beam-sdks-go', project ':beam-sdks-go-container', project ':beam-sdks-go-examples',
project ':beam-sdks-go-test', project ':beam-sdks-java-build-tools', project ':beam-sdks-java-container',
project ':beam-sdks-java-core', project ':beam-sdks-java-extensions-google-cloud-platform-core',
project ':beam-sdks-java-extensions-join-library', project ':beam-sdks-java-extensions-json-jackson',
project ':beam-sdks-java-extensions-protobuf', project ':beam-sdks-java-extensions-sketching',
project ':beam-sdks-java-extensions-sorter', project ':beam-sdks-java-extensions-sql', project
':beam-sdks-java-extensions-sql-jdbc', project ':beam-sdks-java-extensions-sql-shell', project
':beam-sdks-java-fn-execution', project ':beam-sdks-java-harness', project ':beam-sdks-java-io-amazon-web-services',
project ':beam-sdks-java-io-amqp', project ':beam-sdks-java-io-cassandra', project ':beam-sdks-java-io-common',
project ':beam-sdks-java-io-elasticsearch', project ':beam-sdks-java-io-elasticsearch-tests-2',
project ':beam-sdks-java-io-elasticsearch-tests-5', project ':beam-sdks-java-io-elasticsearch-tests-common',
project ':beam-sdks-java-io-file-based-io-tests', project ':beam-sdks-java-io-google-cloud-platform',
project ':beam-sdks-java-io-hadoop-common', project ':beam-sdks-java-io-hadoop-file-system',
project ':beam-sdks-java-io-hadoop-input-format', project ':beam-sdks-java-io-hbase', project
':beam-sdks-java-io-hcatalog', project ':beam-sdks-java-io-jdbc', project ':beam-sdks-java-io-jms',
project ':beam-sdks-java-io-kafka', project ':beam-sdks-java-io-kinesis', project ':beam-sdks-java-io-kudu',
project ':beam-sdks-java-io-mongodb', project ':beam-sdks-java-io-mqtt', project ':beam-sdks-java-io-parquet',
project ':beam-sdks-java-io-redis', project ':beam-sdks-java-io-solr', project ':beam-sdks-java-io-synthetic',
project ':beam-sdks-java-io-tika', project ':beam-sdks-java-io-xml', project ':beam-sdks-java-javadoc',
project ':beam-sdks-java-maven-archetypes-examples', project ':beam-sdks-java-maven-archetypes-starter',
project ':beam-sdks-java-nexmark', project ':beam-sdks-python', project ':beam-sdks-python-container',
project ':beam-vendor-sdks-java-extensions-protobuf', project ':release']
Parallel execution with configuration on demand is an incubating feature.

> Configure project :
Evaluating root project 'beam' using build file '<https://builds.apache.org/job/beam_PostRelease_NightlySnapshot/ws/src/build.gradle'.>
Offline dependencies root configured at 'offline-repository'

> Configure project :release
Evaluating project ':release' using build file '<https://builds.apache.org/job/beam_PostRelease_NightlySnapshot/ws/src/release/build.gradle'.>
Compiling build file '<https://builds.apache.org/job/beam_PostRelease_NightlySnapshot/ws/src/release/build.gradle'>
using SubsetScriptTransformer.
Compiling build file '<https://builds.apache.org/job/beam_PostRelease_NightlySnapshot/ws/src/release/build.gradle'>
using BuildScriptTransformer.
Selected primary task ':release:runJavaExamplesValidationTask' from project :release

> Configure project :beam-runners-google-cloud-dataflow-java
Evaluating project ':beam-runners-google-cloud-dataflow-java' using build file '<https://builds.apache.org/job/beam_PostRelease_NightlySnapshot/ws/src/runners/google-cloud-dataflow-java/build.gradle'.>
Offline dependencies root configured at 'offline-repository'

> Configure project :beam-sdks-java-io-google-cloud-platform
Evaluating project ':beam-sdks-java-io-google-cloud-platform' using build file '<https://builds.apache.org/job/beam_PostRelease_NightlySnapshot/ws/src/sdks/java/io/google-cloud-platform/build.gradle'.>
Offline dependencies root configured at 'offline-repository'

> Configure project :beam-sdks-java-core
Evaluating project ':beam-sdks-java-core' using build file '<https://builds.apache.org/job/beam_PostRelease_NightlySnapshot/ws/src/sdks/java/core/build.gradle'.>
Offline dependencies root configured at 'offline-repository'

> Configure project :beam-examples-java
Evaluating project ':beam-examples-java' using build file '<https://builds.apache.org/job/beam_PostRelease_NightlySnapshot/ws/src/examples/java/build.gradle'.>
Offline dependencies root configured at 'offline-repository'

> Configure project :beam-runners-spark
Evaluating project ':beam-runners-spark' using build file '<https://builds.apache.org/job/beam_PostRelease_NightlySnapshot/ws/src/runners/spark/build.gradle'.>
Compiling build file '<https://builds.apache.org/job/beam_PostRelease_NightlySnapshot/ws/src/runners/spark/build.gradle'>
using SubsetScriptTransformer.
Compiling build file '<https://builds.apache.org/job/beam_PostRelease_NightlySnapshot/ws/src/runners/spark/build.gradle'>
using BuildScriptTransformer.
Offline dependencies root configured at 'offline-repository'

> Configure project :beam-runners-core-construction-java
Evaluating project ':beam-runners-core-construction-java' using build file '<https://builds.apache.org/job/beam_PostRelease_NightlySnapshot/ws/src/runners/core-construction-java/build.gradle'.>
Offline dependencies root configured at 'offline-repository'

> Configure project :beam-runners-core-java
Evaluating project ':beam-runners-core-java' using build file '<https://builds.apache.org/job/beam_PostRelease_NightlySnapshot/ws/src/runners/core-java/build.gradle'.>
Offline dependencies root configured at 'offline-repository'

> Configure project :beam-runners-direct-java
Evaluating project ':beam-runners-direct-java' using build file '<https://builds.apache.org/job/beam_PostRelease_NightlySnapshot/ws/src/runners/direct-java/build.gradle'.>
Offline dependencies root configured at 'offline-repository'

> Configure project :beam-runners-apex
Evaluating project ':beam-runners-apex' using build file '<https://builds.apache.org/job/beam_PostRelease_NightlySnapshot/ws/src/runners/apex/build.gradle'.>
Compiling build file '<https://builds.apache.org/job/beam_PostRelease_NightlySnapshot/ws/src/runners/apex/build.gradle'>
using SubsetScriptTransformer.
Compiling build file '<https://builds.apache.org/job/beam_PostRelease_NightlySnapshot/ws/src/runners/apex/build.gradle'>
using BuildScriptTransformer.
Offline dependencies root configured at 'offline-repository'

> Configure project :beam-runners-flink_2.11
Evaluating project ':beam-runners-flink_2.11' using build file '<https://builds.apache.org/job/beam_PostRelease_NightlySnapshot/ws/src/runners/flink/build.gradle'.>
Compiling build file '<https://builds.apache.org/job/beam_PostRelease_NightlySnapshot/ws/src/runners/flink/build.gradle'>
using SubsetScriptTransformer.
Compiling build file '<https://builds.apache.org/job/beam_PostRelease_NightlySnapshot/ws/src/runners/flink/build.gradle'>
using BuildScriptTransformer.
Offline dependencies root configured at 'offline-repository'
All projects evaluated.
Tasks to be executed: [task ':release:compileJava', task ':release:compileGroovy', task ':release:processResources',
task ':release:classes', task ':beam-runners-apex:runQuickstartJavaApex', task ':beam-runners-direct-java:runMobileGamingJavaDirect',
task ':beam-runners-direct-java:runQuickstartJavaDirect', task ':beam-runners-flink_2.11:runQuickstartJavaFlinkLocal',
task ':beam-runners-google-cloud-dataflow-java:runMobileGamingJavaDataflow', task ':beam-runners-google-cloud-dataflow-java:runQuickstartJavaDataflow',
task ':beam-runners-spark:runQuickstartJavaSpark', task ':release:runJavaExamplesValidationTask']
VisTEG: Dependency graph written into <https://builds.apache.org/job/beam_PostRelease_NightlySnapshot/ws/src/build/reports/visteg.dot>
:release:compileJava (Thread[Task worker for ':',5,main]) started.

> Task :release:compileJava NO-SOURCE
file or directory '<https://builds.apache.org/job/beam_PostRelease_NightlySnapshot/ws/src/release/src/main/java',>
not found
Skipping task ':release:compileJava' as it has no source files and no previous output files.
:release:compileJava (Thread[Task worker for ':',5,main]) completed. Took 0.015 secs.
:release:compileGroovy (Thread[Task worker for ':',5,main]) started.
Download https://repo.maven.apache.org/maven2/org/codehaus/groovy/groovy-all/3.0.0-alpha-3/groovy-all-3.0.0-alpha-3.pom
Download https://repo.maven.apache.org/maven2/org/codehaus/groovy/groovy/3.0.0-alpha-3/groovy-3.0.0-alpha-3.pom
Download https://repo.maven.apache.org/maven2/org/codehaus/groovy/groovy-cli-picocli/3.0.0-alpha-3/groovy-cli-picocli-3.0.0-alpha-3.pom
Download https://repo.maven.apache.org/maven2/org/codehaus/groovy/groovy-bsf/3.0.0-alpha-3/groovy-bsf-3.0.0-alpha-3.pom
Download https://repo.maven.apache.org/maven2/org/codehaus/groovy/groovy-jsr223/3.0.0-alpha-3/groovy-jsr223-3.0.0-alpha-3.pom
Download https://repo.maven.apache.org/maven2/org/codehaus/groovy/groovy-ant/3.0.0-alpha-3/groovy-ant-3.0.0-alpha-3.pom
Download https://repo.maven.apache.org/maven2/org/codehaus/groovy/groovy-groovydoc/3.0.0-alpha-3/groovy-groovydoc-3.0.0-alpha-3.pom
Download https://repo.maven.apache.org/maven2/org/codehaus/groovy/groovy-json/3.0.0-alpha-3/groovy-json-3.0.0-alpha-3.pom
Download https://repo.maven.apache.org/maven2/org/codehaus/groovy/groovy-jmx/3.0.0-alpha-3/groovy-jmx-3.0.0-alpha-3.pom
Download https://repo.maven.apache.org/maven2/org/codehaus/groovy/groovy-groovysh/3.0.0-alpha-3/groovy-groovysh-3.0.0-alpha-3.pom
Download https://repo.maven.apache.org/maven2/org/codehaus/groovy/groovy-nio/3.0.0-alpha-3/groovy-nio-3.0.0-alpha-3.pom
Download https://repo.maven.apache.org/maven2/org/codehaus/groovy/groovy-console/3.0.0-alpha-3/groovy-console-3.0.0-alpha-3.pom
Download https://repo.maven.apache.org/maven2/org/codehaus/groovy/groovy-datetime/3.0.0-alpha-3/groovy-datetime-3.0.0-alpha-3.pom
Download https://repo.maven.apache.org/maven2/org/codehaus/groovy/groovy-docgenerator/3.0.0-alpha-3/groovy-docgenerator-3.0.0-alpha-3.pom
Download https://repo.maven.apache.org/maven2/org/codehaus/groovy/groovy-sql/3.0.0-alpha-3/groovy-sql-3.0.0-alpha-3.pom
Download https://repo.maven.apache.org/maven2/org/codehaus/groovy/groovy-swing/3.0.0-alpha-3/groovy-swing-3.0.0-alpha-3.pom
Download https://repo.maven.apache.org/maven2/org/codehaus/groovy/groovy-templates/3.0.0-alpha-3/groovy-templates-3.0.0-alpha-3.pom
Download https://repo.maven.apache.org/maven2/org/codehaus/groovy/groovy-servlet/3.0.0-alpha-3/groovy-servlet-3.0.0-alpha-3.pom
Download https://repo.maven.apache.org/maven2/org/codehaus/groovy/groovy-test-junit5/3.0.0-alpha-3/groovy-test-junit5-3.0.0-alpha-3.pom
Download https://repo.maven.apache.org/maven2/org/codehaus/groovy/groovy-test/3.0.0-alpha-3/groovy-test-3.0.0-alpha-3.pom
Download https://repo.maven.apache.org/maven2/org/codehaus/groovy/groovy-testng/3.0.0-alpha-3/groovy-testng-3.0.0-alpha-3.pom
Download https://repo.maven.apache.org/maven2/org/codehaus/groovy/groovy-xml/3.0.0-alpha-3/groovy-xml-3.0.0-alpha-3.pom
Download https://repo.maven.apache.org/maven2/org/codehaus/groovy/groovy-macro/3.0.0-alpha-3/groovy-macro-3.0.0-alpha-3.pom
Download https://repo.maven.apache.org/maven2/org/apache/ant/ant/1.10.3/ant-1.10.3.pom
Download https://repo.maven.apache.org/maven2/org/apache/ant/ant-junit/1.10.3/ant-junit-1.10.3.pom
Download https://repo.maven.apache.org/maven2/org/apache/ant/ant-antlr/1.10.3/ant-antlr-1.10.3.pom
Download https://repo.maven.apache.org/maven2/org/apache/ant/ant-launcher/1.10.3/ant-launcher-1.10.3.pom
Download https://repo.maven.apache.org/maven2/org/apache/ant/ant-parent/1.10.3/ant-parent-1.10.3.pom
Download https://repo.maven.apache.org/maven2/bsf/bsf/2.4.0/bsf-2.4.0.pom

> Task :release:compileGroovy
Found locally available resource with matching checksum: [https://repo.maven.apache.org/maven2/commons-logging/commons-logging/1.2/commons-logging-1.2.pom,
/home/jenkins/.gradle/caches/modules-2/files-2.1/commons-logging/commons-logging/1.2/75c03ba4b01932842a996ef8d3fc1ab61ddeac2/commons-logging-1.2.pom]
Found locally available resource with matching checksum: [https://repo.maven.apache.org/maven2/org/apache/apache/3/apache-3.pom,
/home/jenkins/.gradle/caches/modules-2/files-2.1/org.apache/apache/3/1bc0010136a890e2fd38d901a0b7ecdf0e3f9871/apache-3.pom]
Found locally available resource with matching checksum: [https://repo.maven.apache.org/maven2/org/apache/commons/commons-parent/34/commons-parent-34.pom,
/home/jenkins/.gradle/caches/modules-2/files-2.1/org.apache.commons/commons-parent/34/1f6be162a806d8343e3cd238dd728558532473a5/commons-parent-34.pom]
Found locally available resource with matching checksum: [https://repo.maven.apache.org/maven2/org/apache/apache/13/apache-13.pom,
/home/jenkins/.gradle/caches/modules-2/files-2.1/org.apache/apache/13/15aff1faaec4963617f07dbe8e603f0adabc3a12/apache-13.pom]

Download https://repo.maven.apache.org/maven2/info/picocli/picocli/3.0.2/picocli-3.0.2.pom
Download https://repo.maven.apache.org/maven2/com/thoughtworks/qdox/qdox/1.12.1/qdox-1.12.1.pom
Download https://repo.maven.apache.org/maven2/org/codehaus/groovy/groovy-dateutil/3.0.0-alpha-3/groovy-dateutil-3.0.0-alpha-3.pom
Download https://repo.maven.apache.org/maven2/org/junit/jupiter/junit-jupiter-engine/5.2.0/junit-jupiter-engine-5.2.0.pom
Download https://repo.maven.apache.org/maven2/org/junit/platform/junit-platform-launcher/1.2.0/junit-platform-launcher-1.2.0.pom
Download https://repo.maven.apache.org/maven2/org/testng/testng/6.9.10/testng-6.9.10.pom
Download https://repo.maven.apache.org/maven2/org/apiguardian/apiguardian-api/1.0.0/apiguardian-api-1.0.0.pom
Download https://repo.maven.apache.org/maven2/org/junit/platform/junit-platform-engine/1.2.0/junit-platform-engine-1.2.0.pom
Download https://repo.maven.apache.org/maven2/org/junit/jupiter/junit-jupiter-api/5.2.0/junit-jupiter-api-5.2.0.pom
Download https://repo.maven.apache.org/maven2/com/beust/jcommander/1.48/jcommander-1.48.pom
Download https://repo.maven.apache.org/maven2/org/junit/platform/junit-platform-commons/1.2.0/junit-platform-commons-1.2.0.pom
Download https://repo.maven.apache.org/maven2/org/opentest4j/opentest4j/1.1.0/opentest4j-1.1.0.pom
Download https://repo.maven.apache.org/maven2/org/codehaus/groovy/groovy-macro/3.0.0-alpha-3/groovy-macro-3.0.0-alpha-3.jar
Download https://repo.maven.apache.org/maven2/org/codehaus/groovy/groovy-datetime/3.0.0-alpha-3/groovy-datetime-3.0.0-alpha-3.jar
Download https://repo.maven.apache.org/maven2/org/codehaus/groovy/groovy-groovydoc/3.0.0-alpha-3/groovy-groovydoc-3.0.0-alpha-3.jar
Download https://repo.maven.apache.org/maven2/org/codehaus/groovy/groovy-bsf/3.0.0-alpha-3/groovy-bsf-3.0.0-alpha-3.jar
Download https://repo.maven.apache.org/maven2/org/codehaus/groovy/groovy-cli-picocli/3.0.0-alpha-3/groovy-cli-picocli-3.0.0-alpha-3.jar
Download https://repo.maven.apache.org/maven2/org/codehaus/groovy/groovy-console/3.0.0-alpha-3/groovy-console-3.0.0-alpha-3.jar
Download https://repo.maven.apache.org/maven2/org/codehaus/groovy/groovy-groovysh/3.0.0-alpha-3/groovy-groovysh-3.0.0-alpha-3.jar
Download https://repo.maven.apache.org/maven2/org/codehaus/groovy/groovy-jsr223/3.0.0-alpha-3/groovy-jsr223-3.0.0-alpha-3.jar
Download https://repo.maven.apache.org/maven2/org/codehaus/groovy/groovy-jmx/3.0.0-alpha-3/groovy-jmx-3.0.0-alpha-3.jar
Download https://repo.maven.apache.org/maven2/org/codehaus/groovy/groovy-ant/3.0.0-alpha-3/groovy-ant-3.0.0-alpha-3.jar
Download https://repo.maven.apache.org/maven2/org/codehaus/groovy/groovy-sql/3.0.0-alpha-3/groovy-sql-3.0.0-alpha-3.jar
Download https://repo.maven.apache.org/maven2/org/codehaus/groovy/groovy-servlet/3.0.0-alpha-3/groovy-servlet-3.0.0-alpha-3.jar
Download https://repo.maven.apache.org/maven2/org/codehaus/groovy/groovy-swing/3.0.0-alpha-3/groovy-swing-3.0.0-alpha-3.jar
Download https://repo.maven.apache.org/maven2/org/codehaus/groovy/groovy-docgenerator/3.0.0-alpha-3/groovy-docgenerator-3.0.0-alpha-3.jar
Download https://repo.maven.apache.org/maven2/org/codehaus/groovy/groovy-json/3.0.0-alpha-3/groovy-json-3.0.0-alpha-3.jar
Download https://repo.maven.apache.org/maven2/org/codehaus/groovy/groovy-templates/3.0.0-alpha-3/groovy-templates-3.0.0-alpha-3.jar
Download https://repo.maven.apache.org/maven2/org/codehaus/groovy/groovy-test/3.0.0-alpha-3/groovy-test-3.0.0-alpha-3.jar
Download https://repo.maven.apache.org/maven2/org/codehaus/groovy/groovy-test-junit5/3.0.0-alpha-3/groovy-test-junit5-3.0.0-alpha-3.jar
Download https://repo.maven.apache.org/maven2/org/codehaus/groovy/groovy-testng/3.0.0-alpha-3/groovy-testng-3.0.0-alpha-3.jar
Download https://repo.maven.apache.org/maven2/org/codehaus/groovy/groovy/3.0.0-alpha-3/groovy-3.0.0-alpha-3.jar
Download https://repo.maven.apache.org/maven2/org/codehaus/groovy/groovy-dateutil/3.0.0-alpha-3/groovy-dateutil-3.0.0-alpha-3.jar
Download https://repo.maven.apache.org/maven2/org/codehaus/groovy/groovy-xml/3.0.0-alpha-3/groovy-xml-3.0.0-alpha-3.jar
Download https://repo.maven.apache.org/maven2/org/apache/ant/ant-junit/1.10.3/ant-junit-1.10.3.jar
Download https://repo.maven.apache.org/maven2/org/apache/ant/ant-launcher/1.10.3/ant-launcher-1.10.3.jar
Download https://repo.maven.apache.org/maven2/bsf/bsf/2.4.0/bsf-2.4.0.jar
Download https://repo.maven.apache.org/maven2/org/apache/ant/ant-antlr/1.10.3/ant-antlr-1.10.3.jar
Download https://repo.maven.apache.org/maven2/info/picocli/picocli/3.0.2/picocli-3.0.2.jar
Download https://repo.maven.apache.org/maven2/com/thoughtworks/qdox/qdox/1.12.1/qdox-1.12.1.jar
Download https://repo.maven.apache.org/maven2/org/junit/platform/junit-platform-engine/1.2.0/junit-platform-engine-1.2.0.jar
Download https://repo.maven.apache.org/maven2/org/apache/ant/ant/1.10.3/ant-1.10.3.jar
Download https://repo.maven.apache.org/maven2/org/junit/jupiter/junit-jupiter-engine/5.2.0/junit-jupiter-engine-5.2.0.jar
Download https://repo.maven.apache.org/maven2/org/junit/platform/junit-platform-launcher/1.2.0/junit-platform-launcher-1.2.0.jar
Download https://repo.maven.apache.org/maven2/org/testng/testng/6.9.10/testng-6.9.10.jar
Download https://repo.maven.apache.org/maven2/org/junit/platform/junit-platform-commons/1.2.0/junit-platform-commons-1.2.0.jar
Download https://repo.maven.apache.org/maven2/com/beust/jcommander/1.48/jcommander-1.48.jar
Download https://repo.maven.apache.org/maven2/org/apiguardian/apiguardian-api/1.0.0/apiguardian-api-1.0.0.jar
Download https://repo.maven.apache.org/maven2/org/opentest4j/opentest4j/1.1.0/opentest4j-1.1.0.jar
Download https://repo.maven.apache.org/maven2/org/codehaus/groovy/groovy-nio/3.0.0-alpha-3/groovy-nio-3.0.0-alpha-3.jar
Download https://repo.maven.apache.org/maven2/org/junit/jupiter/junit-jupiter-api/5.2.0/junit-jupiter-api-5.2.0.jar

> Task :release:compileGroovy
Found locally available resource with matching checksum: [https://repo.maven.apache.org/maven2/org/codehaus/codehaus-parent/4/codehaus-parent-4.pom,
/home/jenkins/.gradle/caches/modules-2/files-2.1/org.codehaus/codehaus-parent/4/8b133202d50bec1e59bddc9392cb44d1fe5facc8/codehaus-parent-4.pom]
Found locally available resource with matching checksum: [https://repo.maven.apache.org/maven2/junit/junit/4.12/junit-4.12.pom,
/home/jenkins/.gradle/caches/modules-2/files-2.1/junit/junit/4.12/35fb238baee3f3af739074d723279ebea2028398/junit-4.12.pom]
Found locally available resource with matching checksum: [https://repo.maven.apache.org/maven2/org/hamcrest/hamcrest-core/1.3/hamcrest-core-1.3.pom,
/home/jenkins/.gradle/caches/modules-2/files-2.1/org.hamcrest/hamcrest-core/1.3/872e413497b906e7c9fa85ccc96046c5d1ef7ece/hamcrest-core-1.3.pom]
Found locally available resource with matching checksum: [https://repo.maven.apache.org/maven2/org/hamcrest/hamcrest-parent/1.3/hamcrest-parent-1.3.pom,
/home/jenkins/.gradle/caches/modules-2/files-2.1/org.hamcrest/hamcrest-parent/1.3/80391bd32bfa4837a15215d5e9f07c60555c379a/hamcrest-parent-1.3.pom]
Found locally available resource with matching checksum: [https://repo.maven.apache.org/maven2/org/sonatype/oss/oss-parent/3/oss-parent-3.pom,
/home/jenkins/.gradle/caches/modules-2/files-2.1/org.sonatype.oss/oss-parent/3/31e7e4502123f2f7b42b4e426146f9efc8e94110/oss-parent-3.pom]
Resource missing. [HTTP HEAD: https://repo.maven.apache.org/maven2/org/codehaus/groovy/groovy-all/3.0.0-alpha-3/groovy-all-3.0.0-alpha-3.jar]
Found locally available resource with matching checksum: [https://repo.maven.apache.org/maven2/org/hamcrest/hamcrest-core/1.3/hamcrest-core-1.3.jar,
/home/jenkins/.gradle/caches/modules-2/files-2.1/org.hamcrest/hamcrest-core/1.3/42a25dc3219429f0e5d060061f71acb49bf010a0/hamcrest-core-1.3.jar]
Found locally available resource with matching checksum: [https://repo.maven.apache.org/maven2/commons-logging/commons-logging/1.2/commons-logging-1.2.jar,
/home/jenkins/.gradle/caches/modules-2/files-2.1/commons-logging/commons-logging/1.2/4bfc12adfe4842bf07b657f0369c4cb522955686/commons-logging-1.2.jar]
Found locally available resource with matching checksum: [https://repo.maven.apache.org/maven2/junit/junit/4.12/junit-4.12.jar,
/home/jenkins/.gradle/caches/modules-2/files-2.1/junit/junit/4.12/2973d150c0dc1fefe998f834810d68f278ea58ec/junit-4.12.jar]
Build cache key for task ':release:compileGroovy' is f525e5825d8ef2351834119aebedf166
Task ':release:compileGroovy' is not up-to-date because:
  No history is available.
Starting process 'Gradle Worker Daemon 1'. Working directory: /home/jenkins/.gradle/workers
Command: /usr/local/asfpackages/java/jdk1.8.0_152/bin/java -Djava.security.manager=worker.org.gradle.process.internal.worker.child.BootstrapSecurityManager
-Dfile.encoding=UTF-8 -Duser.country=US -Duser.language=en -Duser.variant -cp /home/jenkins/.gradle/caches/4.8/workerMain/gradle-worker.jar
worker.org.gradle.process.internal.worker.GradleWorkerMain 'Gradle Worker Daemon 1'
Successfully started process 'Gradle Worker Daemon 1'
Started Gradle worker daemon (0.525 secs) with fork options DaemonForkOptions{executable=/usr/local/asfpackages/java/jdk1.8.0_152/bin/java,
minHeapSize=null, maxHeapSize=null, jvmArgs=[], classpath=[/home/jenkins/.gradle/caches/modules-2/files-2.1/org.codehaus.groovy/groovy-ant/3.0.0-alpha-3/3d4d90e36c7418d174fde5ffaaa665b9b507456c/groovy-ant-3.0.0-alpha-3.jar,
/home/jenkins/.gradle/caches/modules-2/files-2.1/org.codehaus.groovy/groovy-groovydoc/3.0.0-alpha-3/be72b4edb0b3b82c17bd54e44a3b9c27f8687ecf/groovy-groovydoc-3.0.0-alpha-3.jar,
/home/jenkins/.gradle/caches/modules-2/files-2.1/org.codehaus.groovy/groovy-docgenerator/3.0.0-alpha-3/61e5b9de2d994d4fe3707f41eadfabcdeaf242bc/groovy-docgenerator-3.0.0-alpha-3.jar,
/home/jenkins/.gradle/caches/modules-2/files-2.1/org.codehaus.groovy/groovy-cli-picocli/3.0.0-alpha-3/fc5957698b2e9484aadeffc98c7ecdb4552479cc/groovy-cli-picocli-3.0.0-alpha-3.jar,
/home/jenkins/.gradle/caches/modules-2/files-2.1/org.codehaus.groovy/groovy-templates/3.0.0-alpha-3/cd7e5b6f0d5dd1bf2ea5414793cfb41284361a78/groovy-templates-3.0.0-alpha-3.jar,
/home/jenkins/.gradle/caches/modules-2/files-2.1/org.codehaus.groovy/groovy-dateutil/3.0.0-alpha-3/a10de49893f6e684e0b1d2d213dc18bd8b13ff7b/groovy-dateutil-3.0.0-alpha-3.jar,
/home/jenkins/.gradle/caches/modules-2/files-2.1/org.codehaus.groovy/groovy-xml/3.0.0-alpha-3/931dbc782ebf5750d652577d510a7ac516174236/groovy-xml-3.0.0-alpha-3.jar,
/home/jenkins/.gradle/caches/modules-2/files-2.1/org.codehaus.groovy/groovy/3.0.0-alpha-3/81b3f93dc6c8cdecdca450c6d5326abe9ea28971/groovy-3.0.0-alpha-3.jar,
/home/jenkins/.gradle/caches/modules-2/files-2.1/org.apache.ant/ant-junit/1.10.3/129c966bced24fef49af4ffa7a9a3b0bb41ebd4/ant-junit-1.10.3.jar,
/home/jenkins/.gradle/caches/modules-2/files-2.1/org.apache.ant/ant/1.10.3/88becdeb77cdd2457757b7268e1a10666c03d382/ant-1.10.3.jar,
/home/jenkins/.gradle/caches/modules-2/files-2.1/org.apache.ant/ant-launcher/1.10.3/9dd5189e7f561ca19833b4e3672720b9bc5cb2fe/ant-launcher-1.10.3.jar,
/home/jenkins/.gradle/caches/modules-2/files-2.1/org.apache.ant/ant-antlr/1.10.3/912c712b92badf26d3f11605252e86f7d191e10a/ant-antlr-1.10.3.jar,
/home/jenkins/.gradle/caches/modules-2/files-2.1/info.picocli/picocli/3.0.2/d63ebea10913d50f6ce40212e1109b14f6421487/picocli-3.0.2.jar,
/home/jenkins/.gradle/caches/modules-2/files-2.1/com.thoughtworks.qdox/qdox/1.12.1/f7122f6ab1f64bdf9f5970b0e89bfb355e036897/qdox-1.12.1.jar,
/home/jenkins/.gradle/wrapper/dists/gradle-4.8-bin/divx0s2uj4thofgytb7gf9fsi/gradle-4.8/lib/ant-1.9.11.jar,
/home/jenkins/.gradle/wrapper/dists/gradle-4.8-bin/divx0s2uj4thofgytb7gf9fsi/gradle-4.8/lib/ant-launcher-1.9.11.jar],
keepAliveMode=SESSION}.

This JVM does not support getting OS memory, so no OS memory status updates will be broadcast
Initialized native services in: /home/jenkins/.gradle/native

> Task :release:compileGroovy FAILED
startup failed:
<https://builds.apache.org/job/beam_PostRelease_NightlySnapshot/ws/src/release/src/main/groovy/TestScripts.groovy>:
20: unable to resolve class groovy.util.CliBuilder
 @ line 20, column 1.
   import groovy.util.CliBuilder
   ^

1 error

:release:compileGroovy (Thread[Task worker for ':',5,main]) completed. Took 8.295 secs.
:release:processResources (Thread[Task worker for ':',5,main]) started.

> Task :release:processResources NO-SOURCE
file or directory '<https://builds.apache.org/job/beam_PostRelease_NightlySnapshot/ws/src/release/src/main/resources',>
not found
Skipping task ':release:processResources' as it has no source files and no previous output
files.
:release:processResources (Thread[Task worker for ':',5,main]) completed. Took 0.001 secs.

FAILURE: Build failed with an exception.

* What went wrong:
Execution failed for task ':release:compileGroovy'.
> Compilation failed; see the compiler error output for details.

* Try:
Run with --stacktrace option to get the stack trace. Run with --debug option to get more log
output. Run with --scan to get full insights.

* Get more help at https://help.gradle.org

Deprecated Gradle features were used in this build, making it incompatible with Gradle 5.0.
See https://docs.gradle.org/4.8/userguide/command_line_interface.html#sec:command_line_warnings

BUILD FAILED in 23s
1 actionable task: 1 executed

Publishing build scan...
https://gradle.com/s/rgwanj6542sug

Stopped 1 worker daemon(s).
Build step 'Invoke Gradle script' changed build result to FAILURE
Build step 'Invoke Gradle script' marked build as failure

Mime
View raw message