beam-commits mailing list archives

Site index · List index
Message view « Date » · « Thread »
Top « Date » · « Thread »
From Apache Jenkins Server <jenk...@builds.apache.org>
Subject Build failed in Jenkins: beam_PreCommit_Java_Cron #206
Date Thu, 09 Aug 2018 18:24:06 GMT
See <https://builds.apache.org/job/beam_PreCommit_Java_Cron/206/display/redirect>

------------------------------------------
[...truncated 17.20 MB...]
    BeamCalcRel(expr#0..7=[{inputs}], proj#0..4=[{exprs}])
      BeamJoinRel(condition=[AND(=($5, $7), =($1, $6))], joinType=[inner])
        BeamCalcRel(expr#0..5=[{inputs}], proj#0..5=[{exprs}])
          BeamAggregationRel(group=[{0, 1, 2, 3, 4, 5}])
            BeamCalcRel(expr#0..4=[{inputs}], expr#5=[10000], expr#6=[TUMBLE($t3, $t5)], auction=[$t0],
price=[$t2], bidder=[$t1], dateTime=[$t3], extra=[$t4], $f5=[$t6])
              BeamIOSourceRel(table=[[beam, Bid]])
        BeamCalcRel(expr#0..1=[{inputs}], maxprice=[$t1], starttime=[$t0])
          BeamAggregationRel(group=[{0}], maxprice=[MAX($1)])
            BeamCalcRel(expr#0..4=[{inputs}], expr#5=[10000], expr#6=[TUMBLE($t3, $t5)], $f0=[$t6],
price=[$t2])
              BeamIOSourceRel(table=[[beam, Bid]])


org.apache.beam.sdk.nexmark.queries.sql.SqlQuery2Test > testSkipsEverySecondElement STANDARD_ERROR
    Aug 09, 2018 6:20:31 PM org.apache.beam.sdk.extensions.sql.impl.BeamQueryPlanner convertToBeamRel
    INFO: SQL:
    SELECT `PCOLLECTION`.`auction`, `PCOLLECTION`.`price`
    FROM `beam`.`PCOLLECTION` AS `PCOLLECTION`
    WHERE MOD(`PCOLLECTION`.`auction`, 2) = 0
    Aug 09, 2018 6:20:31 PM org.apache.beam.sdk.extensions.sql.impl.BeamQueryPlanner convertToBeamRel
    INFO: SQLPlan>
    LogicalProject(auction=[$0], price=[$2])
      LogicalFilter(condition=[=(MOD($0, 2), 0)])
        BeamIOSourceRel(table=[[beam, PCOLLECTION]])

    Aug 09, 2018 6:20:31 PM org.apache.beam.sdk.extensions.sql.impl.BeamQueryPlanner convertToBeamRel
    INFO: BEAMPlan>
    BeamCalcRel(expr#0..4=[{inputs}], expr#5=[2], expr#6=[MOD($t0, $t5)], expr#7=[0], expr#8=[=($t6,
$t7)], auction=[$t0], price=[$t2], $condition=[$t8])
      BeamIOSourceRel(table=[[beam, PCOLLECTION]])


org.apache.beam.sdk.nexmark.queries.sql.SqlQuery2Test > testSkipsEveryThirdElement STANDARD_ERROR
    Aug 09, 2018 6:20:31 PM org.apache.beam.sdk.extensions.sql.impl.BeamQueryPlanner convertToBeamRel
    INFO: SQL:
    SELECT `PCOLLECTION`.`auction`, `PCOLLECTION`.`price`
    FROM `beam`.`PCOLLECTION` AS `PCOLLECTION`
    WHERE MOD(`PCOLLECTION`.`auction`, 3) = 0
    Aug 09, 2018 6:20:31 PM org.apache.beam.sdk.extensions.sql.impl.BeamQueryPlanner convertToBeamRel
    INFO: SQLPlan>
    LogicalProject(auction=[$0], price=[$2])
      LogicalFilter(condition=[=(MOD($0, 3), 0)])
        BeamIOSourceRel(table=[[beam, PCOLLECTION]])

    Aug 09, 2018 6:20:31 PM org.apache.beam.sdk.extensions.sql.impl.BeamQueryPlanner convertToBeamRel
    INFO: BEAMPlan>
    BeamCalcRel(expr#0..4=[{inputs}], expr#5=[3], expr#6=[MOD($t0, $t5)], expr#7=[0], expr#8=[=($t6,
$t7)], auction=[$t0], price=[$t2], $condition=[$t8])
      BeamIOSourceRel(table=[[beam, PCOLLECTION]])


> Task :beam-runners-google-cloud-dataflow-java-examples:preCommit
    Aug 09, 2018 6:20:31 PM org.apache.beam.runners.dataflow.util.MonitoringUtil$LoggingHandler
process
    INFO: 2018-08-09T18:20:28.940Z: Workers have started successfully.
    Aug 09, 2018 6:20:31 PM org.apache.beam.runners.dataflow.util.MonitoringUtil$LoggingHandler
process
    INFO: 2018-08-09T18:20:28.996Z: Workers have started successfully.

Gradle Test Executor 132 finished executing tests.

> Task :beam-sdks-java-nexmark:test

org.apache.beam.sdk.nexmark.queries.sql.SqlQuery1Test > testConvertsPriceToEur STANDARD_ERROR
    Aug 09, 2018 6:20:31 PM org.apache.beam.sdk.extensions.sql.impl.BeamQueryPlanner convertToBeamRel
    INFO: SQL:
    SELECT `PCOLLECTION`.`auction`, `PCOLLECTION`.`bidder`, `DolToEur`(`PCOLLECTION`.`price`)
AS `price`, `PCOLLECTION`.`dateTime`, `PCOLLECTION`.`extra`
    FROM `beam`.`PCOLLECTION` AS `PCOLLECTION`
    Aug 09, 2018 6:20:31 PM org.apache.beam.sdk.extensions.sql.impl.BeamQueryPlanner convertToBeamRel
    INFO: SQLPlan>
    LogicalProject(auction=[$0], bidder=[$1], price=[DolToEur($2)], dateTime=[$3], extra=[$4])
      BeamIOSourceRel(table=[[beam, PCOLLECTION]])

    Aug 09, 2018 6:20:31 PM org.apache.beam.sdk.extensions.sql.impl.BeamQueryPlanner convertToBeamRel
    INFO: BEAMPlan>
    BeamCalcRel(expr#0..4=[{inputs}], expr#5=[DolToEur($t2)], proj#0..1=[{exprs}], price=[$t5],
dateTime=[$t3], extra=[$t4])
      BeamIOSourceRel(table=[[beam, PCOLLECTION]])

Finished generating test XML results (0.002 secs) into: <https://builds.apache.org/job/beam_PreCommit_Java_Cron/ws/src/sdks/java/nexmark/build/test-results/test>
Generating HTML test report...
Finished generating test html results (0.005 secs) into: <https://builds.apache.org/job/beam_PreCommit_Java_Cron/ws/src/sdks/java/nexmark/build/reports/tests/test>
Packing task ':beam-sdks-java-nexmark:test'
:beam-sdks-java-nexmark:test (Thread[Task worker for ':' Thread 10,5,main]) completed. Took
8 mins 32.711 secs.
:beam-sdks-java-nexmark:shadowJar (Thread[Task worker for ':' Thread 10,5,main]) started.

> Task :beam-sdks-java-nexmark:shadowJar
Build cache key for task ':beam-sdks-java-nexmark:shadowJar' is 268626b448465aad93bf739ae6fae4cd
Caching disabled for task ':beam-sdks-java-nexmark:shadowJar': Caching has not been enabled
for the task
Task ':beam-sdks-java-nexmark:shadowJar' is not up-to-date because:
  No history is available.
*******************
GRADLE SHADOW STATS

Total Jars: 2 (includes project)
Total Time: 2.334s [2334ms]
Average Time/Jar: 1.167s [1167.0ms]
*******************
:beam-sdks-java-nexmark:shadowJar (Thread[Task worker for ':' Thread 10,5,main]) completed.
Took 2.66 secs.
:beam-sdks-java-nexmark:validateShadedJarDoesntLeakNonOrgApacheBeamClasses (Thread[Task worker
for ':' Thread 10,5,main]) started.

> Task :beam-sdks-java-nexmark:validateShadedJarDoesntLeakNonOrgApacheBeamClasses
Caching disabled for task ':beam-sdks-java-nexmark:validateShadedJarDoesntLeakNonOrgApacheBeamClasses':
Caching has not been enabled for the task
Task ':beam-sdks-java-nexmark:validateShadedJarDoesntLeakNonOrgApacheBeamClasses' is not up-to-date
because:
  Task has not declared any outputs despite executing actions.
:beam-sdks-java-nexmark:validateShadedJarDoesntLeakNonOrgApacheBeamClasses (Thread[Task worker
for ':' Thread 10,5,main]) completed. Took 0.043 secs.
:beam-sdks-java-nexmark:check (Thread[Task worker for ':' Thread 10,5,main]) started.

> Task :beam-sdks-java-nexmark:check
Skipping task ':beam-sdks-java-nexmark:check' as it has no actions.
:beam-sdks-java-nexmark:check (Thread[Task worker for ':' Thread 10,5,main]) completed. Took
0.0 secs.
:beam-sdks-java-nexmark:build (Thread[Task worker for ':' Thread 10,5,main]) started.

> Task :beam-sdks-java-nexmark:build
Skipping task ':beam-sdks-java-nexmark:build' as it has no actions.
:beam-sdks-java-nexmark:build (Thread[Task worker for ':' Thread 10,5,main]) completed. Took
0.0 secs.
:beam-sdks-java-nexmark:buildDependents (Thread[Task worker for ':' Thread 10,5,main]) started.

> Task :beam-sdks-java-nexmark:buildDependents
Caching disabled for task ':beam-sdks-java-nexmark:buildDependents': Caching has not been
enabled for the task
Task ':beam-sdks-java-nexmark:buildDependents' is not up-to-date because:
  Task has not declared any outputs despite executing actions.
:beam-sdks-java-nexmark:buildDependents (Thread[Task worker for ':' Thread 10,5,main]) completed.
Took 0.0 secs.
:beam-sdks-java-io-kafka:buildDependents (Thread[Task worker for ':' Thread 10,5,main]) started.

> Task :beam-sdks-java-io-kafka:buildDependents
Caching disabled for task ':beam-sdks-java-io-kafka:buildDependents': Caching has not been
enabled for the task
Task ':beam-sdks-java-io-kafka:buildDependents' is not up-to-date because:
  Task has not declared any outputs despite executing actions.
:beam-sdks-java-io-kafka:buildDependents (Thread[Task worker for ':' Thread 10,5,main]) completed.
Took 0.0 secs.

> Task :beam-runners-google-cloud-dataflow-java-examples:preCommit
    Aug 09, 2018 6:21:12 PM org.apache.beam.runners.dataflow.util.MonitoringUtil$LoggingHandler
process
    INFO: 2018-08-09T18:21:11.607Z: Executing operation WordCount.CountWords/Count.PerElement/Combine.perKey(Count)/GroupByKey/Close
    Aug 09, 2018 6:21:12 PM org.apache.beam.runners.dataflow.util.MonitoringUtil$LoggingHandler
process
    INFO: 2018-08-09T18:21:11.729Z: Executing operation WordCount.CountWords/Count.PerElement/Combine.perKey(Count)/GroupByKey/Read+WordCount.CountWords/Count.PerElement/Combine.perKey(Count)/Combine.GroupedValues+WordCount.CountWords/Count.PerElement/Combine.perKey(Count)/Combine.GroupedValues/Extract+MapElements/Map+WriteOneFilePerWindow/TextIO.Write/WriteFiles/WriteUnshardedBundlesToTempFiles/WriteUnshardedBundles+WriteOneFilePerWindow/TextIO.Write/WriteFiles/GatherTempFileResults/Add
void key/AddKeys/Map+WriteOneFilePerWindow/TextIO.Write/WriteFiles/GatherTempFileResults/Reshuffle/Window.Into()/Window.Assign+WriteOneFilePerWindow/TextIO.Write/WriteFiles/GatherTempFileResults/Reshuffle/GroupByKey/Reify+WriteOneFilePerWindow/TextIO.Write/WriteFiles/GatherTempFileResults/Reshuffle/GroupByKey/Write+WriteOneFilePerWindow/TextIO.Write/WriteFiles/WriteUnshardedBundlesToTempFiles/GroupUnwritten/Reify+WriteOneFilePerWindow/TextIO.Write/WriteFiles/WriteUnshardedBundlesToTempFiles/GroupUnwritten/Write
    Aug 09, 2018 6:21:26 PM org.apache.beam.runners.dataflow.util.MonitoringUtil$LoggingHandler
process
    INFO: 2018-08-09T18:21:25.146Z: Executing operation WriteOneFilePerWindow/TextIO.Write/WriteFiles/WriteUnshardedBundlesToTempFiles/GroupUnwritten/Close
    Aug 09, 2018 6:21:26 PM org.apache.beam.runners.dataflow.util.MonitoringUtil$LoggingHandler
process
    INFO: 2018-08-09T18:21:25.280Z: Executing operation WriteOneFilePerWindow/TextIO.Write/WriteFiles/WriteUnshardedBundlesToTempFiles/GroupUnwritten/Read+WriteOneFilePerWindow/TextIO.Write/WriteFiles/WriteUnshardedBundlesToTempFiles/GroupUnwritten/GroupByWindow+WriteOneFilePerWindow/TextIO.Write/WriteFiles/WriteUnshardedBundlesToTempFiles/WriteUnwritten+WriteOneFilePerWindow/TextIO.Write/WriteFiles/WriteUnshardedBundlesToTempFiles/DropShardNum+WriteOneFilePerWindow/TextIO.Write/WriteFiles/GatherTempFileResults/Add
void key/AddKeys/Map+WriteOneFilePerWindow/TextIO.Write/WriteFiles/GatherTempFileResults/Reshuffle/Window.Into()/Window.Assign+WriteOneFilePerWindow/TextIO.Write/WriteFiles/GatherTempFileResults/Reshuffle/GroupByKey/Reify+WriteOneFilePerWindow/TextIO.Write/WriteFiles/GatherTempFileResults/Reshuffle/GroupByKey/Write
    Aug 09, 2018 6:21:27 PM org.apache.beam.runners.dataflow.util.MonitoringUtil$LoggingHandler
process
    INFO: 2018-08-09T18:21:26.369Z: Executing operation WriteOneFilePerWindow/TextIO.Write/WriteFiles/GatherTempFileResults/Reshuffle/GroupByKey/Close
    Aug 09, 2018 6:21:27 PM org.apache.beam.runners.dataflow.util.MonitoringUtil$LoggingHandler
process
    INFO: 2018-08-09T18:21:26.491Z: Executing operation WriteOneFilePerWindow/TextIO.Write/WriteFiles/GatherTempFileResults/Reshuffle/GroupByKey/Read+WriteOneFilePerWindow/TextIO.Write/WriteFiles/GatherTempFileResults/Reshuffle/GroupByKey/GroupByWindow+WriteOneFilePerWindow/TextIO.Write/WriteFiles/GatherTempFileResults/Reshuffle/ExpandIterable+WriteOneFilePerWindow/TextIO.Write/WriteFiles/GatherTempFileResults/Drop
key/Values/Map+WriteOneFilePerWindow/TextIO.Write/WriteFiles/GatherTempFileResults/Gather
bundles+WriteOneFilePerWindow/TextIO.Write/WriteFiles/GatherTempFileResults/Reshuffle.ViaRandomKey/Pair
with random key+WriteOneFilePerWindow/TextIO.Write/WriteFiles/GatherTempFileResults/Reshuffle.ViaRandomKey/Reshuffle/Window.Into()/Window.Assign+WriteOneFilePerWindow/TextIO.Write/WriteFiles/GatherTempFileResults/Reshuffle.ViaRandomKey/Reshuffle/GroupByKey/Reify+WriteOneFilePerWindow/TextIO.Write/WriteFiles/GatherTempFileResults/Reshuffle.ViaRandomKey/Reshuffle/GroupByKey/Write
    Aug 09, 2018 6:21:33 PM org.apache.beam.runners.dataflow.util.MonitoringUtil$LoggingHandler
process
    INFO: 2018-08-09T18:21:32.931Z: Executing operation WriteOneFilePerWindow/TextIO.Write/WriteFiles/GatherTempFileResults/Reshuffle.ViaRandomKey/Reshuffle/GroupByKey/Close
    Aug 09, 2018 6:21:33 PM org.apache.beam.runners.dataflow.util.MonitoringUtil$LoggingHandler
process
    INFO: 2018-08-09T18:21:33.068Z: Executing operation WriteOneFilePerWindow/TextIO.Write/WriteFiles/GatherTempFileResults/Reshuffle.ViaRandomKey/Reshuffle/GroupByKey/Read+WriteOneFilePerWindow/TextIO.Write/WriteFiles/GatherTempFileResults/Reshuffle.ViaRandomKey/Reshuffle/GroupByKey/GroupByWindow+WriteOneFilePerWindow/TextIO.Write/WriteFiles/GatherTempFileResults/Reshuffle.ViaRandomKey/Reshuffle/ExpandIterable+WriteOneFilePerWindow/TextIO.Write/WriteFiles/GatherTempFileResults/Reshuffle.ViaRandomKey/Values/Values/Map+WriteOneFilePerWindow/TextIO.Write/WriteFiles/FinalizeTempFileBundles/Finalize+WriteOneFilePerWindow/TextIO.Write/WriteFiles/FinalizeTempFileBundles/Reshuffle.ViaRandomKey/Pair
with random key+WriteOneFilePerWindow/TextIO.Write/WriteFiles/FinalizeTempFileBundles/Reshuffle.ViaRandomKey/Reshuffle/Window.Into()/Window.Assign+WriteOneFilePerWindow/TextIO.Write/WriteFiles/FinalizeTempFileBundles/Reshuffle.ViaRandomKey/Reshuffle/GroupByKey/Reify+WriteOneFilePerWindow/TextIO.Write/WriteFiles/FinalizeTempFileBundles/Reshuffle.ViaRandomKey/Reshuffle/GroupByKey/Write
    Aug 09, 2018 6:21:45 PM org.apache.beam.runners.dataflow.util.MonitoringUtil$LoggingHandler
process
    INFO: 2018-08-09T18:21:43.573Z: Executing operation WriteOneFilePerWindow/TextIO.Write/WriteFiles/FinalizeTempFileBundles/Reshuffle.ViaRandomKey/Reshuffle/GroupByKey/Close
    Aug 09, 2018 6:21:45 PM org.apache.beam.runners.dataflow.util.MonitoringUtil$LoggingHandler
process
    INFO: 2018-08-09T18:21:43.688Z: Executing operation WriteOneFilePerWindow/TextIO.Write/WriteFiles/FinalizeTempFileBundles/Reshuffle.ViaRandomKey/Reshuffle/GroupByKey/Read+WriteOneFilePerWindow/TextIO.Write/WriteFiles/FinalizeTempFileBundles/Reshuffle.ViaRandomKey/Reshuffle/GroupByKey/GroupByWindow+WriteOneFilePerWindow/TextIO.Write/WriteFiles/FinalizeTempFileBundles/Reshuffle.ViaRandomKey/Reshuffle/ExpandIterable+WriteOneFilePerWindow/TextIO.Write/WriteFiles/FinalizeTempFileBundles/Reshuffle.ViaRandomKey/Values/Values/Map
    Aug 09, 2018 6:21:51 PM org.apache.beam.runners.dataflow.util.MonitoringUtil$LoggingHandler
process
    INFO: 2018-08-09T18:21:49.979Z: Cleaning up.
    Aug 09, 2018 6:21:51 PM org.apache.beam.runners.dataflow.util.MonitoringUtil$LoggingHandler
process
    INFO: 2018-08-09T18:21:50.080Z: Stopping worker pool...
    Aug 09, 2018 6:23:53 PM org.apache.beam.runners.dataflow.util.MonitoringUtil$LoggingHandler
process
    INFO: 2018-08-09T18:23:51.482Z: Autoscaling: Resized worker pool from 1 to 0.
    Aug 09, 2018 6:23:53 PM org.apache.beam.runners.dataflow.util.MonitoringUtil$LoggingHandler
process
    INFO: 2018-08-09T18:23:51.523Z: Autoscaling: Would further reduce the number of workers
but reached the minimum number allowed for the job.
    Aug 09, 2018 6:23:53 PM org.apache.beam.runners.dataflow.util.MonitoringUtil$LoggingHandler
process
    INFO: 2018-08-09T18:23:51.578Z: Worker pool stopped.
    Aug 09, 2018 6:24:01 PM org.apache.beam.runners.dataflow.DataflowPipelineJob waitUntilFinish
    INFO: Job 2018-08-09_11_18_59-581864468659567346 finished with status DONE.
    Aug 09, 2018 6:24:01 PM org.apache.beam.runners.dataflow.TestDataflowRunner checkForPAssertSuccess
    INFO: Success result for Dataflow job 2018-08-09_11_18_59-581864468659567346. Found 0
success, 0 failures out of 0 expected assertions.
    Aug 09, 2018 6:24:03 PM org.apache.beam.runners.dataflow.DataflowPipelineJob waitUntilFinish
    INFO: Job 2018-08-09_11_18_59-581864468659567346 finished with status DONE.

Gradle Test Executor 97 finished executing tests.

> Task :beam-runners-google-cloud-dataflow-java-examples:preCommit
Finished generating test XML results (0.004 secs) into: <https://builds.apache.org/job/beam_PreCommit_Java_Cron/ws/src/runners/google-cloud-dataflow-java/examples/build/test-results/preCommit>
Generating HTML test report...
Finished generating test html results (0.006 secs) into: <https://builds.apache.org/job/beam_PreCommit_Java_Cron/ws/src/runners/google-cloud-dataflow-java/examples/build/reports/tests/preCommit>
Packing task ':beam-runners-google-cloud-dataflow-java-examples:preCommit'
:beam-runners-google-cloud-dataflow-java-examples:preCommit (Thread[Task worker for ':' Thread
4,5,main]) completed. Took 14 mins 58.676 secs.
:beam-examples-java:preCommit (Thread[Task worker for ':' Thread 4,5,main]) started.
:beam-runners-google-cloud-dataflow-java-examples:test (Thread[Task worker for ':' Thread
10,5,main]) started.

> Task :beam-examples-java:preCommit
Skipping task ':beam-examples-java:preCommit' as it has no actions.
:beam-examples-java:preCommit (Thread[Task worker for ':' Thread 4,5,main]) completed. Took
0.0 secs.

> Task :beam-runners-google-cloud-dataflow-java-examples:test NO-SOURCE
Skipping task ':beam-runners-google-cloud-dataflow-java-examples:test' as it has no source
files and no previous output files.
:beam-runners-google-cloud-dataflow-java-examples:test (Thread[Task worker for ':' Thread
10,5,main]) completed. Took 0.002 secs.
:beam-runners-google-cloud-dataflow-java-examples:check (Thread[Task worker for ':' Thread
10,5,main]) started.

> Task :beam-runners-google-cloud-dataflow-java-examples:check
Skipping task ':beam-runners-google-cloud-dataflow-java-examples:check' as it has no actions.
:beam-runners-google-cloud-dataflow-java-examples:check (Thread[Task worker for ':' Thread
10,5,main]) completed. Took 0.0 secs.
:beam-runners-google-cloud-dataflow-java-examples:build (Thread[Task worker for ':' Thread
10,5,main]) started.

> Task :beam-runners-google-cloud-dataflow-java-examples:build
Skipping task ':beam-runners-google-cloud-dataflow-java-examples:build' as it has no actions.
:beam-runners-google-cloud-dataflow-java-examples:build (Thread[Task worker for ':' Thread
10,5,main]) completed. Took 0.0 secs.
:beam-runners-google-cloud-dataflow-java-examples:buildDependents (Thread[Task worker for
':' Thread 10,5,main]) started.

> Task :beam-runners-google-cloud-dataflow-java-examples:buildDependents
Caching disabled for task ':beam-runners-google-cloud-dataflow-java-examples:buildDependents':
Caching has not been enabled for the task
Task ':beam-runners-google-cloud-dataflow-java-examples:buildDependents' is not up-to-date
because:
  Task has not declared any outputs despite executing actions.
:beam-runners-google-cloud-dataflow-java-examples:buildDependents (Thread[Task worker for
':' Thread 10,5,main]) completed. Took 0.0 secs.
:beam-examples-java:buildDependents (Thread[Task worker for ':' Thread 10,5,main]) started.
:beam-runners-google-cloud-dataflow-java:buildDependents (Thread[Task worker for ':' Thread
8,5,main]) started.

> Task :beam-examples-java:buildDependents
Caching disabled for task ':beam-examples-java:buildDependents': Caching has not been enabled
for the task
Task ':beam-examples-java:buildDependents' is not up-to-date because:
  Task has not declared any outputs despite executing actions.
:beam-examples-java:buildDependents (Thread[Task worker for ':' Thread 10,5,main]) completed.
Took 0.0 secs.

> Task :beam-runners-google-cloud-dataflow-java:buildDependents
Caching disabled for task ':beam-runners-google-cloud-dataflow-java:buildDependents': Caching
has not been enabled for the task
Task ':beam-runners-google-cloud-dataflow-java:buildDependents' is not up-to-date because:
  Task has not declared any outputs despite executing actions.
:beam-runners-google-cloud-dataflow-java:buildDependents (Thread[Task worker for ':' Thread
8,5,main]) completed. Took 0.001 secs.
:beam-sdks-java-io-google-cloud-platform:buildDependents (Thread[Task worker for ':' Thread
8,5,main]) started.

> Task :beam-sdks-java-io-google-cloud-platform:buildDependents
Caching disabled for task ':beam-sdks-java-io-google-cloud-platform:buildDependents': Caching
has not been enabled for the task
Task ':beam-sdks-java-io-google-cloud-platform:buildDependents' is not up-to-date because:
  Task has not declared any outputs despite executing actions.
:beam-sdks-java-io-google-cloud-platform:buildDependents (Thread[Task worker for ':' Thread
8,5,main]) completed. Took 0.0 secs.
:beam-sdks-java-extensions-protobuf:buildDependents (Thread[Task worker for ':',5,main]) started.

> Task :beam-sdks-java-extensions-protobuf:buildDependents
Caching disabled for task ':beam-sdks-java-extensions-protobuf:buildDependents': Caching has
not been enabled for the task
Task ':beam-sdks-java-extensions-protobuf:buildDependents' is not up-to-date because:
  Task has not declared any outputs despite executing actions.
:beam-sdks-java-extensions-protobuf:buildDependents (Thread[Task worker for ':',5,main]) completed.
Took 0.007 secs.

FAILURE: Build failed with an exception.

* What went wrong:
Execution failed for task ':beam-sdks-java-extensions-sql:test'.
> There were failing tests. See the report at: file://<https://builds.apache.org/job/beam_PreCommit_Java_Cron/ws/src/sdks/java/extensions/sql/build/reports/tests/test/index.html>

* Try:
Run with --stacktrace option to get the stack trace. Run with --debug option to get more log
output. Run with --scan to get full insights.

* Get more help at https://help.gradle.org

Deprecated Gradle features were used in this build, making it incompatible with Gradle 5.0.
See https://docs.gradle.org/4.8/userguide/command_line_interface.html#sec:command_line_warnings

BUILD FAILED in 23m 45s
750 actionable tasks: 745 executed, 5 from cache

Publishing build scan...
https://gradle.com/s/5pmbf4gmc6iz4

Build step 'Invoke Gradle script' changed build result to FAILURE
Build step 'Invoke Gradle script' marked build as failure

Mime
View raw message