beam-commits mailing list archives

Site index · List index
Message view « Date » · « Thread »
Top « Date » · « Thread »
From Apache Jenkins Server <jenk...@builds.apache.org>
Subject Build failed in Jenkins: beam_PostCommit_Python_Verify #5679
Date Mon, 06 Aug 2018 21:07:10 GMT
See <https://builds.apache.org/job/beam_PostCommit_Python_Verify/5679/display/redirect?page=changes>

Changes:

[amaliujia] remove RelCollationTraitDef

------------------------------------------
[...truncated 823.79 KB...]
test_type_check_invalid_composite_type (apache_beam.typehints.typehints_test.TupleHintTestCase)
... ok
test_type_check_invalid_composite_type_arbitrary_length (apache_beam.typehints.typehints_test.TupleHintTestCase)
... ok
test_type_check_invalid_simple_type_arbitrary_length (apache_beam.typehints.typehints_test.TupleHintTestCase)
... ok
test_type_check_invalid_simple_types (apache_beam.typehints.typehints_test.TupleHintTestCase)
... ok
test_type_check_must_be_tuple (apache_beam.typehints.typehints_test.TupleHintTestCase) ...
ok
test_type_check_must_have_same_arity (apache_beam.typehints.typehints_test.TupleHintTestCase)
... ok
test_type_check_valid_composite_type_arbitrary_length (apache_beam.typehints.typehints_test.TupleHintTestCase)
... ok
test_type_check_valid_composite_types (apache_beam.typehints.typehints_test.TupleHintTestCase)
... ok
test_type_check_valid_simple_type_arbitrary_length (apache_beam.typehints.typehints_test.TupleHintTestCase)
... ok
test_type_check_valid_simple_types (apache_beam.typehints.typehints_test.TupleHintTestCase)
... ok
test_getitem_duplicates_ignored (apache_beam.typehints.typehints_test.UnionHintTestCase) ...
ok
test_getitem_must_be_valid_type_param (apache_beam.typehints.typehints_test.UnionHintTestCase)
... ok
test_getitem_must_be_valid_type_param_cant_be_object_instance (apache_beam.typehints.typehints_test.UnionHintTestCase)
... ok
test_getitem_nested_unions_flattened (apache_beam.typehints.typehints_test.UnionHintTestCase)
... ok
test_nested_compatibility (apache_beam.typehints.typehints_test.UnionHintTestCase) ... ok
test_union_hint_compatibility (apache_beam.typehints.typehints_test.UnionHintTestCase) ...
ok
test_union_hint_enforcement_composite_type_in_union (apache_beam.typehints.typehints_test.UnionHintTestCase)
... ok
test_union_hint_enforcement_not_part_of_union (apache_beam.typehints.typehints_test.UnionHintTestCase)
... ok
test_union_hint_enforcement_part_of_union (apache_beam.typehints.typehints_test.UnionHintTestCase)
... ok
test_union_hint_repr (apache_beam.typehints.typehints_test.UnionHintTestCase) ... ok
test_deprecated_with_since_current (apache_beam.utils.annotations_test.AnnotationTests) ...
ok
test_deprecated_with_since_current_message (apache_beam.utils.annotations_test.AnnotationTests)
... ok
test_deprecated_without_current (apache_beam.utils.annotations_test.AnnotationTests) ... ok
test_deprecated_without_since_should_fail (apache_beam.utils.annotations_test.AnnotationTests)
... ok
test_experimental_with_current (apache_beam.utils.annotations_test.AnnotationTests) ... ok
test_experimental_with_current_message (apache_beam.utils.annotations_test.AnnotationTests)
... ok
test_experimental_without_current (apache_beam.utils.annotations_test.AnnotationTests) ...
ok
Tests that the filter 'once' is sufficient to print once per ... ok
test_equal_objects (apache_beam.utils.counters_test.CounterNameTest) ... ok
test_hash_two_objects (apache_beam.utils.counters_test.CounterNameTest) ... ok
test_method_forwarding_not_windows (apache_beam.utils.processes_test.Exec) ... ok
test_method_forwarding_windows (apache_beam.utils.processes_test.Exec) ... ok
test_call_two_objects (apache_beam.utils.retry_test.RetryStateTest) ... ok
test_single_failure (apache_beam.utils.retry_test.RetryStateTest) ... ok
test_two_failures (apache_beam.utils.retry_test.RetryStateTest) ... ok
test_log_calls_for_permanent_failure (apache_beam.utils.retry_test.RetryTest) ... ok
test_log_calls_for_transient_failure (apache_beam.utils.retry_test.RetryTest) ... ok
test_with_default_number_of_retries (apache_beam.utils.retry_test.RetryTest) ... ok
test_with_explicit_decorator (apache_beam.utils.retry_test.RetryTest) ... ok
test_with_explicit_initial_delay (apache_beam.utils.retry_test.RetryTest) ... ok
test_with_explicit_number_of_retries (apache_beam.utils.retry_test.RetryTest) ... ok
test_with_http_error_that_should_be_retried (apache_beam.utils.retry_test.RetryTest) ... SKIP:
google-apitools is not installed
test_with_http_error_that_should_not_be_retried (apache_beam.utils.retry_test.RetryTest) ...
SKIP: google-apitools is not installed
test_with_no_retry_decorator (apache_beam.utils.retry_test.RetryTest) ... ok
test_with_real_clock (apache_beam.utils.retry_test.RetryTest) ... ok
test_arithmetic (apache_beam.utils.timestamp_test.DurationTest) ... ok
test_of (apache_beam.utils.timestamp_test.DurationTest) ... ok
test_precision (apache_beam.utils.timestamp_test.DurationTest) ... ok
test_sort_order (apache_beam.utils.timestamp_test.DurationTest) ... ok
test_str (apache_beam.utils.timestamp_test.DurationTest) ... ok
test_arithmetic (apache_beam.utils.timestamp_test.TimestampTest) ... ok
test_from_rfc3339 (apache_beam.utils.timestamp_test.TimestampTest) ... ok
test_from_rfc3339_failure (apache_beam.utils.timestamp_test.TimestampTest) ... ok
test_from_utc_datetime (apache_beam.utils.timestamp_test.TimestampTest) ... ok
test_of (apache_beam.utils.timestamp_test.TimestampTest) ... ok
test_precision (apache_beam.utils.timestamp_test.TimestampTest) ... ok
test_sort_order (apache_beam.utils.timestamp_test.TimestampTest) ... ok
test_str (apache_beam.utils.timestamp_test.TimestampTest) ... ok
test_utc_timestamp (apache_beam.utils.timestamp_test.TimestampTest) ... ok
test_equality (apache_beam.utils.windowed_value_test.WindowedValueTest) ... ok
test_hash (apache_beam.utils.windowed_value_test.WindowedValueTest) ... ok
test_pickle (apache_beam.utils.windowed_value_test.WindowedValueTest) ... ok
test_timestamps (apache_beam.utils.windowed_value_test.WindowedValueTest) ... ok
test_with_value (apache_beam.utils.windowed_value_test.WindowedValueTest) ... ok
test_no_partial_writeouts (apache_beam.pipeline_test.DirectRunnerRetryTests) ... ok
test_retry_fork_graph (apache_beam.pipeline_test.DirectRunnerRetryTests) ... ok
test_element (apache_beam.pipeline_test.DoFnTest) ... ok
test_side_input_no_tag (apache_beam.pipeline_test.DoFnTest) ... ok
test_side_input_tagged (apache_beam.pipeline_test.DoFnTest) ... ok
test_timestamp_param (apache_beam.pipeline_test.DoFnTest) ... ok
test_timestamp_param_map (apache_beam.pipeline_test.DoFnTest) ... ok
test_window_param (apache_beam.pipeline_test.DoFnTest) ... ok
test_attribute_setting (apache_beam.pipeline_test.PipelineOptionsTest) ... ok
test_defaults (apache_beam.pipeline_test.PipelineOptionsTest) ... ok
test_dir (apache_beam.pipeline_test.PipelineOptionsTest) ... ok
test_flag_parsing (apache_beam.pipeline_test.PipelineOptionsTest) ... ok
test_keyword_parsing (apache_beam.pipeline_test.PipelineOptionsTest) ... ok
test_view_as (apache_beam.pipeline_test.PipelineOptionsTest) ... ok
test_aggregator_empty_input (apache_beam.pipeline_test.PipelineTest) ... ok
test_apply_custom_transform (apache_beam.pipeline_test.PipelineTest) ... ok
test_create (apache_beam.pipeline_test.PipelineTest) ... ok
test_create_singleton_pcollection (apache_beam.pipeline_test.PipelineTest) ... ok
test_fake_read (apache_beam.pipeline_test.PipelineTest) ... ok
test_flatmap_builtin (apache_beam.pipeline_test.PipelineTest) ... ok
test_memory_usage (apache_beam.pipeline_test.PipelineTest) ... ok
test_metrics_in_fake_source (apache_beam.pipeline_test.PipelineTest) ... ok
test_pipeline_as_context (apache_beam.pipeline_test.PipelineTest) ... ok
test_ptransform_override_type_hints (apache_beam.pipeline_test.PipelineTest) ... ok
test_ptransform_overrides (apache_beam.pipeline_test.PipelineTest) ... ok
test_reuse_cloned_custom_transform_instance (apache_beam.pipeline_test.PipelineTest) ... ok
test_reuse_custom_transform_instance (apache_beam.pipeline_test.PipelineTest) ... ok
test_transform_no_super_init (apache_beam.pipeline_test.PipelineTest) ... ok
test_visit_entire_graph (apache_beam.pipeline_test.PipelineTest) ... ok
test_parent_pointer (apache_beam.pipeline_test.RunnerApiTest) ... ok
test_assingleton_multi_element (apache_beam.pvalue_test.PValueTest) ... ok
test_pvalue_expected_arguments (apache_beam.pvalue_test.PValueTest) ... ok
test_passed_tuple_as_tag (apache_beam.pvalue_test.TaggedValueTest) ... ok
test_file_checksum_matchcer_invalid_sleep_time (apache_beam.testing.pipeline_verifiers_test.PipelineVerifiersTest)
... ok
test_file_checksum_matcher_read_failed (apache_beam.testing.pipeline_verifiers_test.PipelineVerifiersTest)
... ok
test_file_checksum_matcher_service_error (apache_beam.testing.pipeline_verifiers_test.PipelineVerifiersTest)
... SKIP: google-apitools is not installed
test_file_checksum_matcher_sleep_before_verify (apache_beam.testing.pipeline_verifiers_test.PipelineVerifiersTest)
... ok
test_file_checksum_matcher_success (apache_beam.testing.pipeline_verifiers_test.PipelineVerifiersTest)
... ok
Test PipelineStateMatcher fails when using default expected state ... ok
Test PipelineStateMatcher successes when matches given state ... ok
Test PipelineStateMatcher successes when using default expected state ... ok
testPipelineExpandGBK (apache_beam.testing.synthetic_pipeline_test.SyntheticPipelineTest)
... ok
testPipelineExpandSideOutput (apache_beam.testing.synthetic_pipeline_test.SyntheticPipelineTest)
... ok
testPipelineMergeGBK (apache_beam.testing.synthetic_pipeline_test.SyntheticPipelineTest) ...
ok
testPipelineMergeSideInput (apache_beam.testing.synthetic_pipeline_test.SyntheticPipelineTest)
... ok
testPipelineShuffle (apache_beam.testing.synthetic_pipeline_test.SyntheticPipelineTest) ...
ok
testPipelineSideInput (apache_beam.testing.synthetic_pipeline_test.SyntheticPipelineTest)
... ok
testSplitAtFraction (apache_beam.testing.synthetic_pipeline_test.SyntheticPipelineTest) ...
ok
testSyntheticSource (apache_beam.testing.synthetic_pipeline_test.SyntheticPipelineTest) ...
ok
testSyntheticSourceSplitEven (apache_beam.testing.synthetic_pipeline_test.SyntheticPipelineTest)
... ok
testSyntheticSourceSplitUneven (apache_beam.testing.synthetic_pipeline_test.SyntheticPipelineTest)
... ok
testSyntheticStep (apache_beam.testing.synthetic_pipeline_test.SyntheticPipelineTest) ...
ok
test_append_extra_options (apache_beam.testing.test_pipeline_test.TestPipelineTest) ... ok
test_append_verifier_in_extra_opt (apache_beam.testing.test_pipeline_test.TestPipelineTest)
... ok
test_create_test_pipeline_options (apache_beam.testing.test_pipeline_test.TestPipelineTest)
... ok
test_empty_option_args_parsing (apache_beam.testing.test_pipeline_test.TestPipelineTest) ...
ok
test_get_option (apache_beam.testing.test_pipeline_test.TestPipelineTest) ... ok
test_option_args_parsing (apache_beam.testing.test_pipeline_test.TestPipelineTest) ... ok
test_skip_IT (apache_beam.testing.test_pipeline_test.TestPipelineTest) ... SKIP: IT is skipped
because --test-pipeline-options is not specified
test_basic_execution (apache_beam.testing.test_stream_test.TestStreamTest) ... ok
test_basic_execution_batch_sideinputs (apache_beam.testing.test_stream_test.TestStreamTest)
... ok
test_basic_execution_batch_sideinputs_fixed_windows (apache_beam.testing.test_stream_test.TestStreamTest)
... ok
test_basic_execution_sideinputs (apache_beam.testing.test_stream_test.TestStreamTest) ...
ok
test_basic_execution_sideinputs_fixed_windows (apache_beam.testing.test_stream_test.TestStreamTest)
... ok
test_basic_test_stream (apache_beam.testing.test_stream_test.TestStreamTest) ... ok
Advance TestClock to (X + delta) and see the pipeline does finish. ... ok
test_gbk_execution_after_watermark_trigger (apache_beam.testing.test_stream_test.TestStreamTest)
... ok
test_gbk_execution_no_triggers (apache_beam.testing.test_stream_test.TestStreamTest) ... ok
test_test_stream_errors (apache_beam.testing.test_stream_test.TestStreamTest) ... ok
test_cleanup_subscriptions (apache_beam.testing.test_utils_test.TestUtilsTest) ... ok
test_cleanup_topics (apache_beam.testing.test_utils_test.TestUtilsTest) ... ok
test_delete_files_fails_with_invalid_arg (apache_beam.testing.test_utils_test.TestUtilsTest)
... ok
test_delete_files_fails_with_io_error (apache_beam.testing.test_utils_test.TestUtilsTest)
... ok
test_delete_files_succeeds (apache_beam.testing.test_utils_test.TestUtilsTest) ... ok
test_temp_dir_removes_files (apache_beam.testing.test_utils_test.TestUtilsTest) ... ok
test_temp_file_field_correct (apache_beam.testing.test_utils_test.TestUtilsTest) ... ok
test_wait_for_subscriptions_created_fails (apache_beam.testing.test_utils_test.TestUtilsTest)
... ok
test_wait_for_subscriptions_created_succeeds (apache_beam.testing.test_utils_test.TestUtilsTest)
... ok
test_wait_for_topics_created_fails (apache_beam.testing.test_utils_test.TestUtilsTest) ...
ok
test_wait_for_topics_created_succeeds (apache_beam.testing.test_utils_test.TestUtilsTest)
... ok
test_assert_that_fails (apache_beam.testing.util_test.UtilTest) ... ok
test_assert_that_fails_on_empty_expected (apache_beam.testing.util_test.UtilTest) ... ok
test_assert_that_fails_on_empty_input (apache_beam.testing.util_test.UtilTest) ... ok
test_assert_that_passes (apache_beam.testing.util_test.UtilTest) ... ok
test_assert_that_passes_empty_equal_to (apache_beam.testing.util_test.UtilTest) ... ok
test_assert_that_passes_empty_is_empty (apache_beam.testing.util_test.UtilTest) ... ok
test_reified_value_assert_fail_unmatched_timestamp (apache_beam.testing.util_test.UtilTest)
... ok
test_reified_value_assert_fail_unmatched_value (apache_beam.testing.util_test.UtilTest) ...
ok
test_reified_value_assert_fail_unmatched_window (apache_beam.testing.util_test.UtilTest) ...
ok
test_reified_value_passes (apache_beam.testing.util_test.UtilTest) ... ok

----------------------------------------------------------------------
XML: <https://builds.apache.org/job/beam_PostCommit_Python_Verify/ws/src/sdks/python/nosetests.xml>
----------------------------------------------------------------------
Ran 1655 tests in 253.264s

OK (SKIP=309)
py27 runtests: commands[5] | <https://builds.apache.org/job/beam_PostCommit_Python_Verify/ws/src/sdks/python/scripts/run_tox_cleanup.sh>
___________________________________ summary ____________________________________
  py27: commands succeeded
  congratulations :)
:beam-sdks-python:testPython (Thread[Daemon worker,5,main]) completed. Took 4 mins 29.929
secs.
:beam-sdks-python:testCython (Thread[Daemon worker,5,main]) started.

> Task :beam-sdks-python:testCython
Caching disabled for task ':beam-sdks-python:testCython': Caching has not been enabled for
the task
Task ':beam-sdks-python:testCython' is not up-to-date because:
  Task has not declared any outputs despite executing actions.
Starting process 'command 'sh''. Working directory: <https://builds.apache.org/job/beam_PostCommit_Python_Verify/ws/src/sdks/python>
Command: sh -c . <https://builds.apache.org/job/beam_PostCommit_Python_Verify/ws/src/sdks/python/build/gradleenv/bin/activate>
&& tox -c tox.ini --recreate -e py27-cython
Successfully started process 'command 'sh''
GLOB sdist-make: <https://builds.apache.org/job/beam_PostCommit_Python_Verify/ws/src/sdks/python/setup.py>
py27-cython create: <https://builds.apache.org/job/beam_PostCommit_Python_Verify/ws/src/sdks/python/target/.tox/py27-cython>
py27-cython installdeps: cython==0.28.1, future==0.16.0
py27-cython inst: <https://builds.apache.org/job/beam_PostCommit_Python_Verify/ws/src/sdks/python/target/.tox/dist/apache-beam-2.7.0.dev0.zip>
ERROR: invocation failed (exit code 1), logfile: <https://builds.apache.org/job/beam_PostCommit_Python_Verify/ws/src/sdks/python/target/.tox/py27-cython/log/py27-cython-2.log>
ERROR: actionid: py27-cython
msg: installpkg
cmdargs: ['<https://builds.apache.org/job/beam_PostCommit_Python_Verify/ws/src/sdks/python/target/.tox/py27-cython/bin/python',>
'<https://builds.apache.org/job/beam_PostCommit_Python_Verify/ws/src/sdks/python/target/.tox/py27-cython/bin/pip',>
'install', '<https://builds.apache.org/job/beam_PostCommit_Python_Verify/ws/src/sdks/python/target/.tox/dist/apache-beam-2.7.0.dev0.zip[test]']>

Processing ./target/.tox/dist/apache-beam-2.7.0.dev0.zip
    Complete output from command python setup.py egg_info:
    Compiling apache_beam/coders/stream.pyx because it changed.
    Compiling apache_beam/runners/worker/statesampler_fast.pyx because it changed.
    Compiling apache_beam/transforms/cy_dataflow_distribution_counter.pyx because it changed.
    Compiling apache_beam/coders/coder_impl.py because it changed.
    Compiling apache_beam/metrics/execution.py because it changed.
    Compiling apache_beam/runners/common.py because it changed.
    Compiling apache_beam/runners/worker/logger.py because it changed.
    Compiling apache_beam/runners/worker/opcounters.py because it changed.
    Compiling apache_beam/runners/worker/operations.py because it changed.
    Compiling apache_beam/transforms/cy_combiners.py because it changed.
    Compiling apache_beam/utils/counters.py because it changed.
    Compiling apache_beam/utils/windowed_value.py because it changed.
    [ 1/12] Cythonizing apache_beam/coders/coder_impl.py
    [ 2/12] Cythonizing apache_beam/coders/stream.pyx
    [ 3/12] Cythonizing apache_beam/metrics/execution.py
    [ 4/12] Cythonizing apache_beam/runners/common.py
    [ 5/12] Cythonizing apache_beam/runners/worker/logger.py
    [ 6/12] Cythonizing apache_beam/runners/worker/opcounters.py
    [ 7/12] Cythonizing apache_beam/runners/worker/operations.py
    [ 8/12] Cythonizing apache_beam/runners/worker/statesampler_fast.pyx
    [ 9/12] Cythonizing apache_beam/transforms/cy_combiners.py
    [10/12] Cythonizing apache_beam/transforms/cy_dataflow_distribution_counter.pyx
    [11/12] Cythonizing apache_beam/utils/counters.py
    [12/12] Cythonizing apache_beam/utils/windowed_value.py
    <https://builds.apache.org/job/beam_PostCommit_Python_Verify/ws/src/sdks/python/target/.tox/py27-cython/local/lib/python2.7/site-packages/setuptools/dist.py>:398:
UserWarning: Normalizing '2.7.0.dev' to '2.7.0.dev0'
      normalized_version,
    running egg_info
    error: error in 'egg_base' option: 'pip-egg-info' does not exist or is not a directory
    
    ----------------------------------------
Command "python setup.py egg_info" failed with error code 1 in /tmp/pip-req-build-H4mxnH/

py27-cython installed: Cython==0.28.1,future==0.16.0
___________________________________ summary ____________________________________
ERROR:   py27-cython: InvocationError for command <https://builds.apache.org/job/beam_PostCommit_Python_Verify/ws/src/sdks/python/target/.tox/py27-cython/bin/python>
<https://builds.apache.org/job/beam_PostCommit_Python_Verify/ws/src/sdks/python/target/.tox/py27-cython/bin/pip>
install <https://builds.apache.org/job/beam_PostCommit_Python_Verify/ws/src/sdks/python/target/.tox/dist/apache-beam-2.7.0.dev0.zip[test]>
(see <https://builds.apache.org/job/beam_PostCommit_Python_Verify/ws/src/sdks/python/target/.tox/py27-cython/log/py27-cython-2.log)>
(exited with code 1)

> Task :beam-sdks-python:testCython FAILED
:beam-sdks-python:testCython (Thread[Daemon worker,5,main]) completed. Took 14.474 secs.

FAILURE: Build failed with an exception.

* Where:
Build file '<https://builds.apache.org/job/beam_PostCommit_Python_Verify/ws/src/sdks/python/build.gradle'>
line: 142

* What went wrong:
Execution failed for task ':beam-sdks-python:testCython'.
> Process 'command 'sh'' finished with non-zero exit value 1

* Try:
Run with --stacktrace option to get the stack trace. Run with --debug option to get more log
output. Run with --scan to get full insights.

* Get more help at https://help.gradle.org

Deprecated Gradle features were used in this build, making it incompatible with Gradle 5.0.
See https://docs.gradle.org/4.8/userguide/command_line_interface.html#sec:command_line_warnings

BUILD FAILED in 36m 36s
12 actionable tasks: 12 executed

Publishing build scan...
https://gradle.com/s/qs4tepm45z6ts

Build step 'Invoke Gradle script' changed build result to FAILURE
Build step 'Invoke Gradle script' marked build as failure

Mime
View raw message