beam-commits mailing list archives

Site index · List index
Message view « Date » · « Thread »
Top « Date » · « Thread »
From Apache Jenkins Server <jenk...@builds.apache.org>
Subject Build failed in Jenkins: beam_PerformanceTests_HadoopInputFormat #699
Date Tue, 28 Aug 2018 18:30:56 GMT
See <https://builds.apache.org/job/beam_PerformanceTests_HadoopInputFormat/699/display/redirect>

------------------------------------------
[...truncated 522.53 KB...]
    	at java.util.concurrent.FutureTask.run(FutureTask.java:266)
    	at java.util.concurrent.ThreadPoolExecutor.runWorker(ThreadPoolExecutor.java:1142)
    	at java.util.concurrent.ThreadPoolExecutor$Worker.run(ThreadPoolExecutor.java:617)
    	at java.lang.Thread.run(Thread.java:745)
    Caused by: java.lang.RuntimeException: org.postgresql.util.PSQLException: The connection
attempt failed.
    	at org.apache.hadoop.mapreduce.lib.db.DBInputFormat.createConnection(DBInputFormat.java:205)
    	at org.apache.hadoop.mapreduce.lib.db.DBInputFormat.setConf(DBInputFormat.java:164)
    	... 18 more
    Caused by: org.postgresql.util.PSQLException: The connection attempt failed.
    	at org.postgresql.core.v3.ConnectionFactoryImpl.openConnectionImpl(ConnectionFactoryImpl.java:257)
    	at org.postgresql.core.ConnectionFactory.openConnection(ConnectionFactory.java:49)
    	at org.postgresql.jdbc.PgConnection.<init>(PgConnection.java:195)
    	at org.postgresql.Driver.makeConnection(Driver.java:452)
    	at org.postgresql.Driver.connect(Driver.java:254)
    	at java.sql.DriverManager.getConnection(DriverManager.java:664)
    	at java.sql.DriverManager.getConnection(DriverManager.java:247)
    	at org.apache.hadoop.mapreduce.lib.db.DBConfiguration.getConnection(DBConfiguration.java:154)
    	at org.apache.hadoop.mapreduce.lib.db.DBInputFormat.createConnection(DBInputFormat.java:198)
    	... 19 more
    Caused by: java.net.SocketTimeoutException: connect timed out
    	at java.net.PlainSocketImpl.socketConnect(Native Method)
    	at java.net.AbstractPlainSocketImpl.doConnect(AbstractPlainSocketImpl.java:350)
    	at java.net.AbstractPlainSocketImpl.connectToAddress(AbstractPlainSocketImpl.java:206)
    	at java.net.AbstractPlainSocketImpl.connect(AbstractPlainSocketImpl.java:188)
    	at java.net.SocksSocketImpl.connect(SocksSocketImpl.java:392)
    	at java.net.Socket.connect(Socket.java:589)
    	at org.postgresql.core.PGStream.<init>(PGStream.java:69)
    	at org.postgresql.core.v3.ConnectionFactoryImpl.openConnectionImpl(ConnectionFactoryImpl.java:156)
    	... 27 more
    java.lang.RuntimeException: java.lang.RuntimeException: org.postgresql.util.PSQLException:
The connection attempt failed.
    	at org.apache.hadoop.mapreduce.lib.db.DBInputFormat.setConf(DBInputFormat.java:171)
    	at org.apache.beam.sdk.io.hadoop.inputformat.HadoopInputFormatIO$HadoopInputFormatBoundedSource.createInputFormatInstance(HadoopInputFormatIO.java:571)
    	at org.apache.beam.sdk.io.hadoop.inputformat.HadoopInputFormatIO$HadoopInputFormatBoundedSource.computeSplitsIfNecessary(HadoopInputFormatIO.java:527)
    	at org.apache.beam.sdk.io.hadoop.inputformat.HadoopInputFormatIO$HadoopInputFormatBoundedSource.split(HadoopInputFormatIO.java:487)
    	at com.google.cloud.dataflow.worker.WorkerCustomSources.splitAndValidate(WorkerCustomSources.java:275)
    	at com.google.cloud.dataflow.worker.WorkerCustomSources.performSplitTyped(WorkerCustomSources.java:197)
    	at com.google.cloud.dataflow.worker.WorkerCustomSources.performSplitWithApiLimit(WorkerCustomSources.java:181)
    	at com.google.cloud.dataflow.worker.WorkerCustomSources.performSplit(WorkerCustomSources.java:160)
    	at com.google.cloud.dataflow.worker.WorkerCustomSourceOperationExecutor.execute(WorkerCustomSourceOperationExecutor.java:77)
    	at com.google.cloud.dataflow.worker.BatchDataflowWorker.executeWork(BatchDataflowWorker.java:393)
    	at com.google.cloud.dataflow.worker.BatchDataflowWorker.doWork(BatchDataflowWorker.java:362)
    	at com.google.cloud.dataflow.worker.BatchDataflowWorker.getAndPerformWork(BatchDataflowWorker.java:290)
    	at com.google.cloud.dataflow.worker.DataflowBatchWorkerHarness$WorkerThread.doWork(DataflowBatchWorkerHarness.java:134)
    	at com.google.cloud.dataflow.worker.DataflowBatchWorkerHarness$WorkerThread.call(DataflowBatchWorkerHarness.java:114)
    	at com.google.cloud.dataflow.worker.DataflowBatchWorkerHarness$WorkerThread.call(DataflowBatchWorkerHarness.java:101)
    	at java.util.concurrent.FutureTask.run(FutureTask.java:266)
    	at java.util.concurrent.ThreadPoolExecutor.runWorker(ThreadPoolExecutor.java:1142)
    	at java.util.concurrent.ThreadPoolExecutor$Worker.run(ThreadPoolExecutor.java:617)
    	at java.lang.Thread.run(Thread.java:745)
    Caused by: java.lang.RuntimeException: org.postgresql.util.PSQLException: The connection
attempt failed.
    	at org.apache.hadoop.mapreduce.lib.db.DBInputFormat.createConnection(DBInputFormat.java:205)
    	at org.apache.hadoop.mapreduce.lib.db.DBInputFormat.setConf(DBInputFormat.java:164)
    	... 18 more
    Caused by: org.postgresql.util.PSQLException: The connection attempt failed.
    	at org.postgresql.core.v3.ConnectionFactoryImpl.openConnectionImpl(ConnectionFactoryImpl.java:257)
    	at org.postgresql.core.ConnectionFactory.openConnection(ConnectionFactory.java:49)
    	at org.postgresql.jdbc.PgConnection.<init>(PgConnection.java:195)
    	at org.postgresql.Driver.makeConnection(Driver.java:452)
    	at org.postgresql.Driver.connect(Driver.java:254)
    	at java.sql.DriverManager.getConnection(DriverManager.java:664)
    	at java.sql.DriverManager.getConnection(DriverManager.java:247)
    	at org.apache.hadoop.mapreduce.lib.db.DBConfiguration.getConnection(DBConfiguration.java:154)
    	at org.apache.hadoop.mapreduce.lib.db.DBInputFormat.createConnection(DBInputFormat.java:198)
    	... 19 more
    Caused by: java.net.SocketTimeoutException: connect timed out
    	at java.net.PlainSocketImpl.socketConnect(Native Method)
    	at java.net.AbstractPlainSocketImpl.doConnect(AbstractPlainSocketImpl.java:350)
    	at java.net.AbstractPlainSocketImpl.connectToAddress(AbstractPlainSocketImpl.java:206)
    	at java.net.AbstractPlainSocketImpl.connect(AbstractPlainSocketImpl.java:188)
    	at java.net.SocksSocketImpl.connect(SocksSocketImpl.java:392)
    	at java.net.Socket.connect(Socket.java:589)
    	at org.postgresql.core.PGStream.<init>(PGStream.java:69)
    	at org.postgresql.core.v3.ConnectionFactoryImpl.openConnectionImpl(ConnectionFactoryImpl.java:156)
    	... 27 more
    java.lang.RuntimeException: java.lang.RuntimeException: org.postgresql.util.PSQLException:
The connection attempt failed.
    	at org.apache.hadoop.mapreduce.lib.db.DBInputFormat.setConf(DBInputFormat.java:171)
    	at org.apache.beam.sdk.io.hadoop.inputformat.HadoopInputFormatIO$HadoopInputFormatBoundedSource.createInputFormatInstance(HadoopInputFormatIO.java:571)
    	at org.apache.beam.sdk.io.hadoop.inputformat.HadoopInputFormatIO$HadoopInputFormatBoundedSource.computeSplitsIfNecessary(HadoopInputFormatIO.java:527)
    	at org.apache.beam.sdk.io.hadoop.inputformat.HadoopInputFormatIO$HadoopInputFormatBoundedSource.split(HadoopInputFormatIO.java:487)
    	at com.google.cloud.dataflow.worker.WorkerCustomSources.splitAndValidate(WorkerCustomSources.java:275)
    	at com.google.cloud.dataflow.worker.WorkerCustomSources.performSplitTyped(WorkerCustomSources.java:197)
    	at com.google.cloud.dataflow.worker.WorkerCustomSources.performSplitWithApiLimit(WorkerCustomSources.java:181)
    	at com.google.cloud.dataflow.worker.WorkerCustomSources.performSplit(WorkerCustomSources.java:160)
    	at com.google.cloud.dataflow.worker.WorkerCustomSourceOperationExecutor.execute(WorkerCustomSourceOperationExecutor.java:77)
    	at com.google.cloud.dataflow.worker.BatchDataflowWorker.executeWork(BatchDataflowWorker.java:393)
    	at com.google.cloud.dataflow.worker.BatchDataflowWorker.doWork(BatchDataflowWorker.java:362)
    	at com.google.cloud.dataflow.worker.BatchDataflowWorker.getAndPerformWork(BatchDataflowWorker.java:290)
    	at com.google.cloud.dataflow.worker.DataflowBatchWorkerHarness$WorkerThread.doWork(DataflowBatchWorkerHarness.java:134)
    	at com.google.cloud.dataflow.worker.DataflowBatchWorkerHarness$WorkerThread.call(DataflowBatchWorkerHarness.java:114)
    	at com.google.cloud.dataflow.worker.DataflowBatchWorkerHarness$WorkerThread.call(DataflowBatchWorkerHarness.java:101)
    	at java.util.concurrent.FutureTask.run(FutureTask.java:266)
    	at java.util.concurrent.ThreadPoolExecutor.runWorker(ThreadPoolExecutor.java:1142)
    	at java.util.concurrent.ThreadPoolExecutor$Worker.run(ThreadPoolExecutor.java:617)
    	at java.lang.Thread.run(Thread.java:745)
    Caused by: java.lang.RuntimeException: org.postgresql.util.PSQLException: The connection
attempt failed.
    	at org.apache.hadoop.mapreduce.lib.db.DBInputFormat.createConnection(DBInputFormat.java:205)
    	at org.apache.hadoop.mapreduce.lib.db.DBInputFormat.setConf(DBInputFormat.java:164)
    	... 18 more
    Caused by: org.postgresql.util.PSQLException: The connection attempt failed.
    	at org.postgresql.core.v3.ConnectionFactoryImpl.openConnectionImpl(ConnectionFactoryImpl.java:257)
    	at org.postgresql.core.ConnectionFactory.openConnection(ConnectionFactory.java:49)
    	at org.postgresql.jdbc.PgConnection.<init>(PgConnection.java:195)
    	at org.postgresql.Driver.makeConnection(Driver.java:452)
    	at org.postgresql.Driver.connect(Driver.java:254)
    	at java.sql.DriverManager.getConnection(DriverManager.java:664)
    	at java.sql.DriverManager.getConnection(DriverManager.java:247)
    	at org.apache.hadoop.mapreduce.lib.db.DBConfiguration.getConnection(DBConfiguration.java:154)
    	at org.apache.hadoop.mapreduce.lib.db.DBInputFormat.createConnection(DBInputFormat.java:198)
    	... 19 more
    Caused by: java.net.SocketTimeoutException: connect timed out
    	at java.net.PlainSocketImpl.socketConnect(Native Method)
    	at java.net.AbstractPlainSocketImpl.doConnect(AbstractPlainSocketImpl.java:350)
    	at java.net.AbstractPlainSocketImpl.connectToAddress(AbstractPlainSocketImpl.java:206)
    	at java.net.AbstractPlainSocketImpl.connect(AbstractPlainSocketImpl.java:188)
    	at java.net.SocksSocketImpl.connect(SocksSocketImpl.java:392)
    	at java.net.Socket.connect(Socket.java:589)
    	at org.postgresql.core.PGStream.<init>(PGStream.java:69)
    	at org.postgresql.core.v3.ConnectionFactoryImpl.openConnectionImpl(ConnectionFactoryImpl.java:156)
    	... 27 more
    Workflow failed. Causes: S03:Read using HadoopInputFormat/Read(HadoopInputFormatBoundedSource)+Get
values only/Values/Map+Values as string+Calculate hashcode/WithKeys/AddKeys/Map+Calculate
hashcode/Combine.perKey(Hashing)/GroupByKey+Calculate hashcode/Combine.perKey(Hashing)/Combine.GroupedValues/Partial+Calculate
hashcode/Combine.perKey(Hashing)/GroupByKey/Reify+Calculate hashcode/Combine.perKey(Hashing)/GroupByKey/Write
failed.
        at org.apache.beam.runners.dataflow.TestDataflowRunner.run(TestDataflowRunner.java:134)
        at org.apache.beam.runners.dataflow.TestDataflowRunner.run(TestDataflowRunner.java:90)
        at org.apache.beam.runners.dataflow.TestDataflowRunner.run(TestDataflowRunner.java:55)
        at org.apache.beam.sdk.Pipeline.run(Pipeline.java:313)
        at org.apache.beam.sdk.testing.TestPipeline.run(TestPipeline.java:350)
        at org.apache.beam.sdk.testing.TestPipeline.run(TestPipeline.java:331)
        at org.apache.beam.sdk.io.hadoop.inputformat.HadoopInputFormatIOIT.readUsingHadoopInputFormat(HadoopInputFormatIOIT.java:161)
Finished generating test XML results (0.029 secs) into: <https://builds.apache.org/job/beam_PerformanceTests_HadoopInputFormat/ws/src/sdks/java/io/hadoop-input-format/build/test-results/integrationTest>
Generating HTML test report...
Finished generating test html results (0.035 secs) into: <https://builds.apache.org/job/beam_PerformanceTests_HadoopInputFormat/ws/src/sdks/java/io/hadoop-input-format/build/reports/tests/integrationTest>
:beam-sdks-java-io-hadoop-input-format:integrationTest (Thread[Task worker for ':' Thread
8,5,main]) completed. Took 8 mins 35.319 secs.

Deprecated Gradle features were used in this build, making it incompatible with Gradle 5.0.
See https://docs.gradle.org/4.8/userguide/command_line_interface.html#sec:command_line_warnings
70 actionable tasks: 14 executed, 56 up-to-date

Publishing build scan...
https://gradle.com/s/ykodln4sx3lhg


STDERR: 
1 test completed, 1 failed

FAILURE: Build failed with an exception.

* What went wrong:
Execution failed for task ':beam-sdks-java-io-hadoop-input-format:integrationTest'.
> There were failing tests. See the report at: file://<https://builds.apache.org/job/beam_PerformanceTests_HadoopInputFormat/ws/src/sdks/java/io/hadoop-input-format/build/reports/tests/integrationTest/index.html>

* Try:
Run with --debug option to get more log output. Run with --scan to get full insights.

* Exception is:
org.gradle.api.tasks.TaskExecutionException: Execution failed for task ':beam-sdks-java-io-hadoop-input-format:integrationTest'.
	at org.gradle.api.internal.tasks.execution.ExecuteActionsTaskExecuter.executeActions(ExecuteActionsTaskExecuter.java:110)
	at org.gradle.api.internal.tasks.execution.ExecuteActionsTaskExecuter.execute(ExecuteActionsTaskExecuter.java:77)
	at org.gradle.api.internal.tasks.execution.OutputDirectoryCreatingTaskExecuter.execute(OutputDirectoryCreatingTaskExecuter.java:51)
	at org.gradle.api.internal.tasks.execution.SkipCachedTaskExecuter.execute(SkipCachedTaskExecuter.java:105)
	at org.gradle.api.internal.tasks.execution.SkipUpToDateTaskExecuter.execute(SkipUpToDateTaskExecuter.java:59)
	at org.gradle.api.internal.tasks.execution.ResolveTaskOutputCachingStateExecuter.execute(ResolveTaskOutputCachingStateExecuter.java:54)
	at org.gradle.api.internal.tasks.execution.ResolveBuildCacheKeyExecuter.execute(ResolveBuildCacheKeyExecuter.java:66)
	at org.gradle.api.internal.tasks.execution.ValidatingTaskExecuter.execute(ValidatingTaskExecuter.java:59)
	at org.gradle.api.internal.tasks.execution.SkipEmptySourceFilesTaskExecuter.execute(SkipEmptySourceFilesTaskExecuter.java:101)
	at org.gradle.api.internal.tasks.execution.FinalizeInputFilePropertiesTaskExecuter.execute(FinalizeInputFilePropertiesTaskExecuter.java:44)
	at org.gradle.api.internal.tasks.execution.CleanupStaleOutputsExecuter.execute(CleanupStaleOutputsExecuter.java:91)
	at org.gradle.api.internal.tasks.execution.ResolveTaskArtifactStateTaskExecuter.execute(ResolveTaskArtifactStateTaskExecuter.java:62)
	at org.gradle.api.internal.tasks.execution.SkipTaskWithNoActionsExecuter.execute(SkipTaskWithNoActionsExecuter.java:59)
	at org.gradle.api.internal.tasks.execution.SkipOnlyIfTaskExecuter.execute(SkipOnlyIfTaskExecuter.java:54)
	at org.gradle.api.internal.tasks.execution.ExecuteAtMostOnceTaskExecuter.execute(ExecuteAtMostOnceTaskExecuter.java:43)
	at org.gradle.api.internal.tasks.execution.CatchExceptionTaskExecuter.execute(CatchExceptionTaskExecuter.java:34)
	at org.gradle.api.internal.tasks.execution.EventFiringTaskExecuter$1.run(EventFiringTaskExecuter.java:51)
	at org.gradle.internal.operations.DefaultBuildOperationExecutor$RunnableBuildOperationWorker.execute(DefaultBuildOperationExecutor.java:317)
	at org.gradle.internal.operations.DefaultBuildOperationExecutor$RunnableBuildOperationWorker.execute(DefaultBuildOperationExecutor.java:309)
	at org.gradle.internal.operations.DefaultBuildOperationExecutor.execute(DefaultBuildOperationExecutor.java:185)
	at org.gradle.internal.operations.DefaultBuildOperationExecutor.run(DefaultBuildOperationExecutor.java:97)
	at org.gradle.internal.operations.DelegatingBuildOperationExecutor.run(DelegatingBuildOperationExecutor.java:31)
	at org.gradle.api.internal.tasks.execution.EventFiringTaskExecuter.execute(EventFiringTaskExecuter.java:46)
	at org.gradle.execution.taskgraph.DefaultTaskExecutionGraph$ExecuteTaskAction.execute(DefaultTaskExecutionGraph.java:262)
	at org.gradle.execution.taskgraph.DefaultTaskExecutionGraph$ExecuteTaskAction.execute(DefaultTaskExecutionGraph.java:246)
	at org.gradle.execution.taskgraph.DefaultTaskPlanExecutor$TaskExecutorWorker$1.execute(DefaultTaskPlanExecutor.java:136)
	at org.gradle.execution.taskgraph.DefaultTaskPlanExecutor$TaskExecutorWorker$1.execute(DefaultTaskPlanExecutor.java:130)
	at org.gradle.execution.taskgraph.DefaultTaskPlanExecutor$TaskExecutorWorker.execute(DefaultTaskPlanExecutor.java:201)
	at org.gradle.execution.taskgraph.DefaultTaskPlanExecutor$TaskExecutorWorker.executeWithTask(DefaultTaskPlanExecutor.java:192)
	at org.gradle.execution.taskgraph.DefaultTaskPlanExecutor$TaskExecutorWorker.run(DefaultTaskPlanExecutor.java:130)
	at org.gradle.internal.concurrent.ExecutorPolicy$CatchAndRecordFailures.onExecute(ExecutorPolicy.java:63)
	at org.gradle.internal.concurrent.ManagedExecutorImpl$1.run(ManagedExecutorImpl.java:46)
	at org.gradle.internal.concurrent.ThreadFactoryImpl$ManagedThreadRunnable.run(ThreadFactoryImpl.java:55)
Caused by: org.gradle.api.GradleException: There were failing tests. See the report at: file://<https://builds.apache.org/job/beam_PerformanceTests_HadoopInputFormat/ws/src/sdks/java/io/hadoop-input-format/build/reports/tests/integrationTest/index.html>
	at org.gradle.api.tasks.testing.AbstractTestTask.handleTestFailures(AbstractTestTask.java:612)
	at org.gradle.api.tasks.testing.AbstractTestTask.executeTests(AbstractTestTask.java:484)
	at org.gradle.api.tasks.testing.Test.executeTests(Test.java:603)
	at org.gradle.internal.reflect.JavaMethod.invoke(JavaMethod.java:73)
	at org.gradle.api.internal.project.taskfactory.StandardTaskAction.doExecute(StandardTaskAction.java:46)
	at org.gradle.api.internal.project.taskfactory.StandardTaskAction.execute(StandardTaskAction.java:39)
	at org.gradle.api.internal.project.taskfactory.StandardTaskAction.execute(StandardTaskAction.java:26)
	at org.gradle.api.internal.AbstractTask$TaskActionWrapper.execute(AbstractTask.java:794)
	at org.gradle.api.internal.AbstractTask$TaskActionWrapper.execute(AbstractTask.java:761)
	at org.gradle.api.internal.tasks.execution.ExecuteActionsTaskExecuter$1.run(ExecuteActionsTaskExecuter.java:131)
	at org.gradle.internal.operations.DefaultBuildOperationExecutor$RunnableBuildOperationWorker.execute(DefaultBuildOperationExecutor.java:317)
	at org.gradle.internal.operations.DefaultBuildOperationExecutor$RunnableBuildOperationWorker.execute(DefaultBuildOperationExecutor.java:309)
	at org.gradle.internal.operations.DefaultBuildOperationExecutor.execute(DefaultBuildOperationExecutor.java:185)
	at org.gradle.internal.operations.DefaultBuildOperationExecutor.run(DefaultBuildOperationExecutor.java:97)
	at org.gradle.internal.operations.DelegatingBuildOperationExecutor.run(DelegatingBuildOperationExecutor.java:31)
	at org.gradle.api.internal.tasks.execution.ExecuteActionsTaskExecuter.executeAction(ExecuteActionsTaskExecuter.java:120)
	at org.gradle.api.internal.tasks.execution.ExecuteActionsTaskExecuter.executeActions(ExecuteActionsTaskExecuter.java:99)
	... 32 more


* Get more help at https://help.gradle.org

BUILD FAILED in 10m 10s

2018-08-28 18:30:54,748 a854690d MainThread beam_integration_benchmark(1/1) ERROR    Error
during benchmark beam_integration_benchmark
Traceback (most recent call last):
  File "<https://builds.apache.org/job/beam_PerformanceTests_HadoopInputFormat/ws/PerfKitBenchmarker/perfkitbenchmarker/pkb.py",>
line 676, in RunBenchmark
    DoRunPhase(spec, collector, detailed_timer)
  File "<https://builds.apache.org/job/beam_PerformanceTests_HadoopInputFormat/ws/PerfKitBenchmarker/perfkitbenchmarker/pkb.py",>
line 556, in DoRunPhase
    samples = spec.BenchmarkRun(spec)
  File "<https://builds.apache.org/job/beam_PerformanceTests_HadoopInputFormat/ws/PerfKitBenchmarker/perfkitbenchmarker/linux_benchmarks/beam_integration_benchmark.py",>
line 160, in Run
    job_type=job_type)
  File "<https://builds.apache.org/job/beam_PerformanceTests_HadoopInputFormat/ws/PerfKitBenchmarker/perfkitbenchmarker/providers/gcp/gcp_dpb_dataflow.py",>
line 90, in SubmitJob
    assert retcode == 0, "Integration Test Failed."
AssertionError: Integration Test Failed.
2018-08-28 18:30:54,749 a854690d MainThread beam_integration_benchmark(1/1) INFO     Cleaning
up benchmark beam_integration_benchmark
2018-08-28 18:30:54,750 a854690d MainThread beam_integration_benchmark(1/1) INFO     Running:
kubectl --kubeconfig=<https://builds.apache.org/job/beam_PerformanceTests_HadoopInputFormat/ws/config-beam-performancetests-hadoopinputformat-699>
delete -f <https://builds.apache.org/job/beam_PerformanceTests_HadoopInputFormat/ws/src/.test-infra/kubernetes/postgres/postgres-service-for-local-dev.yml>
--ignore-not-found
2018-08-28 18:30:55,605 a854690d MainThread beam_integration_benchmark(1/1) ERROR    Exception
running benchmark
Traceback (most recent call last):
  File "<https://builds.apache.org/job/beam_PerformanceTests_HadoopInputFormat/ws/PerfKitBenchmarker/perfkitbenchmarker/pkb.py",>
line 812, in RunBenchmarkTask
    RunBenchmark(spec, collector)
  File "<https://builds.apache.org/job/beam_PerformanceTests_HadoopInputFormat/ws/PerfKitBenchmarker/perfkitbenchmarker/pkb.py",>
line 676, in RunBenchmark
    DoRunPhase(spec, collector, detailed_timer)
  File "<https://builds.apache.org/job/beam_PerformanceTests_HadoopInputFormat/ws/PerfKitBenchmarker/perfkitbenchmarker/pkb.py",>
line 556, in DoRunPhase
    samples = spec.BenchmarkRun(spec)
  File "<https://builds.apache.org/job/beam_PerformanceTests_HadoopInputFormat/ws/PerfKitBenchmarker/perfkitbenchmarker/linux_benchmarks/beam_integration_benchmark.py",>
line 160, in Run
    job_type=job_type)
  File "<https://builds.apache.org/job/beam_PerformanceTests_HadoopInputFormat/ws/PerfKitBenchmarker/perfkitbenchmarker/providers/gcp/gcp_dpb_dataflow.py",>
line 90, in SubmitJob
    assert retcode == 0, "Integration Test Failed."
AssertionError: Integration Test Failed.
2018-08-28 18:30:55,605 a854690d MainThread beam_integration_benchmark(1/1) ERROR    Benchmark
1/1 beam_integration_benchmark (UID: beam_integration_benchmark0) failed. Execution will continue.
2018-08-28 18:30:55,633 a854690d MainThread INFO     Benchmark run statuses:
---------------------------------------------------------------------------------
Name                        UID                          Status  Failed Substatus
---------------------------------------------------------------------------------
beam_integration_benchmark  beam_integration_benchmark0  FAILED                  
---------------------------------------------------------------------------------
Success rate: 0.00% (0/1)
2018-08-28 18:30:55,634 a854690d MainThread INFO     Complete logs can be found at: <https://builds.apache.org/job/beam_PerformanceTests_HadoopInputFormat/ws/runs/a854690d/pkb.log>
2018-08-28 18:30:55,635 a854690d MainThread INFO     Completion statuses can be found at:
<https://builds.apache.org/job/beam_PerformanceTests_HadoopInputFormat/ws/runs/a854690d/completion_statuses.json>
Build step 'Execute shell' marked build as failure

Mime
View raw message