beam-commits mailing list archives

Site index · List index
Message view « Date » · « Thread »
Top « Date » · « Thread »
From "Andrew Pilloud (JIRA)" <j...@apache.org>
Subject [jira] [Commented] (BEAM-5035) beam_PostCommit_Java_GradleBuild/1105 :beam-examples-java:compileTestJava FAILED
Date Fri, 24 Aug 2018 23:24:00 GMT

    [ https://issues.apache.org/jira/browse/BEAM-5035?page=com.atlassian.jira.plugin.system.issuetabpanels:comment-tabpanel&focusedCommentId=16592309#comment-16592309
] 

Andrew Pilloud commented on BEAM-5035:
--------------------------------------

https://builds.apache.org/job/beam_PostCommit_Java_GradleBuild/1344/

> beam_PostCommit_Java_GradleBuild/1105 :beam-examples-java:compileTestJava FAILED
> --------------------------------------------------------------------------------
>
>                 Key: BEAM-5035
>                 URL: https://issues.apache.org/jira/browse/BEAM-5035
>             Project: Beam
>          Issue Type: Improvement
>          Components: test-failures
>            Reporter: Mikhail Gryzykhin
>            Assignee: Alan Myrvold
>            Priority: Critical
>          Time Spent: 3h 10m
>  Remaining Estimate: 0h
>
> Compilation failed for
> [https://builds.apache.org/view/A-D/view/Beam/job/beam_PostCommit_Java_GradleBuild/1105/]
>  > Task :beam-examples-java:compileTestJava FAILED
>  /home/jenkins/jenkins-slave/workspace/beam_PostCommit_Java_GradleBuild/src/examples/java/src/test/java/org/apache/beam/examples/cookbook/BigQueryTornadoesIT.java:22:
error: cannot access BigqueryMatcher
>  import org.apache.beam.sdk.io.gcp.testing.BigqueryMatcher;
>  ^
>  bad class file: /home/jenkins/jenkins-slave/workspace/beam_PostCommit_Java_GradleBuild/src/sdks/java/io/google-cloud-platform/build/libs/beam-sdks-java-io-google-cloud-platform-2.7.0-SNAPSHOT-tests.jar(/org/apache/beam/sdk/io/gcp/testing/BigqueryMatcher.class)
>  unable to access file: java.util.zip.ZipException: invalid stored block lengths
>  Please remove or make sure it appears in the correct subdirectory of the classpath.
>  1 error
>  
> https://github.com/apache/beam/blame/328129bf033bc6be16bc8e09af905f37b7516412/examples/java/src/test/java/org/apache/beam/examples/cookbook/BigQueryTornadoesIT.java
>  



--
This message was sent by Atlassian JIRA
(v7.6.3#76005)

Mime
View raw message