beam-commits mailing list archives

Site index · List index
Message view « Date » · « Thread »
Top « Date » · « Thread »
From Apache Jenkins Server <jenk...@builds.apache.org>
Subject Build failed in Jenkins: beam_PreCommit_Java_Cron #314
Date Fri, 07 Sep 2018 18:57:18 GMT
See <https://builds.apache.org/job/beam_PreCommit_Java_Cron/314/display/redirect?page=changes>

Changes:

[tweise] [BEAM-5332] Do not attempt to evict cache after shutdown (#6342)

[thw] Cleanup FlinkExecutableStageContext and related classes.

[tweise] Compatibility Matrix: Build 'shadowJar' instead of regular jar (#6348)

------------------------------------------
[...truncated 20.16 MB...]
Packing task ':beam-sdks-java-io-hadoop-common:checkstyleTest'
:beam-sdks-java-io-hadoop-common:checkstyleTest (Thread[Task worker for ':' Thread 3,5,main])
completed. Took 0.093 secs.
:beam-sdks-java-io-hadoop-common:findbugsMain (Thread[Task worker for ':' Thread 3,5,main])
started.
Initialized native services in: /home/jenkins/.gradle/native

> Task :beam-sdks-java-io-hadoop-common:findbugsMain
Build cache key for task ':beam-sdks-java-io-hadoop-common:findbugsMain' is d6059d048579a21464c097727c78b772
Task ':beam-sdks-java-io-hadoop-common:findbugsMain' is not up-to-date because:
  No history is available.
Starting process 'Gradle FindBugs Worker 134'. Working directory: <https://builds.apache.org/job/beam_PreCommit_Java_Cron/ws/src/sdks/java/io/hadoop-common>
Command: /usr/local/asfpackages/java/jdk1.8.0_172/bin/java -Djava.security.manager=worker.org.gradle.process.internal.worker.child.BootstrapSecurityManager
-Dfile.encoding=UTF-8 -Duser.country=US -Duser.language=en -Duser.variant -cp /home/jenkins/.gradle/caches/4.8/workerMain/gradle-worker.jar
worker.org.gradle.process.internal.worker.GradleWorkerMain 'Gradle FindBugs Worker 134'
Successfully started process 'Gradle FindBugs Worker 134'
Packing task ':beam-sdks-java-io-hadoop-common:findbugsMain'
:beam-sdks-java-io-hadoop-common:findbugsMain (Thread[Task worker for ':' Thread 3,5,main])
completed. Took 3.52 secs.
:beam-sdks-java-io-hadoop-common:spotlessJava (Thread[Task worker for ':' Thread 3,5,main])
started.

> Task :beam-sdks-java-io-hadoop-common:spotlessJava
Caching disabled for task ':beam-sdks-java-io-hadoop-common:spotlessJava': Caching has not
been enabled for the task
Task ':beam-sdks-java-io-hadoop-common:spotlessJava' is not up-to-date because:
  No history is available.
All input files are considered out-of-date for incremental task ':beam-sdks-java-io-hadoop-common:spotlessJava'.
:beam-sdks-java-io-hadoop-common:spotlessJava (Thread[Task worker for ':' Thread 3,5,main])
completed. Took 0.033 secs.
:beam-sdks-java-io-hadoop-common:spotlessJavaCheck (Thread[Task worker for ':' Thread 3,5,main])
started.

> Task :beam-sdks-java-io-hadoop-common:spotlessJavaCheck
Skipping task ':beam-sdks-java-io-hadoop-common:spotlessJavaCheck' as it has no actions.
:beam-sdks-java-io-hadoop-common:spotlessJavaCheck (Thread[Task worker for ':' Thread 3,5,main])
completed. Took 0.0 secs.
:beam-sdks-java-io-hadoop-common:spotlessCheck (Thread[Task worker for ':' Thread 3,5,main])
started.

> Task :beam-sdks-java-io-hadoop-common:spotlessCheck
Skipping task ':beam-sdks-java-io-hadoop-common:spotlessCheck' as it has no actions.
:beam-sdks-java-io-hadoop-common:spotlessCheck (Thread[Task worker for ':' Thread 3,5,main])
completed. Took 0.0 secs.
:beam-sdks-java-io-hadoop-common:test (Thread[Task worker for ':' Thread 3,5,main]) started.
Gradle Test Executor 135 started executing tests.
Gradle Test Executor 135 finished executing tests.

> Task :beam-sdks-java-io-hadoop-common:test
Build cache key for task ':beam-sdks-java-io-hadoop-common:test' is 05815c427e42fe2f82b3328d97a235aa
Task ':beam-sdks-java-io-hadoop-common:test' is not up-to-date because:
  No history is available.
Starting process 'Gradle Test Executor 135'. Working directory: <https://builds.apache.org/job/beam_PreCommit_Java_Cron/ws/src/sdks/java/io/hadoop-common>
Command: /usr/local/asfpackages/java/jdk1.8.0_172/bin/java -Djava.security.manager=worker.org.gradle.process.internal.worker.child.BootstrapSecurityManager
-Dorg.gradle.native=false -Dfile.encoding=UTF-8 -Duser.country=US -Duser.language=en -Duser.variant
-ea -cp /home/jenkins/.gradle/caches/4.8/workerMain/gradle-worker.jar worker.org.gradle.process.internal.worker.GradleWorkerMain
'Gradle Test Executor 135'
Successfully started process 'Gradle Test Executor 135'

org.apache.beam.sdk.io.hadoop.WritableCoderTest > testAutomaticRegistrationOfCoderProvider
STANDARD_ERROR
    log4j:WARN No appenders could be found for logger (org.apache.beam.sdk.coders.CoderRegistry).
    log4j:WARN Please initialize the log4j system properly.
    log4j:WARN See http://logging.apache.org/log4j/1.2/faq.html#noconfig for more info.
Finished generating test XML results (0.0 secs) into: <https://builds.apache.org/job/beam_PreCommit_Java_Cron/ws/src/sdks/java/io/hadoop-common/build/test-results/test>
Generating HTML test report...
Finished generating test html results (0.001 secs) into: <https://builds.apache.org/job/beam_PreCommit_Java_Cron/ws/src/sdks/java/io/hadoop-common/build/reports/tests/test>
Packing task ':beam-sdks-java-io-hadoop-common:test'
:beam-sdks-java-io-hadoop-common:test (Thread[Task worker for ':' Thread 3,5,main]) completed.
Took 1.116 secs.
:beam-sdks-java-io-hadoop-common:validateShadedJarDoesntLeakNonOrgApacheBeamClasses (Thread[Task
worker for ':' Thread 3,5,main]) started.

> Task :beam-sdks-java-io-hadoop-common:validateShadedJarDoesntLeakNonOrgApacheBeamClasses
Caching disabled for task ':beam-sdks-java-io-hadoop-common:validateShadedJarDoesntLeakNonOrgApacheBeamClasses':
Caching has not been enabled for the task
Task ':beam-sdks-java-io-hadoop-common:validateShadedJarDoesntLeakNonOrgApacheBeamClasses'
is not up-to-date because:
  Task has not declared any outputs despite executing actions.
:beam-sdks-java-io-hadoop-common:validateShadedJarDoesntLeakNonOrgApacheBeamClasses (Thread[Task
worker for ':' Thread 3,5,main]) completed. Took 0.001 secs.
:beam-sdks-java-io-hadoop-common:check (Thread[Task worker for ':' Thread 3,5,main]) started.

> Task :beam-sdks-java-io-hadoop-common:check
Skipping task ':beam-sdks-java-io-hadoop-common:check' as it has no actions.
:beam-sdks-java-io-hadoop-common:check (Thread[Task worker for ':' Thread 3,5,main]) completed.
Took 0.0 secs.
:beam-sdks-java-io-hadoop-common:build (Thread[Task worker for ':' Thread 3,5,main]) started.

> Task :beam-sdks-java-io-hadoop-common:build
Skipping task ':beam-sdks-java-io-hadoop-common:build' as it has no actions.
:beam-sdks-java-io-hadoop-common:build (Thread[Task worker for ':' Thread 3,5,main]) completed.
Took 0.0 secs.
:beam-sdks-java-io-hadoop-common:buildDependents (Thread[Task worker for ':' Thread 7,5,main])
started.

> Task :beam-sdks-java-io-hadoop-common:buildDependents
Caching disabled for task ':beam-sdks-java-io-hadoop-common:buildDependents': Caching has
not been enabled for the task
Task ':beam-sdks-java-io-hadoop-common:buildDependents' is not up-to-date because:
  Task has not declared any outputs despite executing actions.
:beam-sdks-java-io-hadoop-common:buildDependents (Thread[Task worker for ':' Thread 7,5,main])
completed. Took 0.0 secs.
:beam-vendor-sdks-java-extensions-protobuf:jar (Thread[Task worker for ':' Thread 7,5,main])
started.

> Task :beam-vendor-sdks-java-extensions-protobuf:jar
Build cache key for task ':beam-vendor-sdks-java-extensions-protobuf:jar' is 318184f3acfe150a3a38d605826c992a
Caching disabled for task ':beam-vendor-sdks-java-extensions-protobuf:jar': Caching has not
been enabled for the task
Task ':beam-vendor-sdks-java-extensions-protobuf:jar' is not up-to-date because:
  No history is available.
:beam-vendor-sdks-java-extensions-protobuf:jar (Thread[Task worker for ':' Thread 7,5,main])
completed. Took 0.005 secs.
:beam-vendor-sdks-java-extensions-protobuf:compileTestJava (Thread[Task worker for ':' Thread
7,5,main]) started.

> Task :beam-vendor-sdks-java-extensions-protobuf:compileTestJava NO-SOURCE
file or directory '<https://builds.apache.org/job/beam_PreCommit_Java_Cron/ws/src/vendor/sdks-java-extensions-protobuf/src/test/java',>
not found
Skipping task ':beam-vendor-sdks-java-extensions-protobuf:compileTestJava' as it has no source
files and no previous output files.
:beam-vendor-sdks-java-extensions-protobuf:compileTestJava (Thread[Task worker for ':' Thread
7,5,main]) completed. Took 0.0 secs.
:beam-vendor-sdks-java-extensions-protobuf:processTestResources (Thread[Task worker for ':'
Thread 7,5,main]) started.

> Task :beam-vendor-sdks-java-extensions-protobuf:processTestResources NO-SOURCE
file or directory '<https://builds.apache.org/job/beam_PreCommit_Java_Cron/ws/src/vendor/sdks-java-extensions-protobuf/src/test/resources',>
not found
Skipping task ':beam-vendor-sdks-java-extensions-protobuf:processTestResources' as it has
no source files and no previous output files.
:beam-vendor-sdks-java-extensions-protobuf:processTestResources (Thread[Task worker for ':'
Thread 7,5,main]) completed. Took 0.0 secs.
:beam-vendor-sdks-java-extensions-protobuf:testClasses (Thread[Task worker for ':' Thread
7,5,main]) started.

> Task :beam-vendor-sdks-java-extensions-protobuf:testClasses UP-TO-DATE
Skipping task ':beam-vendor-sdks-java-extensions-protobuf:testClasses' as it has no actions.
:beam-vendor-sdks-java-extensions-protobuf:testClasses (Thread[Task worker for ':' Thread
7,5,main]) completed. Took 0.0 secs.
:beam-vendor-sdks-java-extensions-protobuf:packageTests (Thread[Task worker for ':' Thread
7,5,main]) started.

> Task :beam-vendor-sdks-java-extensions-protobuf:packageTests
Build cache key for task ':beam-vendor-sdks-java-extensions-protobuf:packageTests' is 725c57f0b1c0d6e4c572de9d9db06024
Caching disabled for task ':beam-vendor-sdks-java-extensions-protobuf:packageTests': Caching
has not been enabled for the task
Task ':beam-vendor-sdks-java-extensions-protobuf:packageTests' is not up-to-date because:
  No history is available.
:beam-vendor-sdks-java-extensions-protobuf:packageTests (Thread[Task worker for ':' Thread
7,5,main]) completed. Took 0.001 secs.
:beam-vendor-sdks-java-extensions-protobuf:assemble (Thread[Task worker for ':' Thread 7,5,main])
started.

> Task :beam-vendor-sdks-java-extensions-protobuf:assemble
Skipping task ':beam-vendor-sdks-java-extensions-protobuf:assemble' as it has no actions.
:beam-vendor-sdks-java-extensions-protobuf:assemble (Thread[Task worker for ':' Thread 7,5,main])
completed. Took 0.0 secs.
:beam-vendor-sdks-java-extensions-protobuf:checkstyleMain (Thread[Task worker for ':' Thread
7,5,main]) started.

> Task :beam-vendor-sdks-java-extensions-protobuf:checkstyleMain NO-SOURCE
file or directory '<https://builds.apache.org/job/beam_PreCommit_Java_Cron/ws/src/vendor/sdks-java-extensions-protobuf/src/main/java',>
not found
Skipping task ':beam-vendor-sdks-java-extensions-protobuf:checkstyleMain' as it has no source
files and no previous output files.
:beam-vendor-sdks-java-extensions-protobuf:checkstyleMain (Thread[Task worker for ':' Thread
7,5,main]) completed. Took 0.0 secs.
:beam-vendor-sdks-java-extensions-protobuf:checkstyleTest (Thread[Task worker for ':' Thread
7,5,main]) started.

> Task :beam-vendor-sdks-java-extensions-protobuf:checkstyleTest NO-SOURCE
file or directory '<https://builds.apache.org/job/beam_PreCommit_Java_Cron/ws/src/vendor/sdks-java-extensions-protobuf/src/test/java',>
not found
Skipping task ':beam-vendor-sdks-java-extensions-protobuf:checkstyleTest' as it has no source
files and no previous output files.
:beam-vendor-sdks-java-extensions-protobuf:checkstyleTest (Thread[Task worker for ':' Thread
7,5,main]) completed. Took 0.0 secs.
:beam-vendor-sdks-java-extensions-protobuf:findbugsMain (Thread[Task worker for ':' Thread
7,5,main]) started.
Initialized native services in: /home/jenkins/.gradle/native

> Task :beam-vendor-sdks-java-extensions-protobuf:findbugsMain
file or directory '<https://builds.apache.org/job/beam_PreCommit_Java_Cron/ws/src/vendor/sdks-java-extensions-protobuf/src/main/java',>
not found
Build cache key for task ':beam-vendor-sdks-java-extensions-protobuf:findbugsMain' is ae1f8c33ac530a0c11e08e5be4629417
Task ':beam-vendor-sdks-java-extensions-protobuf:findbugsMain' is not up-to-date because:
  No history is available.
file or directory '<https://builds.apache.org/job/beam_PreCommit_Java_Cron/ws/src/vendor/sdks-java-extensions-protobuf/src/main/java',>
not found
Starting process 'Gradle FindBugs Worker 136'. Working directory: <https://builds.apache.org/job/beam_PreCommit_Java_Cron/ws/src/vendor/sdks-java-extensions-protobuf>
Command: /usr/local/asfpackages/java/jdk1.8.0_172/bin/java -Djava.security.manager=worker.org.gradle.process.internal.worker.child.BootstrapSecurityManager
-Dfile.encoding=UTF-8 -Duser.country=US -Duser.language=en -Duser.variant -cp /home/jenkins/.gradle/caches/4.8/workerMain/gradle-worker.jar
worker.org.gradle.process.internal.worker.GradleWorkerMain 'Gradle FindBugs Worker 136'
Successfully started process 'Gradle FindBugs Worker 136'
Packing task ':beam-vendor-sdks-java-extensions-protobuf:findbugsMain'
:beam-vendor-sdks-java-extensions-protobuf:findbugsMain (Thread[Task worker for ':' Thread
7,5,main]) completed. Took 3.886 secs.
:beam-vendor-sdks-java-extensions-protobuf:spotlessJava (Thread[Task worker for ':' Thread
7,5,main]) started.

> Task :beam-vendor-sdks-java-extensions-protobuf:spotlessJava
file or directory '<https://builds.apache.org/job/beam_PreCommit_Java_Cron/ws/src/vendor/sdks-java-extensions-protobuf/src/main/java',>
not found
file or directory '<https://builds.apache.org/job/beam_PreCommit_Java_Cron/ws/src/vendor/sdks-java-extensions-protobuf/src/test/java',>
not found
file or directory '<https://builds.apache.org/job/beam_PreCommit_Java_Cron/ws/src/vendor/sdks-java-extensions-protobuf/src/main/java',>
not found
file or directory '<https://builds.apache.org/job/beam_PreCommit_Java_Cron/ws/src/vendor/sdks-java-extensions-protobuf/src/test/java',>
not found
file or directory '<https://builds.apache.org/job/beam_PreCommit_Java_Cron/ws/src/vendor/sdks-java-extensions-protobuf/src/main/java',>
not found
file or directory '<https://builds.apache.org/job/beam_PreCommit_Java_Cron/ws/src/vendor/sdks-java-extensions-protobuf/src/test/java',>
not found
Caching disabled for task ':beam-vendor-sdks-java-extensions-protobuf:spotlessJava': Caching
has not been enabled for the task
Task ':beam-vendor-sdks-java-extensions-protobuf:spotlessJava' is not up-to-date because:
  No history is available.
All input files are considered out-of-date for incremental task ':beam-vendor-sdks-java-extensions-protobuf:spotlessJava'.
file or directory '<https://builds.apache.org/job/beam_PreCommit_Java_Cron/ws/src/vendor/sdks-java-extensions-protobuf/src/main/java',>
not found
file or directory '<https://builds.apache.org/job/beam_PreCommit_Java_Cron/ws/src/vendor/sdks-java-extensions-protobuf/src/test/java',>
not found
:beam-vendor-sdks-java-extensions-protobuf:spotlessJava (Thread[Task worker for ':' Thread
7,5,main]) completed. Took 0.009 secs.
:beam-vendor-sdks-java-extensions-protobuf:spotlessJavaCheck (Thread[Task worker for ':' Thread
7,5,main]) started.

> Task :beam-vendor-sdks-java-extensions-protobuf:spotlessJavaCheck
Skipping task ':beam-vendor-sdks-java-extensions-protobuf:spotlessJavaCheck' as it has no
actions.
:beam-vendor-sdks-java-extensions-protobuf:spotlessJavaCheck (Thread[Task worker for ':' Thread
7,5,main]) completed. Took 0.0 secs.
:beam-vendor-sdks-java-extensions-protobuf:spotlessCheck (Thread[Task worker for ':' Thread
7,5,main]) started.

> Task :beam-vendor-sdks-java-extensions-protobuf:spotlessCheck
Skipping task ':beam-vendor-sdks-java-extensions-protobuf:spotlessCheck' as it has no actions.
:beam-vendor-sdks-java-extensions-protobuf:spotlessCheck (Thread[Task worker for ':' Thread
7,5,main]) completed. Took 0.0 secs.
:beam-vendor-sdks-java-extensions-protobuf:test (Thread[Task worker for ':' Thread 7,5,main])
started.

> Task :beam-vendor-sdks-java-extensions-protobuf:test NO-SOURCE
Skipping task ':beam-vendor-sdks-java-extensions-protobuf:test' as it has no source files
and no previous output files.
:beam-vendor-sdks-java-extensions-protobuf:test (Thread[Task worker for ':' Thread 7,5,main])
completed. Took 0.0 secs.
:beam-vendor-sdks-java-extensions-protobuf:validateShadedJarDoesntLeakNonOrgApacheBeamClasses
(Thread[Task worker for ':' Thread 7,5,main]) started.

> Task :beam-vendor-sdks-java-extensions-protobuf:validateShadedJarDoesntLeakNonOrgApacheBeamClasses
Caching disabled for task ':beam-vendor-sdks-java-extensions-protobuf:validateShadedJarDoesntLeakNonOrgApacheBeamClasses':
Caching has not been enabled for the task
Task ':beam-vendor-sdks-java-extensions-protobuf:validateShadedJarDoesntLeakNonOrgApacheBeamClasses'
is not up-to-date because:
  Task has not declared any outputs despite executing actions.
:beam-vendor-sdks-java-extensions-protobuf:validateShadedJarDoesntLeakNonOrgApacheBeamClasses
(Thread[Task worker for ':' Thread 7,5,main]) completed. Took 0.03 secs.
:beam-vendor-sdks-java-extensions-protobuf:check (Thread[Task worker for ':' Thread 7,5,main])
started.

> Task :beam-vendor-sdks-java-extensions-protobuf:check
Skipping task ':beam-vendor-sdks-java-extensions-protobuf:check' as it has no actions.
:beam-vendor-sdks-java-extensions-protobuf:check (Thread[Task worker for ':' Thread 7,5,main])
completed. Took 0.0 secs.
:beam-vendor-sdks-java-extensions-protobuf:build (Thread[Task worker for ':' Thread 7,5,main])
started.

> Task :beam-vendor-sdks-java-extensions-protobuf:build
Skipping task ':beam-vendor-sdks-java-extensions-protobuf:build' as it has no actions.
:beam-vendor-sdks-java-extensions-protobuf:build (Thread[Task worker for ':' Thread 7,5,main])
completed. Took 0.0 secs.
:beam-sdks-java-core:buildNeeded (Thread[Task worker for ':' Thread 7,5,main]) started.

> Task :beam-sdks-java-core:buildNeeded
Skipping task ':beam-sdks-java-core:buildNeeded' as it has no actions.
:beam-sdks-java-core:buildNeeded (Thread[Task worker for ':' Thread 7,5,main]) completed.
Took 0.0 secs.
:beam-sdks-java-extensions-sql-jdbc:shadowJarTest (Thread[Task worker for ':' Thread 7,5,main])
started.
Gradle Test Executor 137 started executing tests.

> Task :beam-sdks-java-extensions-sql-jdbc:shadowJarTest
Build cache key for task ':beam-sdks-java-extensions-sql-jdbc:shadowJarTest' is 769d52500ad00377e9678f16e4635d6f
Task ':beam-sdks-java-extensions-sql-jdbc:shadowJarTest' is not up-to-date because:
  Task.upToDateWhen is false.
Not loading task ':beam-sdks-java-extensions-sql-jdbc:shadowJarTest' from cache because loading
from cache is disabled for this task
Starting process 'Gradle Test Executor 137'. Working directory: <https://builds.apache.org/job/beam_PreCommit_Java_Cron/ws/src/sdks/java/extensions/sql/jdbc>
Command: /usr/local/asfpackages/java/jdk1.8.0_172/bin/java -Ddriver.jar=<https://builds.apache.org/job/beam_PreCommit_Java_Cron/ws/src/sdks/java/extensions/sql/jdbc/build/libs/beam-sdks-java-extensions-sql-jdbc-2.8.0-SNAPSHOT.jar>
-Djava.security.manager=worker.org.gradle.process.internal.worker.child.BootstrapSecurityManager
-Dorg.gradle.native=false -Dfile.encoding=UTF-8 -Duser.country=US -Duser.language=en -Duser.variant
-ea -cp /home/jenkins/.gradle/caches/4.8/workerMain/gradle-worker.jar worker.org.gradle.process.internal.worker.GradleWorkerMain
'Gradle Test Executor 137'
Successfully started process 'Gradle Test Executor 137'

org.apache.beam.sdk.extensions.sql.jdbc.JdbcJarTest > classLoader_readFile STANDARD_ERROR
    Sep 07, 2018 6:57:15 PM org.apache.beam.sdk.io.FileBasedSource getEstimatedSizeBytes
    INFO: Filepattern /tmp/junit2899779684461196859/junit7859567240868869472.tmp matched 1
files with total size 0
    Sep 07, 2018 6:57:15 PM org.apache.beam.sdk.io.FileBasedSource split
    INFO: Splitting filepattern /tmp/junit2899779684461196859/junit7859567240868869472.tmp
into bundles of size 0 took 1 ms and produced 1 files and 0 bundles

Gradle Test Executor 137 finished executing tests.

> Task :beam-sdks-java-extensions-sql-jdbc:shadowJarTest
Finished generating test XML results (0.0 secs) into: <https://builds.apache.org/job/beam_PreCommit_Java_Cron/ws/src/sdks/java/extensions/sql/jdbc/build/test-results/shadowJarTest>
Generating HTML test report...
Finished generating test html results (0.001 secs) into: <https://builds.apache.org/job/beam_PreCommit_Java_Cron/ws/src/sdks/java/extensions/sql/jdbc/build/reports/tests/shadowJarTest>
Packing task ':beam-sdks-java-extensions-sql-jdbc:shadowJarTest'
:beam-sdks-java-extensions-sql-jdbc:shadowJarTest (Thread[Task worker for ':' Thread 7,5,main])
completed. Took 6.882 secs.
:beam-sdks-java-extensions-sql-jdbc:preCommit (Thread[Task worker for ':' Thread 7,5,main])
started.

> Task :beam-sdks-java-extensions-sql-jdbc:preCommit
Skipping task ':beam-sdks-java-extensions-sql-jdbc:preCommit' as it has no actions.
:beam-sdks-java-extensions-sql-jdbc:preCommit (Thread[Task worker for ':' Thread 7,5,main])
completed. Took 0.0 secs.
:beam-sdks-java-javadoc:allJavadoc (Thread[Task worker for ':' Thread 7,5,main]) started.

> Task :beam-sdks-java-javadoc:allJavadoc
Skipping task ':beam-sdks-java-javadoc:allJavadoc' as it has no actions.
:beam-sdks-java-javadoc:allJavadoc (Thread[Task worker for ':' Thread 7,5,main]) completed.
Took 0.0 secs.

FAILURE: Build failed with an exception.

* What went wrong:
Execution failed for task ':beam-examples-java:test'.
> There were failing tests. See the report at: file://<https://builds.apache.org/job/beam_PreCommit_Java_Cron/ws/src/examples/java/build/reports/tests/test/index.html>

* Try:
Run with --stacktrace option to get the stack trace. Run with --debug option to get more log
output. Run with --scan to get full insights.

* Get more help at https://help.gradle.org

Deprecated Gradle features were used in this build, making it incompatible with Gradle 5.0.
See https://docs.gradle.org/4.8/userguide/command_line_interface.html#sec:command_line_warnings

BUILD FAILED in 57m 3s
807 actionable tasks: 802 executed, 5 from cache

Publishing build scan...
https://gradle.com/s/kelj63zr4pmvw

Build step 'Invoke Gradle script' changed build result to FAILURE
Build step 'Invoke Gradle script' marked build as failure

Mime
View raw message