beam-commits mailing list archives

Site index · List index
Message view « Date » · « Thread »
Top « Date » · « Thread »
From Apache Jenkins Server <jenk...@builds.apache.org>
Subject Build failed in Jenkins: beam_PostCommit_Website_Publish #9
Date Thu, 27 Sep 2018 03:41:27 GMT
See <https://builds.apache.org/job/beam_PostCommit_Website_Publish/9/display/redirect?page=changes>

Changes:

[github] Fix sliding time windows example documentation

[github] Update session windows Python to match description

[github] Trigger pre-commit checks

[github] Undo changes to website programming guide :rewind:

[valentyn] Fix futurize-based checker in py27-lint3 compatibility tox test suite.

[ehudm] Pass --pubsubRooturl option to Dataflow runner.

[ankurgoenka] Add PortablePipelineOption for environment

[ankurgoenka] Lazy initializing JobBundleFactory supporting multiple type of

[amyrvold] Website publiish task and Jenkins job

[yifanzou] [BEAM-5339] Modify the dependency tool based on new JIRA policy.

[ankurgoenka] Adding environment to python portable options

[ankurgoenka] Go Changes for using configurable environment. Only docker is supported

------------------------------------------
[...truncated 9.79 KB...]
:buildSrc:spotlessGroovyCheck (Thread[Task worker for ':buildSrc' Thread 2,5,main]) started.

> Task :buildSrc:spotlessGroovyCheck
Skipping task ':buildSrc:spotlessGroovyCheck' as it has no actions.
:buildSrc:spotlessGroovyCheck (Thread[Task worker for ':buildSrc' Thread 2,5,main]) completed.
Took 0.0 secs.
:buildSrc:spotlessGroovyGradle (Thread[Task worker for ':buildSrc' Thread 2,5,main]) started.

> Task :buildSrc:spotlessGroovyGradle
Caching disabled for task ':buildSrc:spotlessGroovyGradle': Caching has not been enabled for
the task
Task ':buildSrc:spotlessGroovyGradle' is not up-to-date because:
  No history is available.
All input files are considered out-of-date for incremental task ':buildSrc:spotlessGroovyGradle'.
:buildSrc:spotlessGroovyGradle (Thread[Task worker for ':buildSrc' Thread 2,5,main]) completed.
Took 0.027 secs.
:buildSrc:spotlessGroovyGradleCheck (Thread[Task worker for ':buildSrc' Thread 2,5,main])
started.

> Task :buildSrc:spotlessGroovyGradleCheck
Skipping task ':buildSrc:spotlessGroovyGradleCheck' as it has no actions.
:buildSrc:spotlessGroovyGradleCheck (Thread[Task worker for ':buildSrc' Thread 2,5,main])
completed. Took 0.0 secs.
:buildSrc:spotlessCheck (Thread[Task worker for ':buildSrc' Thread 6,5,main]) started.

> Task :buildSrc:spotlessCheck
Skipping task ':buildSrc:spotlessCheck' as it has no actions.
:buildSrc:spotlessCheck (Thread[Task worker for ':buildSrc' Thread 6,5,main]) completed. Took
0.001 secs.
:buildSrc:compileTestJava (Thread[Task worker for ':buildSrc' Thread 6,5,main]) started.

> Task :buildSrc:compileTestJava NO-SOURCE
file or directory '<https://builds.apache.org/job/beam_PostCommit_Website_Publish/ws/src/buildSrc/src/test/java',>
not found
Skipping task ':buildSrc:compileTestJava' as it has no source files and no previous output
files.
:buildSrc:compileTestJava (Thread[Task worker for ':buildSrc' Thread 6,5,main]) completed.
Took 0.002 secs.
:buildSrc:compileTestGroovy (Thread[Task worker for ':buildSrc' Thread 6,5,main]) started.

> Task :buildSrc:compileTestGroovy NO-SOURCE
file or directory '<https://builds.apache.org/job/beam_PostCommit_Website_Publish/ws/src/buildSrc/src/test/groovy',>
not found
Skipping task ':buildSrc:compileTestGroovy' as it has no source files and no previous output
files.
:buildSrc:compileTestGroovy (Thread[Task worker for ':buildSrc' Thread 6,5,main]) completed.
Took 0.003 secs.
:buildSrc:processTestResources (Thread[Task worker for ':buildSrc' Thread 5,5,main]) started.

> Task :buildSrc:processTestResources NO-SOURCE
file or directory '<https://builds.apache.org/job/beam_PostCommit_Website_Publish/ws/src/buildSrc/src/test/resources',>
not found
Skipping task ':buildSrc:processTestResources' as it has no source files and no previous output
files.
:buildSrc:processTestResources (Thread[Task worker for ':buildSrc' Thread 5,5,main]) completed.
Took 0.001 secs.
:buildSrc:testClasses (Thread[Task worker for ':buildSrc' Thread 5,5,main]) started.

> Task :buildSrc:testClasses UP-TO-DATE
Skipping task ':buildSrc:testClasses' as it has no actions.
:buildSrc:testClasses (Thread[Task worker for ':buildSrc' Thread 5,5,main]) completed. Took
0.0 secs.
:buildSrc:test (Thread[Task worker for ':buildSrc' Thread 5,5,main]) started.

> Task :buildSrc:test NO-SOURCE
Skipping task ':buildSrc:test' as it has no source files and no previous output files.
:buildSrc:test (Thread[Task worker for ':buildSrc' Thread 5,5,main]) completed. Took 0.003
secs.
:buildSrc:check (Thread[Task worker for ':buildSrc' Thread 5,5,main]) started.

> Task :buildSrc:check
Skipping task ':buildSrc:check' as it has no actions.
:buildSrc:check (Thread[Task worker for ':buildSrc' Thread 5,5,main]) completed. Took 0.0
secs.
:buildSrc:build (Thread[Task worker for ':buildSrc' Thread 10,5,main]) started.

> Task :buildSrc:build
Skipping task ':buildSrc:build' as it has no actions.
:buildSrc:build (Thread[Task worker for ':buildSrc' Thread 10,5,main]) completed. Took 0.0
secs.
Build cache (/home/jenkins/.gradle/caches/build-cache-1) removing files not accessed on or
after Thu Sep 20 03:39:34 UTC 2018.
Build cache (/home/jenkins/.gradle/caches/build-cache-1) cleaned up in 0.003 secs.
Settings evaluated using settings file '<https://builds.apache.org/job/beam_PostCommit_Website_Publish/ws/src/settings.gradle'.>
Using local directory build cache for the root build (location = /home/jenkins/.gradle/caches/build-cache-1,
removeUnusedEntriesAfter = 7 days).
Projects loaded. Root project using build file '<https://builds.apache.org/job/beam_PostCommit_Website_Publish/ws/src/build.gradle'.>
Included projects: [root project 'beam', project ':beam-examples-java', project ':beam-model-fn-execution',
project ':beam-model-job-management', project ':beam-model-pipeline', project ':beam-runners-apex',
project ':beam-runners-core-construction-java', project ':beam-runners-core-java', project
':beam-runners-direct-java', project ':beam-runners-extensions-java-metrics', project ':beam-runners-flink_2.11',
project ':beam-runners-flink_2.11-job-server', project ':beam-runners-flink_2.11-job-server-container',
project ':beam-runners-gearpump', project ':beam-runners-google-cloud-dataflow-java', project
':beam-runners-google-cloud-dataflow-java-examples', project ':beam-runners-google-cloud-dataflow-java-examples-streaming',
project ':beam-runners-java-fn-execution', project ':beam-runners-local-java-core', project
':beam-runners-reference-java', project ':beam-runners-samza', project ':beam-runners-spark',
project ':beam-sdks-go', project ':beam-sdks-go-container', project ':beam-sdks-go-examples',
project ':beam-sdks-go-test', project ':beam-sdks-java-build-tools', project ':beam-sdks-java-container',
project ':beam-sdks-java-core', project ':beam-sdks-java-extensions-google-cloud-platform-core',
project ':beam-sdks-java-extensions-join-library', project ':beam-sdks-java-extensions-json-jackson',
project ':beam-sdks-java-extensions-protobuf', project ':beam-sdks-java-extensions-sketching',
project ':beam-sdks-java-extensions-sorter', project ':beam-sdks-java-extensions-sql', project
':beam-sdks-java-extensions-sql-jdbc', project ':beam-sdks-java-extensions-sql-shell', project
':beam-sdks-java-fn-execution', project ':beam-sdks-java-harness', project ':beam-sdks-java-io-amazon-web-services',
project ':beam-sdks-java-io-amqp', project ':beam-sdks-java-io-cassandra', project ':beam-sdks-java-io-common',
project ':beam-sdks-java-io-elasticsearch', project ':beam-sdks-java-io-elasticsearch-tests-2',
project ':beam-sdks-java-io-elasticsearch-tests-5', project ':beam-sdks-java-io-elasticsearch-tests-6',
project ':beam-sdks-java-io-elasticsearch-tests-common', project ':beam-sdks-java-io-file-based-io-tests',
project ':beam-sdks-java-io-google-cloud-platform', project ':beam-sdks-java-io-hadoop-common',
project ':beam-sdks-java-io-hadoop-file-system', project ':beam-sdks-java-io-hadoop-input-format',
project ':beam-sdks-java-io-hbase', project ':beam-sdks-java-io-hcatalog', project ':beam-sdks-java-io-jdbc',
project ':beam-sdks-java-io-jms', project ':beam-sdks-java-io-kafka', project ':beam-sdks-java-io-kinesis',
project ':beam-sdks-java-io-kudu', project ':beam-sdks-java-io-mongodb', project ':beam-sdks-java-io-mqtt',
project ':beam-sdks-java-io-parquet', project ':beam-sdks-java-io-redis', project ':beam-sdks-java-io-solr',
project ':beam-sdks-java-io-synthetic', project ':beam-sdks-java-io-tika', project ':beam-sdks-java-io-xml',
project ':beam-sdks-java-javadoc', project ':beam-sdks-java-maven-archetypes-examples', project
':beam-sdks-java-maven-archetypes-starter', project ':beam-sdks-java-nexmark', project ':beam-sdks-python',
project ':beam-sdks-python-container', project ':beam-vendor-sdks-java-extensions-protobuf',
project ':beam-website', project ':release']
Parallel execution with configuration on demand is an incubating feature.

> Configure project :
Evaluating root project 'beam' using build file '<https://builds.apache.org/job/beam_PostCommit_Website_Publish/ws/src/build.gradle'.>

> Configure project :beam-website
Evaluating project ':beam-website' using build file '<https://builds.apache.org/job/beam_PostCommit_Website_Publish/ws/src/website/build.gradle'.>
Compiling build file '<https://builds.apache.org/job/beam_PostCommit_Website_Publish/ws/src/website/build.gradle'>
using SubsetScriptTransformer.
Compiling build file '<https://builds.apache.org/job/beam_PostCommit_Website_Publish/ws/src/website/build.gradle'>
using BuildScriptTransformer.
Selected primary task ':beam-website:clean' from project :beam-website
Selected primary task ':beam-website:publishWebsite' from project :beam-website
All projects evaluated.
Tasks to be executed: [task ':beam-website:cleanWebsite', task ':beam-website:clean', task
':beam-website:setupBuildDir', task ':beam-website:buildDockerImage', task ':beam-website:createDockerContainer',
task ':beam-website:startDockerContainer', task ':beam-website:buildWebsite', task ':beam-website:testWebsite',
task ':beam-website:stopAndRemoveDockerContainer', task ':beam-website:commitWebsite', task
':beam-website:publishWebsite']
VisTEG: Dependency graph written into <https://builds.apache.org/job/beam_PostCommit_Website_Publish/ws/src/build/reports/visteg.dot>
:beam-website:cleanWebsite (Thread[Task worker for ':',5,main]) started.

> Task :beam-website:cleanWebsite UP-TO-DATE
Caching disabled for task ':beam-website:cleanWebsite': Caching has not been enabled for the
task
Task ':beam-website:cleanWebsite' is not up-to-date because:
  Task has not declared any outputs despite executing actions.
:beam-website:cleanWebsite (Thread[Task worker for ':',5,main]) completed. Took 0.025 secs.
:beam-website:clean (Thread[Task worker for ':',5,main]) started.

> Task :beam-website:clean UP-TO-DATE
Caching disabled for task ':beam-website:clean': Caching has not been enabled for the task
Task ':beam-website:clean' is not up-to-date because:
  Task has not declared any outputs despite executing actions.
:beam-website:clean (Thread[Task worker for ':',5,main]) completed. Took 0.002 secs.
:beam-website:setupBuildDir (Thread[Task worker for ':',5,main]) started.

> Task :beam-website:setupBuildDir
Build cache key for task ':beam-website:setupBuildDir' is 8760e785abdf8eb9f44945c1f1684be9
Caching disabled for task ':beam-website:setupBuildDir': Caching has not been enabled for
the task
Task ':beam-website:setupBuildDir' is not up-to-date because:
  No history is available.
:beam-website:setupBuildDir (Thread[Task worker for ':',5,main]) completed. Took 0.029 secs.
:beam-website:buildDockerImage (Thread[Task worker for ':',5,main]) started.

> Task :beam-website:buildDockerImage
Caching disabled for task ':beam-website:buildDockerImage': Caching has not been enabled for
the task
Task ':beam-website:buildDockerImage' is not up-to-date because:
  Task has not declared any outputs despite executing actions.
Starting process 'command 'docker''. Working directory: <https://builds.apache.org/job/beam_PostCommit_Website_Publish/ws/src/website>
Command: docker build -t beam-website .
Successfully started process 'command 'docker''
Sending build context to Docker daemon  26.03MB
Step 1/7 : FROM ruby:2.5
2.5: Pulling from library/ruby
Digest: sha256:71386614aeca6de4384cbfab2a746d22562f4fda382a8361dc6979a221401743
Status: Downloaded newer image for ruby:2.5
 ---> eb8759981348
Step 2/7 : WORKDIR /ruby
 ---> Using cache
 ---> 44f0e303b1e6
Step 3/7 : RUN gem install bundler
 ---> Using cache
 ---> 1928bf9f4de4
Step 4/7 : ADD Gemfile Gemfile.lock /ruby/
 ---> Using cache
 ---> 56ebe473df83
Step 5/7 : RUN bundle install --deployment --path $GEM_HOME
 ---> Using cache
 ---> 3d7fe77cf486
Step 6/7 : ENV LC_ALL C.UTF-8
 ---> Using cache
 ---> 41be30f524a4
Step 7/7 : CMD sleep 3600
 ---> Using cache
 ---> cf383bcbe69e
Successfully built cf383bcbe69e
Successfully tagged beam-website:latest
:beam-website:buildDockerImage (Thread[Task worker for ':',5,main]) completed. Took 2.641
secs.
:beam-website:createDockerContainer (Thread[Task worker for ':',5,main]) started.

> Task :beam-website:createDockerContainer
Caching disabled for task ':beam-website:createDockerContainer': Caching has not been enabled
for the task
Task ':beam-website:createDockerContainer' is not up-to-date because:
  Task has not declared any outputs despite executing actions.
Starting process 'command '/bin/bash''. Working directory: <https://builds.apache.org/job/beam_PostCommit_Website_Publish/ws/src/website>
Command: /bin/bash -c docker create -v <https://builds.apache.org/job/beam_PostCommit_Website_Publish/ws/src>:/repo
-u $(id -u):$(id -g) beam-website
Successfully started process 'command '/bin/bash''
:beam-website:createDockerContainer (Thread[Task worker for ':',5,main]) completed. Took 0.142
secs.
:beam-website:startDockerContainer (Thread[Task worker for ':',5,main]) started.

> Task :beam-website:startDockerContainer
Caching disabled for task ':beam-website:startDockerContainer': Caching has not been enabled
for the task
Task ':beam-website:startDockerContainer' is not up-to-date because:
  Task has not declared any outputs despite executing actions.
Starting process 'command 'docker''. Working directory: <https://builds.apache.org/job/beam_PostCommit_Website_Publish/ws/src/website>
Command: docker start b93d13de8eaed812d8d7590b7367412a1ef3c30472389962e30a69b9a0727656
Successfully started process 'command 'docker''
b93d13de8eaed812d8d7590b7367412a1ef3c30472389962e30a69b9a0727656
:beam-website:startDockerContainer (Thread[Task worker for ':',5,main]) completed. Took 0.418
secs.
:beam-website:buildWebsite (Thread[Task worker for ':',5,main]) started.

> Task :beam-website:buildWebsite
Build cache key for task ':beam-website:buildWebsite' is 4800966d83237dc231e50c5c1672e46f
Caching disabled for task ':beam-website:buildWebsite': Caching has not been enabled for the
task
Task ':beam-website:buildWebsite' is not up-to-date because:
  No history is available.
Starting process 'command 'docker''. Working directory: <https://builds.apache.org/job/beam_PostCommit_Website_Publish/ws/src/website>
Command: docker exec b93d13de8eaed812d8d7590b7367412a1ef3c30472389962e30a69b9a0727656 /bin/bash
-c cd /repo/build/website &&       bundle exec jekyll build       --config /repo/website/_config.yml
      --incremental       --source /repo/website/src
      
Successfully started process 'command 'docker''
`/` is not writable.
Bundler will use `/tmp/bundler/home/unknown' as your home directory temporarily.
Configuration file: /repo/website/_config.yml
            Source: /repo/website/src
       Destination: generated-content
 Incremental build: enabled
      Generating... 
                    done in 11.93 seconds.
 Auto-regeneration: disabled. Use --watch to enable.
:beam-website:buildWebsite (Thread[Task worker for ':',5,main]) completed. Took 18.375 secs.
:beam-website:testWebsite (Thread[Task worker for ':',5,main]) started.

> Task :beam-website:testWebsite
Caching disabled for task ':beam-website:testWebsite': Caching has not been enabled for the
task
Task ':beam-website:testWebsite' is not up-to-date because:
  Task has not declared any outputs despite executing actions.
Starting process 'command 'docker''. Working directory: <https://builds.apache.org/job/beam_PostCommit_Website_Publish/ws/src/website>
Command: docker exec b93d13de8eaed812d8d7590b7367412a1ef3c30472389962e30a69b9a0727656 /bin/bash
-c cd /repo/build/website &&       bundle exec rake test
Successfully started process 'command 'docker''
`/` is not writable.
Bundler will use `/tmp/bundler/home/unknown' as your home directory temporarily.
Running ["ScriptCheck", "LinkCheck", "HtmlCheck", "ImageCheck"] on ["./generated-content"]
on *.html... 


Checking 651 external links...
Ran on 157 files!


- ./generated-content/blog/2017/02/01/graduation-media-recap.html
  *  External link https://globenewswire.com/news-release/2017/01/10/904692/0/en/The-Apache-Software-Foundation-Announces-Apache-Beam-as-a-Top-Level-Project.html
failed: response code 0 means something's wrong.
             It's possible libcurl couldn't connect to the server or perhaps the request timed
out.
             Sometimes, making too many requests at once also breaks things.
             Either way, the return message (if any) from the server is: Peer certificate
cannot be authenticated with given CA certificates
- ./generated-content/documentation/sdks/java/nexmark/index.html
  *  External link http://datalab.cs.pdx.edu/niagaraST/NEXMark/ failed: got a time out (response
code 0)
rake aborted!
HTML-Proofer found 2 failures!
/usr/local/bundle/ruby/2.5.0/gems/html-proofer-3.8.0/lib/html-proofer/runner.rb:167:in `print_failed_tests'
/usr/local/bundle/ruby/2.5.0/gems/html-proofer-3.8.0/lib/html-proofer/runner.rb:48:in `run'
/repo/build/website/Rakefile:23:in `block in <top (required)>'
/usr/local/bundle/ruby/2.5.0/gems/rake-12.3.0/exe/rake:27:in `<top (required)>'
/usr/local/bundle/bin/bundle:23:in `load'
/usr/local/bundle/bin/bundle:23:in `<main>'
Tasks: TOP => test
(See full trace by running task with --trace)

> Task :beam-website:testWebsite FAILED
:beam-website:testWebsite (Thread[Task worker for ':',5,main]) completed. Took 1 mins 20.994
secs.
:beam-website:stopAndRemoveDockerContainer (Thread[Task worker for ':',5,main]) started.

> Task :beam-website:stopAndRemoveDockerContainer
Caching disabled for task ':beam-website:stopAndRemoveDockerContainer': Caching has not been
enabled for the task
Task ':beam-website:stopAndRemoveDockerContainer' is not up-to-date because:
  Task has not declared any outputs despite executing actions.
Starting process 'command 'docker''. Working directory: <https://builds.apache.org/job/beam_PostCommit_Website_Publish/ws/src/website>
Command: docker rm -f b93d13de8eaed812d8d7590b7367412a1ef3c30472389962e30a69b9a0727656
Successfully started process 'command 'docker''
b93d13de8eaed812d8d7590b7367412a1ef3c30472389962e30a69b9a0727656
:beam-website:stopAndRemoveDockerContainer (Thread[Task worker for ':',5,main]) completed.
Took 0.342 secs.

FAILURE: Build failed with an exception.

* What went wrong:
Execution failed for task ':beam-website:testWebsite'.
> Process 'command 'docker'' finished with non-zero exit value 1

* Try:
Run with --stacktrace option to get the stack trace. Run with --debug option to get more log
output. Run with --scan to get full insights.

* Get more help at https://help.gradle.org

Deprecated Gradle features were used in this build, making it incompatible with Gradle 5.0.
Use '--warning-mode all' to show the individual deprecation warnings.
See https://docs.gradle.org/4.10.2/userguide/command_line_interface.html#sec:command_line_warnings

BUILD FAILED in 2m 1s
9 actionable tasks: 7 executed, 2 up-to-date

Publishing build scan...
https://gradle.com/s/skubg4vmiejxs

Closing Git repo: <https://builds.apache.org/job/beam_PostCommit_Website_Publish/ws/src/.git>
Build step 'Invoke Gradle script' changed build result to FAILURE
Build step 'Invoke Gradle script' marked build as failure

Mime
View raw message