beam-commits mailing list archives

Site index · List index
Message view « Date » · « Thread »
Top « Date » · « Thread »
From Apache Jenkins Server <jenk...@builds.apache.org>
Subject Build failed in Jenkins: beam_PostCommit_Python_PortableValidatesRunner_Flink_Gradle #20
Date Tue, 04 Sep 2018 18:39:34 GMT
See <https://builds.apache.org/job/beam_PostCommit_Python_PortableValidatesRunner_Flink_Gradle/20/display/redirect?page=changes>

Changes:

[mxm] [BEAM-5250] Fix GlobalWindow's max timestamp in Python SDK

------------------------------------------
[...truncated 139.88 KB...]
Skip updating github.com/davecgh/go-spew#87df7c60d5820d0f8ae11afede5aa52325c09717 in /home/jenkins/.gradle/go/repo/github.com/davecgh/go-spew/dc7a7e75773510b5a0d478397f61513b.
Skip updating github.com/coreos/etcd#11214aa33bf5a47d3d9d8dafe0f6b97237dfe921 in /home/jenkins/.gradle/go/repo/github.com/coreos/etcd/e07ad470c42c48737a8fdaa60abf6316.
Skip updating github.com/coreos/etcd#11214aa33bf5a47d3d9d8dafe0f6b97237dfe921 in /home/jenkins/.gradle/go/repo/github.com/coreos/etcd/e07ad470c42c48737a8fdaa60abf6316.
Skip updating github.com/eapache/go-resiliency#ef9aaa7ea8bd2448429af1a77cf41b2b3b34bdd6 in
/home/jenkins/.gradle/go/repo/github.com/eapache/go-resiliency/cc8793056d7f271a549d69e70047ea4a.
Skip updating github.com/eapache/go-xerial-snappy#bb955e01b9346ac19dc29eb16586c90ded99a98c
in /home/jenkins/.gradle/go/repo/github.com/eapache/go-xerial-snappy/f52f47f5cb2601626dc0aa72fc11554a.
Skip updating github.com/eapache/queue#44cc805cf13205b55f69e14bcb69867d1ae92f98 in /home/jenkins/.gradle/go/repo/github.com/eapache/queue/ce6b67da091d976a2973a2423a8383c8.
Skip updating github.com/fsnotify/fsnotify#c2828203cd70a50dcccfb2761f8b1f8ceef9a8e9 in /home/jenkins/.gradle/go/repo/github.com/fsnotify/fsnotify/19efc65ffbc0ec17575ab18d504e8c91.
Skip updating github.com/coreos/etcd#11214aa33bf5a47d3d9d8dafe0f6b97237dfe921 in /home/jenkins/.gradle/go/repo/github.com/coreos/etcd/e07ad470c42c48737a8fdaa60abf6316.
Skip updating github.com/coreos/etcd#11214aa33bf5a47d3d9d8dafe0f6b97237dfe921 in /home/jenkins/.gradle/go/repo/github.com/coreos/etcd/e07ad470c42c48737a8fdaa60abf6316.
Skip updating github.com/golang/glog#23def4e6c14b4da8ac2ed8007337bc5eb5007998 in /home/jenkins/.gradle/go/repo/github.com/golang/glog/c359ae0c52cbded42897d83346c85981.
Skip updating github.com/coreos/etcd#11214aa33bf5a47d3d9d8dafe0f6b97237dfe921 in /home/jenkins/.gradle/go/repo/github.com/coreos/etcd/e07ad470c42c48737a8fdaa60abf6316.
Skip updating github.com/golang/mock#b3e60bcdc577185fce3cf625fc96b62857ce5574 in /home/jenkins/.gradle/go/repo/github.com/golang/mock/a5aba77edff874e2e3d9ad331994556c.
Skip updating github.com/golang/protobuf#3a3da3a4e26776cc22a79ef46d5d58477532dede in /home/jenkins/.gradle/go/repo/github.com/golang/protobuf/76cd502133aa2c5520c2b3e1debe630b.
Skip updating github.com/golang/snappy#553a641470496b2327abcac10b36396bd98e45c9 in /home/jenkins/.gradle/go/repo/github.com/golang/snappy/96c568bbd0eca3e3f6a41e15a438261a.
Skip updating github.com/coreos/etcd#11214aa33bf5a47d3d9d8dafe0f6b97237dfe921 in /home/jenkins/.gradle/go/repo/github.com/coreos/etcd/e07ad470c42c48737a8fdaa60abf6316.
Skip updating github.com/google/go-cmp#3af367b6b30c263d47e8895973edcca9a49cf029 in /home/jenkins/.gradle/go/repo/github.com/google/go-cmp/0e30ce638fec37a4c0a4040d380290b4.
Skip updating github.com/google/pprof#a8f279b7952b27edbcb72e5a6c69ee9be4c8ad93 in /home/jenkins/.gradle/go/repo/github.com/google/pprof/580224cd7b76319263fe32ca011a0650.
Skip updating github.com/googleapis/gax-go#317e0006254c44a0ac427cc52a0e083ff0b9622f in /home/jenkins/.gradle/go/repo/github.com/googleapis/gax-go/cfbdb0eaeda3f1ea6b48e4ebedd6b7ac.
Skip updating github.com/coreos/etcd#11214aa33bf5a47d3d9d8dafe0f6b97237dfe921 in /home/jenkins/.gradle/go/repo/github.com/coreos/etcd/e07ad470c42c48737a8fdaa60abf6316.
Skip updating github.com/coreos/etcd#11214aa33bf5a47d3d9d8dafe0f6b97237dfe921 in /home/jenkins/.gradle/go/repo/github.com/coreos/etcd/e07ad470c42c48737a8fdaa60abf6316.
Skip updating github.com/coreos/etcd#11214aa33bf5a47d3d9d8dafe0f6b97237dfe921 in /home/jenkins/.gradle/go/repo/github.com/coreos/etcd/e07ad470c42c48737a8fdaa60abf6316.
Skip updating github.com/hashicorp/hcl#23c074d0eceb2b8a5bfdbb271ab780cde70f05a8 in /home/jenkins/.gradle/go/repo/github.com/hashicorp/hcl/37e0bb8b36d14da77f9f8c5babf91e48.
Skip updating github.com/ianlancetaylor/demangle#4883227f66371e02c4948937d3e2be1664d9be38
in /home/jenkins/.gradle/go/repo/github.com/ianlancetaylor/demangle/da9250878eadca7fe1a997f2c1e465b3.
Skip updating github.com/coreos/etcd#11214aa33bf5a47d3d9d8dafe0f6b97237dfe921 in /home/jenkins/.gradle/go/repo/github.com/coreos/etcd/e07ad470c42c48737a8fdaa60abf6316.
Skip updating github.com/coreos/etcd#11214aa33bf5a47d3d9d8dafe0f6b97237dfe921 in /home/jenkins/.gradle/go/repo/github.com/coreos/etcd/e07ad470c42c48737a8fdaa60abf6316.
Skip updating github.com/kr/fs#2788f0dbd16903de03cb8186e5c7d97b69ad387b in /home/jenkins/.gradle/go/repo/github.com/kr/fs/ef69c46d4366e9d326896066a4b027d4.
Skip updating github.com/coreos/etcd#11214aa33bf5a47d3d9d8dafe0f6b97237dfe921 in /home/jenkins/.gradle/go/repo/github.com/coreos/etcd/e07ad470c42c48737a8fdaa60abf6316.
Skip updating github.com/magiconair/properties#49d762b9817ba1c2e9d0c69183c2b4a8b8f1d934 in
/home/jenkins/.gradle/go/repo/github.com/magiconair/properties/34883f6c3f37cca1c4582d137f9fc020.
Skip updating github.com/coreos/etcd#11214aa33bf5a47d3d9d8dafe0f6b97237dfe921 in /home/jenkins/.gradle/go/repo/github.com/coreos/etcd/e07ad470c42c48737a8fdaa60abf6316.
Skip updating github.com/coreos/etcd#11214aa33bf5a47d3d9d8dafe0f6b97237dfe921 in /home/jenkins/.gradle/go/repo/github.com/coreos/etcd/e07ad470c42c48737a8fdaa60abf6316.
Skip updating github.com/mitchellh/go-homedir#b8bc1bf767474819792c23f32d8286a45736f1c6 in
/home/jenkins/.gradle/go/repo/github.com/mitchellh/go-homedir/11e21d791561444efcbd8f83f3617926.
Skip updating github.com/mitchellh/mapstructure#a4e142e9c047c904fa2f1e144d9a84e6133024bc in
/home/jenkins/.gradle/go/repo/github.com/mitchellh/mapstructure/8f497225aea52894fde79ad66bc0eb05.
Skip updating github.com/coreos/etcd#11214aa33bf5a47d3d9d8dafe0f6b97237dfe921 in /home/jenkins/.gradle/go/repo/github.com/coreos/etcd/e07ad470c42c48737a8fdaa60abf6316.
Skip updating github.com/openzipkin/zipkin-go#3741243b287094fda649c7f0fa74bd51f37dc122 in
/home/jenkins/.gradle/go/repo/github.com/openzipkin/zipkin-go/e53ea28b1632f7d2624f50816a45fa4e.
Skip updating github.com/pelletier/go-toml#acdc4509485b587f5e675510c4f2c63e90ff68a8 in /home/jenkins/.gradle/go/repo/github.com/pelletier/go-toml/fcb4bcb69fca9eab0a7b3cb341106167.
Skip updating github.com/coreos/etcd#11214aa33bf5a47d3d9d8dafe0f6b97237dfe921 in /home/jenkins/.gradle/go/repo/github.com/coreos/etcd/e07ad470c42c48737a8fdaa60abf6316.
Skip updating github.com/pierrec/lz4#ed8d4cc3b461464e69798080a0092bd028910298 in /home/jenkins/.gradle/go/repo/github.com/pierrec/lz4/83deb6b4d9e1d60342f2e0141ef3372c.
Skip updating github.com/pierrec/xxHash#a0006b13c722f7f12368c00a3d3c2ae8a999a0c6 in /home/jenkins/.gradle/go/repo/github.com/pierrec/xxHash/0aff276981c744f632693880472ff35f.
Skip updating github.com/pkg/errors#30136e27e2ac8d167177e8a583aa4c3fea5be833 in /home/jenkins/.gradle/go/repo/github.com/pkg/errors/2e4e7e2f9086007efa2e7bd2b4aac96d.
Skip updating github.com/pkg/sftp#22e9c1ccc02fc1b9fa3264572e49109b68a86947 in /home/jenkins/.gradle/go/repo/github.com/pkg/sftp/a97d32b473b1b771dd73590d425c6efa.
Skip updating github.com/prometheus/client_golang#9bb6ab929dcbe1c8393cd9ef70387cb69811bd1c
in /home/jenkins/.gradle/go/repo/github.com/prometheus/client_golang/e47e9fc2682ee532aab4f916e0ba7067.
Skip updating github.com/coreos/etcd#11214aa33bf5a47d3d9d8dafe0f6b97237dfe921 in /home/jenkins/.gradle/go/repo/github.com/coreos/etcd/e07ad470c42c48737a8fdaa60abf6316.
Skip updating github.com/coreos/etcd#11214aa33bf5a47d3d9d8dafe0f6b97237dfe921 in /home/jenkins/.gradle/go/repo/github.com/coreos/etcd/e07ad470c42c48737a8fdaa60abf6316.
Skip updating github.com/prometheus/procfs#cb4147076ac75738c9a7d279075a253c0cc5acbd in /home/jenkins/.gradle/go/repo/github.com/prometheus/procfs/520728c921fed5d680688350f35d5741.
Skip updating github.com/rcrowley/go-metrics#8732c616f52954686704c8645fe1a9d59e9df7c1 in /home/jenkins/.gradle/go/repo/github.com/rcrowley/go-metrics/f0d8dabece2ef254f6ec08366c62d08e.
Skip updating github.com/cpuguy83/go-md2man#dc9f53734905c233adfc09fd4f063dce63ce3daf in /home/jenkins/.gradle/go/repo/github.com/cpuguy83/go-md2man/12e5b04f5fe32bdd05573f005036f2c6.
Skip updating github.com/cpuguy83/go-md2man#dc9f53734905c233adfc09fd4f063dce63ce3daf in /home/jenkins/.gradle/go/repo/github.com/cpuguy83/go-md2man/12e5b04f5fe32bdd05573f005036f2c6.
Skip updating github.com/coreos/etcd#11214aa33bf5a47d3d9d8dafe0f6b97237dfe921 in /home/jenkins/.gradle/go/repo/github.com/coreos/etcd/e07ad470c42c48737a8fdaa60abf6316.
Skip updating github.com/coreos/etcd#11214aa33bf5a47d3d9d8dafe0f6b97237dfe921 in /home/jenkins/.gradle/go/repo/github.com/coreos/etcd/e07ad470c42c48737a8fdaa60abf6316.
Skip updating github.com/spf13/afero#bb8f1927f2a9d3ab41c9340aa034f6b803f4359c in /home/jenkins/.gradle/go/repo/github.com/spf13/afero/0d5b43f5d5a0d64c660c5f7f85c69eba.
Skip updating github.com/spf13/cast#acbeb36b902d72a7a4c18e8f3241075e7ab763e4 in /home/jenkins/.gradle/go/repo/github.com/spf13/cast/517542251c45d58331ec1dd452bb121b.
Skip updating github.com/spf13/cobra#93959269ad99e80983c9ba742a7e01203a4c0e4f in /home/jenkins/.gradle/go/repo/github.com/spf13/cobra/e71e66962e88c28e97f1d24435dc7be4.
Skip updating github.com/spf13/jwalterweatherman#7c0cea34c8ece3fbeb2b27ab9b59511d360fb394
in /home/jenkins/.gradle/go/repo/github.com/spf13/jwalterweatherman/330c1f6608327a4a7166e17f6e499144.
Skip updating github.com/coreos/etcd#11214aa33bf5a47d3d9d8dafe0f6b97237dfe921 in /home/jenkins/.gradle/go/repo/github.com/coreos/etcd/e07ad470c42c48737a8fdaa60abf6316.
Skip updating github.com/spf13/viper#aafc9e6bc7b7bb53ddaa75a5ef49a17d6e654be5 in /home/jenkins/.gradle/go/repo/github.com/spf13/viper/0646b428d96e964862ed970f8f3b1b0d.
Skip updating github.com/stathat/go#74669b9f388d9d788c97399a0824adbfee78400e in /home/jenkins/.gradle/go/repo/github.com/stathat/go/50bfc833dbb8ee4dc51ab0c7cc9cdadc.
Skip updating github.com/coreos/etcd#11214aa33bf5a47d3d9d8dafe0f6b97237dfe921 in /home/jenkins/.gradle/go/repo/github.com/coreos/etcd/e07ad470c42c48737a8fdaa60abf6316.
Skip updating github.com/coreos/etcd#11214aa33bf5a47d3d9d8dafe0f6b97237dfe921 in /home/jenkins/.gradle/go/repo/github.com/coreos/etcd/e07ad470c42c48737a8fdaa60abf6316.
Skip updating github.com/coreos/etcd#11214aa33bf5a47d3d9d8dafe0f6b97237dfe921 in /home/jenkins/.gradle/go/repo/github.com/coreos/etcd/e07ad470c42c48737a8fdaa60abf6316.
Skip updating github.com/coreos/etcd#11214aa33bf5a47d3d9d8dafe0f6b97237dfe921 in /home/jenkins/.gradle/go/repo/github.com/coreos/etcd/e07ad470c42c48737a8fdaa60abf6316.
Skip updating github.com/xordataexchange/crypt#b2862e3d0a775f18c7cfe02273500ae307b61218 in
/home/jenkins/.gradle/go/repo/github.com/xordataexchange/crypt/8e109341273400bea10f5f0413dcdd9f.
Skip updating go.opencensus.io#aa2b39d1618ef56ba156f27cfcdae9042f68f0bc in /home/jenkins/.gradle/go/repo/go.opencensus.io/fec515add58c7d1c6457c89d887bb2cd.
Skip updating golang.org/x/crypto#d9133f5469342136e669e85192a26056b587f503 in /home/jenkins/.gradle/go/repo/golang.org/x/crypto/2aba65426fb5ce67509b4db7a8dec732.
Skip updating golang.org/x/debug#95515998a8a4bd7448134b2cb5971dbeb12e0b77 in /home/jenkins/.gradle/go/repo/golang.org/x/debug/9043712fb350d6971269000e35dcbfbe.
Skip updating golang.org/x/net#2fb46b16b8dda405028c50f7c7f0f9dd1fa6bfb1 in /home/jenkins/.gradle/go/repo/golang.org/x/net/f47324d5ea8156d76c2bbb6ec5ebfdb6.
Skip updating golang.org/x/oauth2#a032972e28060ca4f5644acffae3dfc268cc09db in /home/jenkins/.gradle/go/repo/golang.org/x/oauth2/b0090736c2a63258c64df39f8d8a4b28.
Skip updating golang.org/x/sync#fd80eb99c8f653c847d294a001bdf2a3a6f768f5 in /home/jenkins/.gradle/go/repo/golang.org/x/sync/bb244395f28c52df3e99060750ebb26d.
Skip updating golang.org/x/sys#37707fdb30a5b38865cfb95e5aab41707daec7fd in /home/jenkins/.gradle/go/repo/golang.org/x/sys/c019fea3f060e6ac3a7ba229face9b20.
Skip updating github.com/coreos/etcd#11214aa33bf5a47d3d9d8dafe0f6b97237dfe921 in /home/jenkins/.gradle/go/repo/github.com/coreos/etcd/e07ad470c42c48737a8fdaa60abf6316.
Skip updating github.com/coreos/etcd#11214aa33bf5a47d3d9d8dafe0f6b97237dfe921 in /home/jenkins/.gradle/go/repo/github.com/coreos/etcd/e07ad470c42c48737a8fdaa60abf6316.
Skip updating google.golang.org/api#386d4e5f4f92f86e6aec85985761bba4b938a2d5 in /home/jenkins/.gradle/go/repo/google.golang.org/api/e28049fb85a1109eef37826e4bbdd908.
Skip updating google.golang.org/genproto#2b5a72b8730b0b16380010cfe5286c42108d88e7 in /home/jenkins/.gradle/go/repo/google.golang.org/genproto/d671e773e8f05b7375b87bbe0b61b2ce.
Skip updating google.golang.org/grpc#7646b5360d049a7ca31e9133315db43456f39e2e in /home/jenkins/.gradle/go/repo/google.golang.org/grpc/f8a4497e5e07f775c7d9e343b98b7521.
Skip updating github.com/coreos/etcd#11214aa33bf5a47d3d9d8dafe0f6b97237dfe921 in /home/jenkins/.gradle/go/repo/github.com/coreos/etcd/e07ad470c42c48737a8fdaa60abf6316.
Skip updating github.com/coreos/etcd#11214aa33bf5a47d3d9d8dafe0f6b97237dfe921 in /home/jenkins/.gradle/go/repo/github.com/coreos/etcd/e07ad470c42c48737a8fdaa60abf6316.
:beam-sdks-go:installDependencies (Thread[Task worker for ':' Thread 9,5,main]) completed.
Took 2.305 secs.
:beam-sdks-go:buildLinuxAmd64 (Thread[Task worker for ':' Thread 9,5,main]) started.

> Task :beam-sdks-go:buildLinuxAmd64
Caching disabled for task ':beam-sdks-go:buildLinuxAmd64': Caching has not been enabled for
the task
Task ':beam-sdks-go:buildLinuxAmd64' is not up-to-date because:
  Task has not declared any outputs despite executing actions.
:beam-sdks-go:buildLinuxAmd64 (Thread[Task worker for ':' Thread 9,5,main]) completed. Took
4.031 secs.
:beam-sdks-go:build (Thread[Task worker for ':' Thread 9,5,main]) started.

> Task :beam-sdks-go:build
Caching disabled for task ':beam-sdks-go:build': Caching has not been enabled for the task
Task ':beam-sdks-go:build' is not up-to-date because:
  Task has not declared any outputs despite executing actions.
:beam-sdks-go:build (Thread[Task worker for ':' Thread 9,5,main]) completed. Took 0.001 secs.
:beam-sdks-python-container:resolveBuildDependencies (Thread[Task worker for ':' Thread 9,5,main])
started.

> Task :beam-sdks-python-container:resolveBuildDependencies
Build cache key for task ':beam-sdks-python-container:resolveBuildDependencies' is 398f301536b905362cdaf42400e3776b
Caching disabled for task ':beam-sdks-python-container:resolveBuildDependencies': Caching
has not been enabled for the task
Task ':beam-sdks-python-container:resolveBuildDependencies' is not up-to-date because:
  No history is available.
Cache <https://builds.apache.org/job/beam_PostCommit_Python_PortableValidatesRunner_Flink_Gradle/ws/src/sdks/python/container/.gogradle/cache/PersistenceNotationToResolvedCache-0.10.bin>
not found, skip.
Cache <https://builds.apache.org/job/beam_PostCommit_Python_PortableValidatesRunner_Flink_Gradle/ws/src/sdks/python/container/.gogradle/cache/PersistenceResolvedToDependenciesCache-0.10.bin>
not found, skip.
Resolving ./github.com/apache/beam/sdks/go@<https://builds.apache.org/job/beam_PostCommit_Python_PortableValidatesRunner_Flink_Gradle/ws/src/sdks/go>
:beam-sdks-python-container:resolveBuildDependencies (Thread[Task worker for ':' Thread 9,5,main])
completed. Took 1.577 secs.
:beam-sdks-python-container:installDependencies (Thread[Task worker for ':' Thread 9,5,main])
started.

> Task :beam-sdks-python-container:installDependencies
Caching disabled for task ':beam-sdks-python-container:installDependencies': Caching has not
been enabled for the task
Task ':beam-sdks-python-container:installDependencies' is not up-to-date because:
  Task has not declared any outputs despite executing actions.
Cache <https://builds.apache.org/job/beam_PostCommit_Python_PortableValidatesRunner_Flink_Gradle/ws/src/sdks/python/container/.gogradle/cache/VendorSnapshot-0.10.bin>
not found, skip.
:beam-sdks-python-container:installDependencies (Thread[Task worker for ':' Thread 9,5,main])
completed. Took 0.616 secs.
:beam-sdks-python-container:buildLinuxAmd64 (Thread[Task worker for ':' Thread 9,5,main])
started.

> Task :beam-sdks-java-harness:shadowJar
*******************
GRADLE SHADOW STATS

Total Jars: 43 (includes project)
Total Time: 35.596s [35596ms]
Average Time/Jar: 0.8278139534884s [827.8139534884ms]
*******************
:beam-sdks-java-harness:shadowJar (Thread[Task worker for ':' Thread 4,5,main]) completed.
Took 36.013 secs.
:beam-runners-java-fn-execution:compileJava (Thread[Task worker for ':' Thread 4,5,main])
started.

> Task :beam-sdks-python-container:buildLinuxAmd64
Build cache key for task ':beam-sdks-python-container:buildLinuxAmd64' is 4f695c8ab88639db629348c57e8b0ed7
Caching disabled for task ':beam-sdks-python-container:buildLinuxAmd64': Caching has not been
enabled for the task
Task ':beam-sdks-python-container:buildLinuxAmd64' is not up-to-date because:
  No history is available.
:beam-sdks-python-container:buildLinuxAmd64 (Thread[Task worker for ':' Thread 9,5,main])
completed. Took 3.248 secs.
:beam-sdks-python-container:build (Thread[Task worker for ':' Thread 9,5,main]) started.

> Task :beam-sdks-python-container:build
Caching disabled for task ':beam-sdks-python-container:build': Caching has not been enabled
for the task
Task ':beam-sdks-python-container:build' is not up-to-date because:
  Task has not declared any outputs despite executing actions.
:beam-sdks-python-container:build (Thread[Task worker for ':' Thread 9,5,main]) completed.
Took 0.001 secs.

> Task :beam-runners-java-fn-execution:compileJava
Build cache key for task ':beam-runners-java-fn-execution:compileJava' is 04f1ab8308df4a9a98a686ae4f6bf65f
Task ':beam-runners-java-fn-execution:compileJava' is not up-to-date because:
  No history is available.
Custom actions are attached to task ':beam-runners-java-fn-execution:compileJava'.
All input files are considered out-of-date for incremental task ':beam-runners-java-fn-execution:compileJava'.
Compiling with error-prone compiler
Note: <https://builds.apache.org/job/beam_PostCommit_Python_PortableValidatesRunner_Flink_Gradle/ws/src/runners/java-fn-execution/src/main/java/org/apache/beam/runners/fnexecution/ServerFactory.java>
uses or overrides a deprecated API.
Note: Recompile with -Xlint:deprecation for details.
Note: Some input files use unchecked or unsafe operations.
Note: Recompile with -Xlint:unchecked for details.
Packing task ':beam-runners-java-fn-execution:compileJava'
:beam-runners-java-fn-execution:compileJava (Thread[Task worker for ':' Thread 4,5,main])
completed. Took 11.4 secs.
:beam-runners-java-fn-execution:classes (Thread[Task worker for ':' Thread 4,5,main]) started.

> Task :beam-runners-java-fn-execution:classes
Skipping task ':beam-runners-java-fn-execution:classes' as it has no actions.
:beam-runners-java-fn-execution:classes (Thread[Task worker for ':' Thread 4,5,main]) completed.
Took 0.0 secs.
:beam-runners-java-fn-execution:shadowJar (Thread[Task worker for ':' Thread 4,5,main]) started.

> Task :beam-runners-java-fn-execution:shadowJar
Build cache key for task ':beam-runners-java-fn-execution:shadowJar' is 2249c75ccb206caf8bd07cc2ab13624c
Caching disabled for task ':beam-runners-java-fn-execution:shadowJar': Caching has not been
enabled for the task
Task ':beam-runners-java-fn-execution:shadowJar' is not up-to-date because:
  No history is available.
*******************
GRADLE SHADOW STATS

Total Jars: 2 (includes project)
Total Time: 2.232s [2232ms]
Average Time/Jar: 1.116s [1116.0ms]
*******************
:beam-runners-java-fn-execution:shadowJar (Thread[Task worker for ':' Thread 4,5,main]) completed.
Took 2.396 secs.
:beam-runners-flink_2.11:compileJava (Thread[Task worker for ':' Thread 4,5,main]) started.

> Task :beam-runners-flink_2.11:compileJava
Build cache key for task ':beam-runners-flink_2.11:compileJava' is 64e289fbc80cd60d5a5cbf5dd86caac2
Task ':beam-runners-flink_2.11:compileJava' is not up-to-date because:
  No history is available.
Custom actions are attached to task ':beam-runners-flink_2.11:compileJava'.
All input files are considered out-of-date for incremental task ':beam-runners-flink_2.11:compileJava'.
Compiling with error-prone compiler
Note: Some input files use or override a deprecated API.
Note: Recompile with -Xlint:deprecation for details.
Note: Some input files use unchecked or unsafe operations.
Note: Recompile with -Xlint:unchecked for details.
Packing task ':beam-runners-flink_2.11:compileJava'
:beam-runners-flink_2.11:compileJava (Thread[Task worker for ':' Thread 4,5,main]) completed.
Took 13.505 secs.
:beam-runners-flink_2.11:classes (Thread[Task worker for ':' Thread 4,5,main]) started.

> Task :beam-runners-flink_2.11:classes
Skipping task ':beam-runners-flink_2.11:classes' as it has no actions.
:beam-runners-flink_2.11:classes (Thread[Task worker for ':' Thread 4,5,main]) completed.
Took 0.0 secs.
:beam-runners-flink_2.11:shadowJar (Thread[Task worker for ':' Thread 4,5,main]) started.

> Task :beam-runners-flink_2.11:shadowJar
Build cache key for task ':beam-runners-flink_2.11:shadowJar' is 1df546fa6fc16143d053fd00bdf16915
Caching disabled for task ':beam-runners-flink_2.11:shadowJar': Caching has not been enabled
for the task
Task ':beam-runners-flink_2.11:shadowJar' is not up-to-date because:
  No history is available.
*******************
GRADLE SHADOW STATS

Total Jars: 2 (includes project)
Total Time: 2.031s [2031ms]
Average Time/Jar: 1.0155s [1015.5ms]
*******************
:beam-runners-flink_2.11:shadowJar (Thread[Task worker for ':' Thread 4,5,main]) completed.
Took 2.361 secs.
:beam-runners-flink_2.11-job-server:compileJava (Thread[Task worker for ':' Thread 4,5,main])
started.

> Task :beam-runners-flink_2.11-job-server:compileJava NO-SOURCE
file or directory '<https://builds.apache.org/job/beam_PostCommit_Python_PortableValidatesRunner_Flink_Gradle/ws/src/runners/flink/job-server/src/main/java',>
not found
Skipping task ':beam-runners-flink_2.11-job-server:compileJava' as it has no source files
and no previous output files.
:beam-runners-flink_2.11-job-server:compileJava (Thread[Task worker for ':' Thread 4,5,main])
completed. Took 0.001 secs.
:beam-runners-flink_2.11-job-server:classes (Thread[Task worker for ':' Thread 4,5,main])
started.

> Task :beam-runners-flink_2.11-job-server:classes UP-TO-DATE
Skipping task ':beam-runners-flink_2.11-job-server:classes' as it has no actions.
:beam-runners-flink_2.11-job-server:classes (Thread[Task worker for ':' Thread 4,5,main])
completed. Took 0.0 secs.
:beam-runners-flink_2.11-job-server:jar (Thread[Task worker for ':' Thread 4,5,main]) started.

> Task :beam-runners-flink_2.11-job-server:jar
Build cache key for task ':beam-runners-flink_2.11-job-server:jar' is b72bd8ff09e50654522e2e23db3fdf65
Caching disabled for task ':beam-runners-flink_2.11-job-server:jar': Caching has not been
enabled for the task
Task ':beam-runners-flink_2.11-job-server:jar' is not up-to-date because:
  No history is available.
:beam-runners-flink_2.11-job-server:jar (Thread[Task worker for ':' Thread 4,5,main]) completed.
Took 0.005 secs.

FAILURE: Build failed with an exception.

* Where:
Build file '<https://builds.apache.org/job/beam_PostCommit_Python_PortableValidatesRunner_Flink_Gradle/ws/src/sdks/python/build.gradle'>
line: 36

* What went wrong:
Execution failed for task ':beam-sdks-python:setupVirtualenv'.
> Process 'command 'sh'' finished with non-zero exit value 1

* Try:
Run with --stacktrace option to get the stack trace. Run with --debug option to get more log
output. Run with --scan to get full insights.

* Get more help at https://help.gradle.org

Deprecated Gradle features were used in this build, making it incompatible with Gradle 5.0.
See https://docs.gradle.org/4.8/userguide/command_line_interface.html#sec:command_line_warnings

BUILD FAILED in 2m 31s
53 actionable tasks: 48 executed, 4 from cache, 1 up-to-date

Publishing build scan...
https://gradle.com/s/e4yrbagmaxb2m

Build step 'Invoke Gradle script' changed build result to FAILURE
Build step 'Invoke Gradle script' marked build as failure

Mime
View raw message