beam-commits mailing list archives

Site index · List index
Message view « Date » · « Thread »
Top « Date » · « Thread »
From Apache Jenkins Server <jenk...@builds.apache.org>
Subject Build failed in Jenkins: beam_PreCommit_Website_Cron #24
Date Thu, 06 Sep 2018 00:02:48 GMT
See <https://builds.apache.org/job/beam_PreCommit_Website_Cron/24/display/redirect?page=changes>

Changes:

[mxm] [BEAM-5308] Correct/cleanup DockerOnMac code in DockerJobBundleFactory

------------------------------------------
[...truncated 24.82 KB...]
5cee356eda6b: Pulling fs layer
89d3385f0fd3: Pulling fs layer
80ae6b477848: Pulling fs layer
28bdf9e584cc: Pulling fs layer
bdeb28e714e4: Pulling fs layer
5922247af93e: Pulling fs layer
a777432baaad: Pulling fs layer
a777432baaad: Waiting
bdeb28e714e4: Waiting
5922247af93e: Waiting
28bdf9e584cc: Waiting
80ae6b477848: Waiting
5cee356eda6b: Verifying Checksum
5cee356eda6b: Download complete
89d3385f0fd3: Verifying Checksum
89d3385f0fd3: Download complete
05d1a5232b46: Verifying Checksum
05d1a5232b46: Download complete
bdeb28e714e4: Download complete
80ae6b477848: Verifying Checksum
80ae6b477848: Download complete
a777432baaad: Download complete
5922247af93e: Verifying Checksum
5922247af93e: Download complete
28bdf9e584cc: Download complete
05d1a5232b46: Pull complete
5cee356eda6b: Pull complete
89d3385f0fd3: Pull complete
80ae6b477848: Pull complete
28bdf9e584cc: Pull complete
bdeb28e714e4: Pull complete
5922247af93e: Pull complete
a777432baaad: Pull complete
Digest: sha256:b14bb6c3e1e0ca3fda67051622f4259e37dd9dc38b02f4b02b66d836e9f8e30a
Status: Downloaded newer image for ruby:2.5
 ---> 88666731c3e1
Step 2/7 : WORKDIR /ruby
 ---> d67baab7ab9b
Removing intermediate container 2cc7502fd050
Step 3/7 : RUN gem install bundler
 ---> Running in d4e1c2a2c423
Successfully installed bundler-1.16.4
1 gem installed
 ---> 6b624ce3f83b
Removing intermediate container d4e1c2a2c423
Step 4/7 : ADD Gemfile Gemfile.lock /ruby/
 ---> f75fd93d65eb
Removing intermediate container f0a36f1fa203
Step 5/7 : RUN bundle install --deployment --path $GEM_HOME
 ---> Running in 35ff366a55a9
Fetching gem metadata from https://rubygems.org/.........
Fetching rake 12.3.0
Installing rake 12.3.0
Fetching concurrent-ruby 1.0.5
Installing concurrent-ruby 1.0.5
Fetching i18n 0.9.5
Installing i18n 0.9.5
Fetching minitest 5.11.3
Installing minitest 5.11.3
Fetching thread_safe 0.3.6
Installing thread_safe 0.3.6
Fetching tzinfo 1.2.5
Installing tzinfo 1.2.5
Fetching activesupport 4.2.10
Installing activesupport 4.2.10
Fetching public_suffix 3.0.2
Installing public_suffix 3.0.2
Fetching addressable 2.5.2
Installing addressable 2.5.2
Using bundler 1.16.4
Fetching colorator 1.1.0
Installing colorator 1.1.0
Fetching colorize 0.8.1
Installing colorize 0.8.1
Fetching ffi 1.9.21
Installing ffi 1.9.21 with native extensions
Fetching ethon 0.11.0
Installing ethon 0.11.0
Fetching forwardable-extended 2.6.0
Installing forwardable-extended 2.6.0
Fetching mercenary 0.3.6
Installing mercenary 0.3.6
Fetching mini_portile2 2.3.0
Installing mini_portile2 2.3.0
Fetching nokogiri 1.8.2
Installing nokogiri 1.8.2 with native extensions
Fetching parallel 1.12.1
Installing parallel 1.12.1
Fetching typhoeus 1.3.0
Installing typhoeus 1.3.0
Fetching yell 2.0.7
Installing yell 2.0.7
Fetching html-proofer 3.8.0
Installing html-proofer 3.8.0
Fetching rb-fsevent 0.10.2
Installing rb-fsevent 0.10.2
Fetching rb-inotify 0.9.10
Installing rb-inotify 0.9.10
Fetching sass-listen 4.0.0
Installing sass-listen 4.0.0
Fetching sass 3.5.5
Installing sass 3.5.5
Fetching jekyll-sass-converter 1.5.2
Installing jekyll-sass-converter 1.5.2
Fetching ruby_dep 1.5.0
Installing ruby_dep 1.5.0
Fetching listen 3.1.5
Installing listen 3.1.5
Fetching jekyll-watch 1.5.1
Installing jekyll-watch 1.5.1
Fetching kramdown 1.16.2
Installing kramdown 1.16.2
Fetching liquid 3.0.6
Installing liquid 3.0.6
Fetching pathutil 0.16.1
Installing pathutil 0.16.1
Fetching rouge 1.11.1
Installing rouge 1.11.1
Fetching safe_yaml 1.0.4
Installing safe_yaml 1.0.4
Fetching jekyll 3.2.0
Installing jekyll 3.2.0
Fetching jekyll-redirect-from 0.11.0
Installing jekyll-redirect-from 0.11.0
Fetching jekyll_github_sample 0.3.1
Installing jekyll_github_sample 0.3.1
Bundle complete! 7 Gemfile dependencies, 38 gems now installed.
Bundled gems are installed into `/usr/local/bundle`
 ---> 435c2b08d6d0
Removing intermediate container 35ff366a55a9
Step 6/7 : ENV LC_ALL C.UTF-8
 ---> Running in 50cc6c34d85f
 ---> 680cdf1ba8a5
Removing intermediate container 50cc6c34d85f
Step 7/7 : CMD sleep 3600
 ---> Running in 4f47dd5582c2
 ---> 7fb83dcd73ef
Removing intermediate container 4f47dd5582c2
Successfully built 7fb83dcd73ef
Successfully tagged beam-website:latest
:beam-website:buildDockerImage (Thread[Task worker for ':' Thread 4,5,main]) completed. Took
1 mins 48.839 secs.
:beam-website:createDockerContainer (Thread[Task worker for ':' Thread 4,5,main]) started.

> Task :beam-website:createDockerContainer
Caching disabled for task ':beam-website:createDockerContainer': Caching has not been enabled
for the task
Task ':beam-website:createDockerContainer' is not up-to-date because:
  Task has not declared any outputs despite executing actions.
Starting process 'command '/bin/bash''. Working directory: <https://builds.apache.org/job/beam_PreCommit_Website_Cron/ws/src/website>
Command: /bin/bash -c docker create -v <https://builds.apache.org/job/beam_PreCommit_Website_Cron/ws/src>:/repo
-u $(id -u):$(id -g) beam-website
Successfully started process 'command '/bin/bash''
:beam-website:createDockerContainer (Thread[Task worker for ':' Thread 4,5,main]) completed.
Took 0.123 secs.
:beam-website:startDockerContainer (Thread[Task worker for ':' Thread 4,5,main]) started.

> Task :beam-website:startDockerContainer
Caching disabled for task ':beam-website:startDockerContainer': Caching has not been enabled
for the task
Task ':beam-website:startDockerContainer' is not up-to-date because:
  Task has not declared any outputs despite executing actions.
Starting process 'command 'docker''. Working directory: <https://builds.apache.org/job/beam_PreCommit_Website_Cron/ws/src/website>
Command: docker start 098434ff18304f485b0208c60c1ebe68e841a1ff55980b766e039f600ee43830
Successfully started process 'command 'docker''
098434ff18304f485b0208c60c1ebe68e841a1ff55980b766e039f600ee43830
:beam-website:startDockerContainer (Thread[Task worker for ':' Thread 4,5,main]) completed.
Took 0.297 secs.
:beam-website:buildWebsite (Thread[Task worker for ':' Thread 4,5,main]) started.

> Task :beam-website:buildWebsite
Build cache key for task ':beam-website:buildWebsite' is b31a9cbfe8364ad1f297ff8ef09d86f0
Caching disabled for task ':beam-website:buildWebsite': Caching has not been enabled for the
task
Task ':beam-website:buildWebsite' is not up-to-date because:
  No history is available.
Starting process 'command 'docker''. Working directory: <https://builds.apache.org/job/beam_PreCommit_Website_Cron/ws/src/website>
Command: docker exec 098434ff18304f485b0208c60c1ebe68e841a1ff55980b766e039f600ee43830 /bin/bash
-c cd /repo/build/website &&       bundle exec jekyll build       --config /repo/website/_config.yml
      --incremental       --source /repo/website/src
      
Successfully started process 'command 'docker''
`/` is not writable.
Bundler will use `/tmp/bundler/home/unknown' as your home directory temporarily.
Configuration file: /repo/website/_config.yml
            Source: /repo/website/src
       Destination: content
 Incremental build: enabled
      Generating... 
                    done in 11.693 seconds.
 Auto-regeneration: disabled. Use --watch to enable.
:beam-website:buildWebsite (Thread[Task worker for ':' Thread 4,5,main]) completed. Took 13.189
secs.
:beam-website:testWebsite (Thread[Task worker for ':' Thread 4,5,main]) started.

> Task :beam-website:testWebsite
Caching disabled for task ':beam-website:testWebsite': Caching has not been enabled for the
task
Task ':beam-website:testWebsite' is not up-to-date because:
  Task has not declared any outputs despite executing actions.
Starting process 'command 'docker''. Working directory: <https://builds.apache.org/job/beam_PreCommit_Website_Cron/ws/src/website>
Command: docker exec 098434ff18304f485b0208c60c1ebe68e841a1ff55980b766e039f600ee43830 /bin/bash
-c cd /repo/build/website &&       bundle exec rake test
Successfully started process 'command 'docker''
`/` is not writable.
Bundler will use `/tmp/bundler/home/unknown' as your home directory temporarily.
Running ["HtmlCheck", "LinkCheck", "ImageCheck", "ScriptCheck"] on ["./content"] on *.html...



Checking 566 external links...
Ran on 135 files!


- ./content/contribute/release-guide/index.html
  *  External link https://github.com/apache/beam/blob/master/runners/google-cloud-dataflow-java/pom.xml
failed: 404 No error
- ./content/get-started/downloads/index.html
  *  External link https://dist.apache.org/repos/dist/release/beam/2.5.0/apache-beam-2.5.0-source-release.zip
failed: 404 No error
  *  External link https://dist.apache.org/repos/dist/release/beam/2.5.0/apache-beam-2.5.0-source-release.zip.asc
failed: 404 No error
  *  External link https://dist.apache.org/repos/dist/release/beam/2.5.0/apache-beam-2.5.0-source-release.zip.sha512
failed: 404 No error
rake aborted!
HTML-Proofer found 4 failures!
/usr/local/bundle/ruby/2.5.0/gems/html-proofer-3.8.0/lib/html-proofer/runner.rb:167:in `print_failed_tests'
/usr/local/bundle/ruby/2.5.0/gems/html-proofer-3.8.0/lib/html-proofer/runner.rb:48:in `run'
/repo/build/website/Rakefile:23:in `block in <top (required)>'
/usr/local/bundle/ruby/2.5.0/gems/rake-12.3.0/exe/rake:27:in `<top (required)>'
/usr/local/bundle/bin/bundle:23:in `load'
/usr/local/bundle/bin/bundle:23:in `<main>'
Tasks: TOP => test
(See full trace by running task with --trace)

> Task :beam-website:testWebsite FAILED
:beam-website:testWebsite (Thread[Task worker for ':' Thread 4,5,main]) completed. Took 22.993
secs.
:beam-website:stopAndRemoveDockerContainer (Thread[Task worker for ':' Thread 4,5,main]) started.

> Task :beam-website:stopAndRemoveDockerContainer
Caching disabled for task ':beam-website:stopAndRemoveDockerContainer': Caching has not been
enabled for the task
Task ':beam-website:stopAndRemoveDockerContainer' is not up-to-date because:
  Task has not declared any outputs despite executing actions.
Starting process 'command 'docker''. Working directory: <https://builds.apache.org/job/beam_PreCommit_Website_Cron/ws/src/website>
Command: docker rm -f 098434ff18304f485b0208c60c1ebe68e841a1ff55980b766e039f600ee43830
Successfully started process 'command 'docker''
098434ff18304f485b0208c60c1ebe68e841a1ff55980b766e039f600ee43830
:beam-website:stopAndRemoveDockerContainer (Thread[Task worker for ':' Thread 4,5,main]) completed.
Took 0.445 secs.

FAILURE: Build failed with an exception.

* What went wrong:
Execution failed for task ':beam-website:testWebsite'.
> Process 'command 'docker'' finished with non-zero exit value 1

* Try:
Run with --stacktrace option to get the stack trace. Run with --debug option to get more log
output. Run with --scan to get full insights.

* Get more help at https://help.gradle.org

Deprecated Gradle features were used in this build, making it incompatible with Gradle 5.0.
See https://docs.gradle.org/4.8/userguide/command_line_interface.html#sec:command_line_warnings

BUILD FAILED in 2m 36s
8 actionable tasks: 8 executed

Publishing build scan...
https://gradle.com/s/r63v6hj2cktlg

Build step 'Invoke Gradle script' changed build result to FAILURE
Build step 'Invoke Gradle script' marked build as failure

Mime
View raw message