beam-commits mailing list archives

Site index · List index
Message view « Date » · « Thread »
Top « Date » · « Thread »
From Apache Jenkins Server <jenk...@builds.apache.org>
Subject Build failed in Jenkins: beam_PerformanceTests_Python #1380
Date Tue, 04 Sep 2018 11:00:08 GMT
See <https://builds.apache.org/job/beam_PerformanceTests_Python/1380/display/redirect>

------------------------------------------
[...truncated 51.87 KB...]
copying apache_beam/runners/worker/__init__.py -> apache-beam-2.8.0.dev0/apache_beam/runners/worker
copying apache_beam/runners/worker/bundle_processor.py -> apache-beam-2.8.0.dev0/apache_beam/runners/worker
copying apache_beam/runners/worker/data_plane.py -> apache-beam-2.8.0.dev0/apache_beam/runners/worker
copying apache_beam/runners/worker/data_plane_test.py -> apache-beam-2.8.0.dev0/apache_beam/runners/worker
copying apache_beam/runners/worker/log_handler.py -> apache-beam-2.8.0.dev0/apache_beam/runners/worker
copying apache_beam/runners/worker/log_handler_test.py -> apache-beam-2.8.0.dev0/apache_beam/runners/worker
copying apache_beam/runners/worker/logger.py -> apache-beam-2.8.0.dev0/apache_beam/runners/worker
copying apache_beam/runners/worker/logger_test.py -> apache-beam-2.8.0.dev0/apache_beam/runners/worker
copying apache_beam/runners/worker/opcounters.pxd -> apache-beam-2.8.0.dev0/apache_beam/runners/worker
copying apache_beam/runners/worker/opcounters.py -> apache-beam-2.8.0.dev0/apache_beam/runners/worker
copying apache_beam/runners/worker/opcounters_test.py -> apache-beam-2.8.0.dev0/apache_beam/runners/worker
copying apache_beam/runners/worker/operation_specs.py -> apache-beam-2.8.0.dev0/apache_beam/runners/worker
copying apache_beam/runners/worker/operations.pxd -> apache-beam-2.8.0.dev0/apache_beam/runners/worker
copying apache_beam/runners/worker/operations.py -> apache-beam-2.8.0.dev0/apache_beam/runners/worker
copying apache_beam/runners/worker/sdk_worker.py -> apache-beam-2.8.0.dev0/apache_beam/runners/worker
copying apache_beam/runners/worker/sdk_worker_main.py -> apache-beam-2.8.0.dev0/apache_beam/runners/worker
copying apache_beam/runners/worker/sdk_worker_main_test.py -> apache-beam-2.8.0.dev0/apache_beam/runners/worker
copying apache_beam/runners/worker/sdk_worker_test.py -> apache-beam-2.8.0.dev0/apache_beam/runners/worker
copying apache_beam/runners/worker/sideinputs.py -> apache-beam-2.8.0.dev0/apache_beam/runners/worker
copying apache_beam/runners/worker/sideinputs_test.py -> apache-beam-2.8.0.dev0/apache_beam/runners/worker
copying apache_beam/runners/worker/statesampler.py -> apache-beam-2.8.0.dev0/apache_beam/runners/worker
copying apache_beam/runners/worker/statesampler_fast.pxd -> apache-beam-2.8.0.dev0/apache_beam/runners/worker
copying apache_beam/runners/worker/statesampler_fast.pyx -> apache-beam-2.8.0.dev0/apache_beam/runners/worker
copying apache_beam/runners/worker/statesampler_slow.py -> apache-beam-2.8.0.dev0/apache_beam/runners/worker
copying apache_beam/runners/worker/statesampler_test.py -> apache-beam-2.8.0.dev0/apache_beam/runners/worker
copying apache_beam/runners/worker/worker_id_interceptor.py -> apache-beam-2.8.0.dev0/apache_beam/runners/worker
copying apache_beam/runners/worker/worker_id_interceptor_test.py -> apache-beam-2.8.0.dev0/apache_beam/runners/worker
copying apache_beam/testing/__init__.py -> apache-beam-2.8.0.dev0/apache_beam/testing
copying apache_beam/testing/pipeline_verifiers.py -> apache-beam-2.8.0.dev0/apache_beam/testing
copying apache_beam/testing/pipeline_verifiers_test.py -> apache-beam-2.8.0.dev0/apache_beam/testing
copying apache_beam/testing/synthetic_pipeline.py -> apache-beam-2.8.0.dev0/apache_beam/testing
copying apache_beam/testing/synthetic_pipeline_test.py -> apache-beam-2.8.0.dev0/apache_beam/testing
copying apache_beam/testing/test_pipeline.py -> apache-beam-2.8.0.dev0/apache_beam/testing
copying apache_beam/testing/test_pipeline_test.py -> apache-beam-2.8.0.dev0/apache_beam/testing
copying apache_beam/testing/test_stream.py -> apache-beam-2.8.0.dev0/apache_beam/testing
copying apache_beam/testing/test_stream_test.py -> apache-beam-2.8.0.dev0/apache_beam/testing
copying apache_beam/testing/test_utils.py -> apache-beam-2.8.0.dev0/apache_beam/testing
copying apache_beam/testing/test_utils_test.py -> apache-beam-2.8.0.dev0/apache_beam/testing
copying apache_beam/testing/util.py -> apache-beam-2.8.0.dev0/apache_beam/testing
copying apache_beam/testing/util_test.py -> apache-beam-2.8.0.dev0/apache_beam/testing
copying apache_beam/testing/benchmarks/__init__.py -> apache-beam-2.8.0.dev0/apache_beam/testing/benchmarks
copying apache_beam/testing/benchmarks/nexmark/__init__.py -> apache-beam-2.8.0.dev0/apache_beam/testing/benchmarks/nexmark
copying apache_beam/testing/benchmarks/nexmark/nexmark_launcher.py -> apache-beam-2.8.0.dev0/apache_beam/testing/benchmarks/nexmark
copying apache_beam/testing/benchmarks/nexmark/nexmark_util.py -> apache-beam-2.8.0.dev0/apache_beam/testing/benchmarks/nexmark
copying apache_beam/testing/benchmarks/nexmark/models/__init__.py -> apache-beam-2.8.0.dev0/apache_beam/testing/benchmarks/nexmark/models
copying apache_beam/testing/benchmarks/nexmark/models/nexmark_model.py -> apache-beam-2.8.0.dev0/apache_beam/testing/benchmarks/nexmark/models
copying apache_beam/testing/benchmarks/nexmark/queries/__init__.py -> apache-beam-2.8.0.dev0/apache_beam/testing/benchmarks/nexmark/queries
copying apache_beam/testing/benchmarks/nexmark/queries/query0.py -> apache-beam-2.8.0.dev0/apache_beam/testing/benchmarks/nexmark/queries
copying apache_beam/testing/benchmarks/nexmark/queries/query1.py -> apache-beam-2.8.0.dev0/apache_beam/testing/benchmarks/nexmark/queries
copying apache_beam/testing/benchmarks/nexmark/queries/query2.py -> apache-beam-2.8.0.dev0/apache_beam/testing/benchmarks/nexmark/queries
copying apache_beam/testing/data/standard_coders.yaml -> apache-beam-2.8.0.dev0/apache_beam/testing/data
copying apache_beam/testing/data/trigger_transcripts.yaml -> apache-beam-2.8.0.dev0/apache_beam/testing/data
copying apache_beam/tools/__init__.py -> apache-beam-2.8.0.dev0/apache_beam/tools
copying apache_beam/tools/coders_microbenchmark.py -> apache-beam-2.8.0.dev0/apache_beam/tools
copying apache_beam/tools/distribution_counter_microbenchmark.py -> apache-beam-2.8.0.dev0/apache_beam/tools
copying apache_beam/tools/map_fn_microbenchmark.py -> apache-beam-2.8.0.dev0/apache_beam/tools
copying apache_beam/tools/microbenchmarks_test.py -> apache-beam-2.8.0.dev0/apache_beam/tools
copying apache_beam/tools/sideinput_microbenchmark.py -> apache-beam-2.8.0.dev0/apache_beam/tools
copying apache_beam/tools/utils.py -> apache-beam-2.8.0.dev0/apache_beam/tools
copying apache_beam/transforms/__init__.py -> apache-beam-2.8.0.dev0/apache_beam/transforms
copying apache_beam/transforms/combiners.py -> apache-beam-2.8.0.dev0/apache_beam/transforms
copying apache_beam/transforms/combiners_test.py -> apache-beam-2.8.0.dev0/apache_beam/transforms
copying apache_beam/transforms/core.py -> apache-beam-2.8.0.dev0/apache_beam/transforms
copying apache_beam/transforms/create_source.py -> apache-beam-2.8.0.dev0/apache_beam/transforms
copying apache_beam/transforms/create_test.py -> apache-beam-2.8.0.dev0/apache_beam/transforms
copying apache_beam/transforms/cy_combiners.pxd -> apache-beam-2.8.0.dev0/apache_beam/transforms
copying apache_beam/transforms/cy_combiners.py -> apache-beam-2.8.0.dev0/apache_beam/transforms
copying apache_beam/transforms/cy_dataflow_distribution_counter.pxd -> apache-beam-2.8.0.dev0/apache_beam/transforms
copying apache_beam/transforms/cy_dataflow_distribution_counter.pyx -> apache-beam-2.8.0.dev0/apache_beam/transforms
copying apache_beam/transforms/dataflow_distribution_counter_test.py -> apache-beam-2.8.0.dev0/apache_beam/transforms
copying apache_beam/transforms/display.py -> apache-beam-2.8.0.dev0/apache_beam/transforms
copying apache_beam/transforms/display_test.py -> apache-beam-2.8.0.dev0/apache_beam/transforms
copying apache_beam/transforms/ptransform.py -> apache-beam-2.8.0.dev0/apache_beam/transforms
copying apache_beam/transforms/ptransform_test.py -> apache-beam-2.8.0.dev0/apache_beam/transforms
copying apache_beam/transforms/py_dataflow_distribution_counter.py -> apache-beam-2.8.0.dev0/apache_beam/transforms
copying apache_beam/transforms/sideinputs.py -> apache-beam-2.8.0.dev0/apache_beam/transforms
copying apache_beam/transforms/sideinputs_test.py -> apache-beam-2.8.0.dev0/apache_beam/transforms
copying apache_beam/transforms/timeutil.py -> apache-beam-2.8.0.dev0/apache_beam/transforms
copying apache_beam/transforms/trigger.py -> apache-beam-2.8.0.dev0/apache_beam/transforms
copying apache_beam/transforms/trigger_test.py -> apache-beam-2.8.0.dev0/apache_beam/transforms
copying apache_beam/transforms/userstate.py -> apache-beam-2.8.0.dev0/apache_beam/transforms
copying apache_beam/transforms/userstate_test.py -> apache-beam-2.8.0.dev0/apache_beam/transforms
copying apache_beam/transforms/util.py -> apache-beam-2.8.0.dev0/apache_beam/transforms
copying apache_beam/transforms/util_test.py -> apache-beam-2.8.0.dev0/apache_beam/transforms
copying apache_beam/transforms/window.py -> apache-beam-2.8.0.dev0/apache_beam/transforms
copying apache_beam/transforms/window_test.py -> apache-beam-2.8.0.dev0/apache_beam/transforms
copying apache_beam/transforms/write_ptransform_test.py -> apache-beam-2.8.0.dev0/apache_beam/transforms
copying apache_beam/typehints/__init__.py -> apache-beam-2.8.0.dev0/apache_beam/typehints
copying apache_beam/typehints/decorators.py -> apache-beam-2.8.0.dev0/apache_beam/typehints
copying apache_beam/typehints/native_type_compatibility.py -> apache-beam-2.8.0.dev0/apache_beam/typehints
copying apache_beam/typehints/native_type_compatibility_test.py -> apache-beam-2.8.0.dev0/apache_beam/typehints
copying apache_beam/typehints/opcodes.py -> apache-beam-2.8.0.dev0/apache_beam/typehints
copying apache_beam/typehints/trivial_inference.py -> apache-beam-2.8.0.dev0/apache_beam/typehints
copying apache_beam/typehints/trivial_inference_test.py -> apache-beam-2.8.0.dev0/apache_beam/typehints
copying apache_beam/typehints/typecheck.py -> apache-beam-2.8.0.dev0/apache_beam/typehints
copying apache_beam/typehints/typed_pipeline_test.py -> apache-beam-2.8.0.dev0/apache_beam/typehints
copying apache_beam/typehints/typehints.py -> apache-beam-2.8.0.dev0/apache_beam/typehints
copying apache_beam/typehints/typehints_test.py -> apache-beam-2.8.0.dev0/apache_beam/typehints
copying apache_beam/utils/__init__.py -> apache-beam-2.8.0.dev0/apache_beam/utils
copying apache_beam/utils/annotations.py -> apache-beam-2.8.0.dev0/apache_beam/utils
copying apache_beam/utils/annotations_test.py -> apache-beam-2.8.0.dev0/apache_beam/utils
copying apache_beam/utils/counters.pxd -> apache-beam-2.8.0.dev0/apache_beam/utils
copying apache_beam/utils/counters.py -> apache-beam-2.8.0.dev0/apache_beam/utils
copying apache_beam/utils/counters_test.py -> apache-beam-2.8.0.dev0/apache_beam/utils
copying apache_beam/utils/plugin.py -> apache-beam-2.8.0.dev0/apache_beam/utils
copying apache_beam/utils/processes.py -> apache-beam-2.8.0.dev0/apache_beam/utils
copying apache_beam/utils/processes_test.py -> apache-beam-2.8.0.dev0/apache_beam/utils
copying apache_beam/utils/profiler.py -> apache-beam-2.8.0.dev0/apache_beam/utils
copying apache_beam/utils/proto_utils.py -> apache-beam-2.8.0.dev0/apache_beam/utils
copying apache_beam/utils/retry.py -> apache-beam-2.8.0.dev0/apache_beam/utils
copying apache_beam/utils/retry_test.py -> apache-beam-2.8.0.dev0/apache_beam/utils
copying apache_beam/utils/timestamp.py -> apache-beam-2.8.0.dev0/apache_beam/utils
copying apache_beam/utils/timestamp_test.py -> apache-beam-2.8.0.dev0/apache_beam/utils
copying apache_beam/utils/urns.py -> apache-beam-2.8.0.dev0/apache_beam/utils
copying apache_beam/utils/windowed_value.pxd -> apache-beam-2.8.0.dev0/apache_beam/utils
copying apache_beam/utils/windowed_value.py -> apache-beam-2.8.0.dev0/apache_beam/utils
copying apache_beam/utils/windowed_value_test.py -> apache-beam-2.8.0.dev0/apache_beam/utils
Writing apache-beam-2.8.0.dev0/setup.cfg
creating target
Creating tar archive
removing 'apache-beam-2.8.0.dev0' (and everything under it)
[beam_PerformanceTests_Python] $ /bin/bash -xe /tmp/jenkins4467812121872232309.sh
+ <https://builds.apache.org/job/beam_PerformanceTests_Python/ws/env/.perfkit_env/bin/pip>
install -r <https://builds.apache.org/job/beam_PerformanceTests_Python/ws/PerfKitBenchmarker/requirements.txt>
Collecting absl-py (from -r <https://builds.apache.org/job/beam_PerformanceTests_Python/ws/PerfKitBenchmarker/requirements.txt>
(line 14))
Collecting jinja2>=2.7 (from -r <https://builds.apache.org/job/beam_PerformanceTests_Python/ws/PerfKitBenchmarker/requirements.txt>
(line 15))
  Using cached https://files.pythonhosted.org/packages/7f/ff/ae64bacdfc95f27a016a7bed8e8686763ba4d277a78ca76f32659220a731/Jinja2-2.10-py2.py3-none-any.whl
Requirement already satisfied: setuptools in ./env/.perfkit_env/lib/python2.7/site-packages
(from -r <https://builds.apache.org/job/beam_PerformanceTests_Python/ws/PerfKitBenchmarker/requirements.txt>
(line 16)) (40.2.0)
Collecting colorlog[windows]==2.6.0 (from -r <https://builds.apache.org/job/beam_PerformanceTests_Python/ws/PerfKitBenchmarker/requirements.txt>
(line 17))
  Using cached https://files.pythonhosted.org/packages/59/1a/46a1bf2044ad8b30b52fed0f389338c85747e093fe7f51a567f4cb525892/colorlog-2.6.0-py2.py3-none-any.whl
Collecting blinker>=1.3 (from -r <https://builds.apache.org/job/beam_PerformanceTests_Python/ws/PerfKitBenchmarker/requirements.txt>
(line 18))
Collecting futures>=3.0.3 (from -r <https://builds.apache.org/job/beam_PerformanceTests_Python/ws/PerfKitBenchmarker/requirements.txt>
(line 19))
  Using cached https://files.pythonhosted.org/packages/2d/99/b2c4e9d5a30f6471e410a146232b4118e697fa3ffc06d6a65efde84debd0/futures-3.2.0-py2-none-any.whl
Collecting PyYAML==3.12 (from -r <https://builds.apache.org/job/beam_PerformanceTests_Python/ws/PerfKitBenchmarker/requirements.txt>
(line 20))
Collecting pint>=0.7 (from -r <https://builds.apache.org/job/beam_PerformanceTests_Python/ws/PerfKitBenchmarker/requirements.txt>
(line 21))
Collecting numpy==1.13.3 (from -r <https://builds.apache.org/job/beam_PerformanceTests_Python/ws/PerfKitBenchmarker/requirements.txt>
(line 22))
  Using cached https://files.pythonhosted.org/packages/eb/be/737f3df5806192ac4096e549e48c8c76cfaa2fb880a1c62a7bb085adaa9b/numpy-1.13.3-cp27-cp27mu-manylinux1_x86_64.whl
Collecting functools32 (from -r <https://builds.apache.org/job/beam_PerformanceTests_Python/ws/PerfKitBenchmarker/requirements.txt>
(line 23))
Collecting contextlib2>=0.5.1 (from -r <https://builds.apache.org/job/beam_PerformanceTests_Python/ws/PerfKitBenchmarker/requirements.txt>
(line 24))
  Using cached https://files.pythonhosted.org/packages/a2/71/8273a7eeed0aff6a854237ab5453bc9aa67deb49df4832801c21f0ff3782/contextlib2-0.5.5-py2.py3-none-any.whl
Collecting pywinrm (from -r <https://builds.apache.org/job/beam_PerformanceTests_Python/ws/PerfKitBenchmarker/requirements.txt>
(line 25))
  Using cached https://files.pythonhosted.org/packages/0d/12/13a3117bbd2230043aa32dcfa2198c33269665eaa1a8fa26174ce49b338f/pywinrm-0.3.0-py2.py3-none-any.whl
Collecting timeout-decorator (from -r <https://builds.apache.org/job/beam_PerformanceTests_Python/ws/PerfKitBenchmarker/requirements.txt>
(line 26))
Collecting six (from absl-py->-r <https://builds.apache.org/job/beam_PerformanceTests_Python/ws/PerfKitBenchmarker/requirements.txt>
(line 14))
  Using cached https://files.pythonhosted.org/packages/67/4b/141a581104b1f6397bfa78ac9d43d8ad29a7ca43ea90a2d863fe3056e86a/six-1.11.0-py2.py3-none-any.whl
Collecting MarkupSafe>=0.23 (from jinja2>=2.7->-r <https://builds.apache.org/job/beam_PerformanceTests_Python/ws/PerfKitBenchmarker/requirements.txt>
(line 15))
Collecting colorama; extra == "windows" (from colorlog[windows]==2.6.0->-r <https://builds.apache.org/job/beam_PerformanceTests_Python/ws/PerfKitBenchmarker/requirements.txt>
(line 17))
  Using cached https://files.pythonhosted.org/packages/db/c8/7dcf9dbcb22429512708fe3a547f8b6101c0d02137acbd892505aee57adf/colorama-0.3.9-py2.py3-none-any.whl
Collecting requests-ntlm>=0.3.0 (from pywinrm->-r <https://builds.apache.org/job/beam_PerformanceTests_Python/ws/PerfKitBenchmarker/requirements.txt>
(line 25))
  Using cached https://files.pythonhosted.org/packages/03/4b/8b9a1afde8072c4d5710d9fa91433d504325821b038e00237dc8d6d833dc/requests_ntlm-1.1.0-py2.py3-none-any.whl
Collecting requests>=2.9.1 (from pywinrm->-r <https://builds.apache.org/job/beam_PerformanceTests_Python/ws/PerfKitBenchmarker/requirements.txt>
(line 25))
  Using cached https://files.pythonhosted.org/packages/65/47/7e02164a2a3db50ed6d8a6ab1d6d60b69c4c3fdf57a284257925dfc12bda/requests-2.19.1-py2.py3-none-any.whl
Collecting xmltodict (from pywinrm->-r <https://builds.apache.org/job/beam_PerformanceTests_Python/ws/PerfKitBenchmarker/requirements.txt>
(line 25))
  Using cached https://files.pythonhosted.org/packages/42/a9/7e99652c6bc619d19d58cdd8c47560730eb5825d43a7e25db2e1d776ceb7/xmltodict-0.11.0-py2.py3-none-any.whl
Collecting cryptography>=1.3 (from requests-ntlm>=0.3.0->pywinrm->-r <https://builds.apache.org/job/beam_PerformanceTests_Python/ws/PerfKitBenchmarker/requirements.txt>
(line 25))
  Using cached https://files.pythonhosted.org/packages/87/e6/915a482dbfef98bbdce6be1e31825f591fc67038d4ee09864c1d2c3db371/cryptography-2.3.1-cp27-cp27mu-manylinux1_x86_64.whl
Collecting ntlm-auth>=1.0.2 (from requests-ntlm>=0.3.0->pywinrm->-r <https://builds.apache.org/job/beam_PerformanceTests_Python/ws/PerfKitBenchmarker/requirements.txt>
(line 25))
  Using cached https://files.pythonhosted.org/packages/8e/5b/4047779fb456b0de503c4acb7b166becf2567efb772abb53998440791d3c/ntlm_auth-1.2.0-py2.py3-none-any.whl
Collecting certifi>=2017.4.17 (from requests>=2.9.1->pywinrm->-r <https://builds.apache.org/job/beam_PerformanceTests_Python/ws/PerfKitBenchmarker/requirements.txt>
(line 25))
  Using cached https://files.pythonhosted.org/packages/df/f7/04fee6ac349e915b82171f8e23cee63644d83663b34c539f7a09aed18f9e/certifi-2018.8.24-py2.py3-none-any.whl
Collecting chardet<3.1.0,>=3.0.2 (from requests>=2.9.1->pywinrm->-r <https://builds.apache.org/job/beam_PerformanceTests_Python/ws/PerfKitBenchmarker/requirements.txt>
(line 25))
  Using cached https://files.pythonhosted.org/packages/bc/a9/01ffebfb562e4274b6487b4bb1ddec7ca55ec7510b22e4c51f14098443b8/chardet-3.0.4-py2.py3-none-any.whl
Collecting urllib3<1.24,>=1.21.1 (from requests>=2.9.1->pywinrm->-r <https://builds.apache.org/job/beam_PerformanceTests_Python/ws/PerfKitBenchmarker/requirements.txt>
(line 25))
  Using cached https://files.pythonhosted.org/packages/bd/c9/6fdd990019071a4a32a5e7cb78a1d92c53851ef4f56f62a3486e6a7d8ffb/urllib3-1.23-py2.py3-none-any.whl
Collecting idna<2.8,>=2.5 (from requests>=2.9.1->pywinrm->-r <https://builds.apache.org/job/beam_PerformanceTests_Python/ws/PerfKitBenchmarker/requirements.txt>
(line 25))
  Using cached https://files.pythonhosted.org/packages/4b/2a/0276479a4b3caeb8a8c1af2f8e4355746a97fab05a372e4a2c6a6b876165/idna-2.7-py2.py3-none-any.whl
Collecting enum34; python_version < "3" (from cryptography>=1.3->requests-ntlm>=0.3.0->pywinrm->-r
<https://builds.apache.org/job/beam_PerformanceTests_Python/ws/PerfKitBenchmarker/requirements.txt>
(line 25))
  Using cached https://files.pythonhosted.org/packages/c5/db/e56e6b4bbac7c4a06de1c50de6fe1ef3810018ae11732a50f15f62c7d050/enum34-1.1.6-py2-none-any.whl
Collecting asn1crypto>=0.21.0 (from cryptography>=1.3->requests-ntlm>=0.3.0->pywinrm->-r
<https://builds.apache.org/job/beam_PerformanceTests_Python/ws/PerfKitBenchmarker/requirements.txt>
(line 25))
  Using cached https://files.pythonhosted.org/packages/ea/cd/35485615f45f30a510576f1a56d1e0a7ad7bd8ab5ed7cdc600ef7cd06222/asn1crypto-0.24.0-py2.py3-none-any.whl
Collecting cffi!=1.11.3,>=1.7 (from cryptography>=1.3->requests-ntlm>=0.3.0->pywinrm->-r
<https://builds.apache.org/job/beam_PerformanceTests_Python/ws/PerfKitBenchmarker/requirements.txt>
(line 25))
  Using cached https://files.pythonhosted.org/packages/14/dd/3e7a1e1280e7d767bd3fa15791759c91ec19058ebe31217fe66f3e9a8c49/cffi-1.11.5-cp27-cp27mu-manylinux1_x86_64.whl
Collecting ipaddress; python_version < "3" (from cryptography>=1.3->requests-ntlm>=0.3.0->pywinrm->-r
<https://builds.apache.org/job/beam_PerformanceTests_Python/ws/PerfKitBenchmarker/requirements.txt>
(line 25))
  Using cached https://files.pythonhosted.org/packages/fc/d0/7fc3a811e011d4b388be48a0e381db8d990042df54aa4ef4599a31d39853/ipaddress-1.0.22-py2.py3-none-any.whl
Collecting pycparser (from cffi!=1.11.3,>=1.7->cryptography>=1.3->requests-ntlm>=0.3.0->pywinrm->-r
<https://builds.apache.org/job/beam_PerformanceTests_Python/ws/PerfKitBenchmarker/requirements.txt>
(line 25))
Installing collected packages: six, absl-py, MarkupSafe, jinja2, colorama, colorlog, blinker,
futures, PyYAML, pint, numpy, functools32, contextlib2, certifi, chardet, urllib3, idna, requests,
enum34, asn1crypto, pycparser, cffi, ipaddress, cryptography, ntlm-auth, requests-ntlm, xmltodict,
pywinrm, timeout-decorator
Successfully installed MarkupSafe-1.0 PyYAML-3.12 absl-py-0.4.1 asn1crypto-0.24.0 blinker-1.4
certifi-2018.8.24 cffi-1.11.5 chardet-3.0.4 colorama-0.3.9 colorlog-2.6.0 contextlib2-0.5.5
cryptography-2.3.1 enum34-1.1.6 functools32-3.2.3.post2 futures-3.2.0 idna-2.7 ipaddress-1.0.22
jinja2-2.10 ntlm-auth-1.2.0 numpy-1.13.3 pint-0.8.1 pycparser-2.18 pywinrm-0.3.0 requests-2.19.1
requests-ntlm-1.1.0 six-1.11.0 timeout-decorator-0.4.0 urllib3-1.23 xmltodict-0.11.0
[beam_PerformanceTests_Python] $ /bin/bash -xe /tmp/jenkins1551665400895034676.sh
+ <https://builds.apache.org/job/beam_PerformanceTests_Python/ws/env/.perfkit_env/bin/python>
<https://builds.apache.org/job/beam_PerformanceTests_Python/ws/PerfKitBenchmarker/pkb.py>
--project=apache-beam-testing --dpb_log_level=INFO --bigquery_table=beam_performance.wordcount_py_pkb_results
--k8s_get_retry_count=36 --k8s_get_wait_interval=10 --python_binary=<https://builds.apache.org/job/beam_PerformanceTests_Python/ws/.beam_env/bin/python>
--temp_dir=<https://builds.apache.org/job/beam_PerformanceTests_Python/ws/> --beam_location=<https://builds.apache.org/job/beam_PerformanceTests_Python/ws/src>
--official=true --beam_sdk=python --benchmarks=beam_integration_benchmark --beam_it_class=apache_beam.examples.wordcount_it_test:WordCountIT.test_wordcount_it
--beam_prebuilt=true --beam_it_args=--project=apache-beam-testing,--staging_location=gs://temp-storage-for-end-to-end-tests/staging-it,--temp_location=gs://temp-storage-for-end-to-end-tests/temp-it,--output=gs://temp-storage-for-end-to-end-tests/py-it-cloud/output
2018-09-04 11:00:06,868 61d51ff7 MainThread INFO     Verbose logging to: <https://builds.apache.org/job/beam_PerformanceTests_Python/ws/runs/61d51ff7/pkb.log>
2018-09-04 11:00:06,869 61d51ff7 MainThread INFO     PerfKitBenchmarker version: v1.12.0-812-gcdde510
2018-09-04 11:00:06,869 61d51ff7 MainThread INFO     Flag values:
--beam_it_class=apache_beam.examples.wordcount_it_test:WordCountIT.test_wordcount_it
--beam_sdk=python
--k8s_get_wait_interval=10
--python_binary=<https://builds.apache.org/job/beam_PerformanceTests_Python/ws/.beam_env/bin/python>
--temp_dir=<https://builds.apache.org/job/beam_PerformanceTests_Python/ws/>
--beam_it_args=--project=apache-beam-testing,--staging_location=gs://temp-storage-for-end-to-end-tests/staging-it,--temp_location=gs://temp-storage-for-end-to-end-tests/temp-it,--output=gs://temp-storage-for-end-to-end-tests/py-it-cloud/output
--beam_prebuilt
--project=apache-beam-testing
--bigquery_table=beam_performance.wordcount_py_pkb_results
--official
--dpb_log_level=INFO
--beam_location=<https://builds.apache.org/job/beam_PerformanceTests_Python/ws/src>
--k8s_get_retry_count=36
--benchmarks=beam_integration_benchmark
2018-09-04 11:00:07,147 61d51ff7 MainThread WARNING  The key "flags" was not in the default
config, but was in user overrides. This may indicate a typo.
2018-09-04 11:00:07,306 61d51ff7 MainThread beam_integration_benchmark(1/1) INFO     Provisioning
resources for benchmark beam_integration_benchmark
2018-09-04 11:00:07,309 61d51ff7 MainThread beam_integration_benchmark(1/1) INFO     Preparing
benchmark beam_integration_benchmark
2018-09-04 11:00:07,309 61d51ff7 MainThread beam_integration_benchmark(1/1) INFO     Running
benchmark beam_integration_benchmark
2018-09-04 11:00:07,322 61d51ff7 MainThread beam_integration_benchmark(1/1) INFO     Running:
<https://builds.apache.org/job/beam_PerformanceTests_Python/ws/.beam_env/bin/python>
setup.py nosetests --tests=apache_beam.examples.wordcount_it_test:WordCountIT.test_wordcount_it
--attr=IT --test-pipeline-options="--project=apache-beam-testing" "--staging_location=gs://temp-storage-for-end-to-end-tests/staging-it"
"--temp_location=gs://temp-storage-for-end-to-end-tests/temp-it" "--output=gs://temp-storage-for-end-to-end-tests/py-it-cloud/output"
"--runner=TestDataflowRunner" "--sdk_location=<https://builds.apache.org/job/beam_PerformanceTests_Python/ws/src/sdks/python/target/apache-beam-2.8.0.dev0.tar.gz">
2018-09-04 11:00:07,674 61d51ff7 MainThread beam_integration_benchmark(1/1) INFO     Ran:
{<https://builds.apache.org/job/beam_PerformanceTests_Python/ws/.beam_env/bin/python>
setup.py nosetests --tests=apache_beam.examples.wordcount_it_test:WordCountIT.test_wordcount_it
--attr=IT --test-pipeline-options="--project=apache-beam-testing" "--staging_location=gs://temp-storage-for-end-to-end-tests/staging-it"
"--temp_location=gs://temp-storage-for-end-to-end-tests/temp-it" "--output=gs://temp-storage-for-end-to-end-tests/py-it-cloud/output"
"--runner=TestDataflowRunner" "--sdk_location=<https://builds.apache.org/job/beam_PerformanceTests_Python/ws/src/sdks/python/target/apache-beam-2.8.0.dev0.tar.gz"}>
 ReturnCode:1
STDOUT: 
STDERR: <https://builds.apache.org/job/beam_PerformanceTests_Python/ws/.beam_env/local/lib/python2.7/site-packages/setuptools/dist.py>:398:
UserWarning: Normalizing '2.8.0.dev' to '2.8.0.dev0'
  normalized_version,
/home/jenkins/.local/lib/python2.7/site-packages/nose/plugins/manager.py:395: RuntimeWarning:
Unable to load plugin beam_test_plugin = test_config:BeamTestPlugin: (fastavro 0.19.7 (/home/jenkins/.local/lib/python2.7/site-packages),
Requirement.parse('fastavro==0.21.4'))
  RuntimeWarning)
usage: setup.py [global_opts] cmd1 [cmd1_opts] [cmd2 [cmd2_opts] ...]
   or: setup.py --help [cmd1 cmd2 ...]
   or: setup.py --help-commands
   or: setup.py cmd --help

error: option --test-pipeline-options not recognized

2018-09-04 11:00:07,675 61d51ff7 MainThread beam_integration_benchmark(1/1) ERROR    Error
during benchmark beam_integration_benchmark
Traceback (most recent call last):
  File "<https://builds.apache.org/job/beam_PerformanceTests_Python/ws/PerfKitBenchmarker/perfkitbenchmarker/pkb.py",>
line 676, in RunBenchmark
    DoRunPhase(spec, collector, detailed_timer)
  File "<https://builds.apache.org/job/beam_PerformanceTests_Python/ws/PerfKitBenchmarker/perfkitbenchmarker/pkb.py",>
line 556, in DoRunPhase
    samples = spec.BenchmarkRun(spec)
  File "<https://builds.apache.org/job/beam_PerformanceTests_Python/ws/PerfKitBenchmarker/perfkitbenchmarker/linux_benchmarks/beam_integration_benchmark.py",>
line 160, in Run
    job_type=job_type)
  File "<https://builds.apache.org/job/beam_PerformanceTests_Python/ws/PerfKitBenchmarker/perfkitbenchmarker/providers/gcp/gcp_dpb_dataflow.py",>
line 90, in SubmitJob
    assert retcode == 0, "Integration Test Failed."
AssertionError: Integration Test Failed.
2018-09-04 11:00:07,676 61d51ff7 MainThread beam_integration_benchmark(1/1) INFO     Cleaning
up benchmark beam_integration_benchmark
2018-09-04 11:00:07,678 61d51ff7 MainThread beam_integration_benchmark(1/1) ERROR    Exception
running benchmark
Traceback (most recent call last):
  File "<https://builds.apache.org/job/beam_PerformanceTests_Python/ws/PerfKitBenchmarker/perfkitbenchmarker/pkb.py",>
line 812, in RunBenchmarkTask
    RunBenchmark(spec, collector)
  File "<https://builds.apache.org/job/beam_PerformanceTests_Python/ws/PerfKitBenchmarker/perfkitbenchmarker/pkb.py",>
line 676, in RunBenchmark
    DoRunPhase(spec, collector, detailed_timer)
  File "<https://builds.apache.org/job/beam_PerformanceTests_Python/ws/PerfKitBenchmarker/perfkitbenchmarker/pkb.py",>
line 556, in DoRunPhase
    samples = spec.BenchmarkRun(spec)
  File "<https://builds.apache.org/job/beam_PerformanceTests_Python/ws/PerfKitBenchmarker/perfkitbenchmarker/linux_benchmarks/beam_integration_benchmark.py",>
line 160, in Run
    job_type=job_type)
  File "<https://builds.apache.org/job/beam_PerformanceTests_Python/ws/PerfKitBenchmarker/perfkitbenchmarker/providers/gcp/gcp_dpb_dataflow.py",>
line 90, in SubmitJob
    assert retcode == 0, "Integration Test Failed."
AssertionError: Integration Test Failed.
2018-09-04 11:00:07,679 61d51ff7 MainThread beam_integration_benchmark(1/1) ERROR    Benchmark
1/1 beam_integration_benchmark (UID: beam_integration_benchmark0) failed. Execution will continue.
2018-09-04 11:00:07,722 61d51ff7 MainThread INFO     Benchmark run statuses:
---------------------------------------------------------------------------------
Name                        UID                          Status  Failed Substatus
---------------------------------------------------------------------------------
beam_integration_benchmark  beam_integration_benchmark0  FAILED                  
---------------------------------------------------------------------------------
Success rate: 0.00% (0/1)
2018-09-04 11:00:07,723 61d51ff7 MainThread INFO     Complete logs can be found at: <https://builds.apache.org/job/beam_PerformanceTests_Python/ws/runs/61d51ff7/pkb.log>
2018-09-04 11:00:07,724 61d51ff7 MainThread INFO     Completion statuses can be found at:
<https://builds.apache.org/job/beam_PerformanceTests_Python/ws/runs/61d51ff7/completion_statuses.json>
Build step 'Execute shell' marked build as failure

Mime
View raw message