beam-commits mailing list archives

Site index · List index
Message view « Date » · « Thread »
Top « Date » · « Thread »
From Apache Jenkins Server <jenk...@builds.apache.org>
Subject Build failed in Jenkins: beam_PostCommit_Python_PVR_Flink_Gradle #75
Date Thu, 20 Sep 2018 06:06:25 GMT
See <https://builds.apache.org/job/beam_PostCommit_Python_PVR_Flink_Gradle/75/display/redirect>

------------------------------------------
[...truncated 554.11 KB...]
    raise self
_Rendezvous: <_Rendezvous of RPC that terminated with:
	status = StatusCode.UNAVAILABLE
	details = "Socket closed"
	debug_error_string = "{"created":"@1537423583.578874007","description":"Error received from
peer","file":"src/core/lib/surface/call.cc","file_line":1099,"grpc_message":"Socket closed","grpc_status":14}"
>


======================================================================
ERROR: test_combine_per_key (__main__.FlinkRunnerTest)
----------------------------------------------------------------------
Traceback (most recent call last):
  File "apache_beam/runners/portability/fn_api_runner_test.py", line 251, in test_combine_per_key
    assert_that(res, equal_to([('a', 1.5), ('b', 3.0)]))
  File "apache_beam/pipeline.py", line 414, in __exit__
    self.run().wait_until_finish()
  File "apache_beam/runners/portability/portable_runner.py", line 209, in wait_until_finish
    'Pipeline %s failed in state %s.' % (self._job_id, self._state))
RuntimeError: Pipeline test_combine_per_key_1537423576.22_7f84a5f6-e8f9-46fd-8461-816a037f86ab
failed in state FAILED.

======================================================================
ERROR: test_create (__main__.FlinkRunnerTest)
----------------------------------------------------------------------
Traceback (most recent call last):
  File "apache_beam/runners/portability/fn_api_runner_test.py", line 62, in test_create
    assert_that(p | beam.Create(['a', 'b']), equal_to(['a', 'b']))
  File "apache_beam/pipeline.py", line 414, in __exit__
    self.run().wait_until_finish()
  File "apache_beam/runners/portability/portable_runner.py", line 209, in wait_until_finish
    'Pipeline %s failed in state %s.' % (self._job_id, self._state))
RuntimeError: Pipeline test_create_1537423576.55_379cabb2-0b8a-4d10-92a2-5e732df24eb2 failed
in state FAILED.

======================================================================
ERROR: test_flatten (__main__.FlinkRunnerTest)
----------------------------------------------------------------------
Traceback (most recent call last):
  File "apache_beam/runners/portability/fn_api_runner_test.py", line 244, in test_flatten
    assert_that(res, equal_to(['a', 'b', 'c', 'd']))
  File "apache_beam/pipeline.py", line 414, in __exit__
    self.run().wait_until_finish()
  File "apache_beam/runners/portability/portable_runner.py", line 209, in wait_until_finish
    'Pipeline %s failed in state %s.' % (self._job_id, self._state))
RuntimeError: Pipeline test_flatten_1537423577.04_999979df-ccd4-416a-9709-fda22fa028ee failed
in state FAILED.

======================================================================
ERROR: test_flattened_side_input (__main__.FlinkRunnerTest)
----------------------------------------------------------------------
Traceback (most recent call last):
  File "apache_beam/runners/portability/fn_api_runner_test.py", line 190, in test_flattened_side_input
    equal_to([(None, {'a': 1, 'b': 2})]))
  File "apache_beam/pipeline.py", line 414, in __exit__
    self.run().wait_until_finish()
  File "apache_beam/runners/portability/portable_runner.py", line 209, in wait_until_finish
    'Pipeline %s failed in state %s.' % (self._job_id, self._state))
RuntimeError: Pipeline test_flattened_side_input_1537423577.49_5df43ffc-55c8-47ce-8241-2fffff91ed7b
failed in state FAILED.

======================================================================
ERROR: test_gbk_side_input (__main__.FlinkRunnerTest)
----------------------------------------------------------------------
Traceback (most recent call last):
  File "apache_beam/runners/portability/fn_api_runner_test.py", line 198, in test_gbk_side_input
    equal_to([(None, {'a': [1]})]))
  File "apache_beam/pipeline.py", line 414, in __exit__
    self.run().wait_until_finish()
  File "apache_beam/runners/portability/portable_runner.py", line 209, in wait_until_finish
    'Pipeline %s failed in state %s.' % (self._job_id, self._state))
RuntimeError: Pipeline test_gbk_side_input_1537423577.95_91f3aab4-a8c6-4387-8a07-0fcc9b79f44c
failed in state FAILED.

======================================================================
ERROR: test_group_by_key (__main__.FlinkRunnerTest)
----------------------------------------------------------------------
Traceback (most recent call last):
  File "apache_beam/runners/portability/fn_api_runner_test.py", line 237, in test_group_by_key
    assert_that(res, equal_to([('a', [1, 2]), ('b', [3])]))
  File "apache_beam/pipeline.py", line 414, in __exit__
    self.run().wait_until_finish()
  File "apache_beam/runners/portability/portable_runner.py", line 209, in wait_until_finish
    'Pipeline %s failed in state %s.' % (self._job_id, self._state))
RuntimeError: Pipeline test_group_by_key_1537423578.41_9b9d81ed-c0a2-4d7c-9d94-535081becd6e
failed in state FAILED.

======================================================================
ERROR: test_large_elements (__main__.FlinkRunnerTest)
----------------------------------------------------------------------
Traceback (most recent call last):
  File "apache_beam/runners/portability/fn_api_runner_test.py", line 293, in test_large_elements
    assert_that(gbk_res, equal_to(['a', 'b']), label='gbk')
  File "apache_beam/pipeline.py", line 414, in __exit__
    self.run().wait_until_finish()
  File "apache_beam/runners/portability/portable_runner.py", line 209, in wait_until_finish
    'Pipeline %s failed in state %s.' % (self._job_id, self._state))
RuntimeError: Pipeline test_large_elements_1537423578.72_9fae2b44-6510-462e-b56c-e357d2c25999
failed in state FAILED.

======================================================================
ERROR: test_multimap_side_input (__main__.FlinkRunnerTest)
----------------------------------------------------------------------
Traceback (most recent call last):
  File "apache_beam/runners/portability/fn_api_runner_test.py", line 209, in test_multimap_side_input
    equal_to([('a', [1, 3]), ('b', [2])]))
  File "apache_beam/pipeline.py", line 414, in __exit__
    self.run().wait_until_finish()
  File "apache_beam/runners/portability/portable_runner.py", line 209, in wait_until_finish
    'Pipeline %s failed in state %s.' % (self._job_id, self._state))
RuntimeError: Pipeline test_multimap_side_input_1537423579.22_4f9bbde5-c678-4601-9643-5e3b0242efdc
failed in state FAILED.

======================================================================
ERROR: test_pardo (__main__.FlinkRunnerTest)
----------------------------------------------------------------------
Traceback (most recent call last):
  File "apache_beam/runners/portability/fn_api_runner_test.py", line 70, in test_pardo
    assert_that(res, equal_to(['aax', 'bcbcx']))
  File "apache_beam/pipeline.py", line 414, in __exit__
    self.run().wait_until_finish()
  File "apache_beam/runners/portability/portable_runner.py", line 209, in wait_until_finish
    'Pipeline %s failed in state %s.' % (self._job_id, self._state))
RuntimeError: Pipeline test_pardo_1537423579.6_67183c10-4f94-4e84-903d-ff8ac43292ee failed
in state FAILED.

======================================================================
ERROR: test_pardo_side_and_main_outputs (__main__.FlinkRunnerTest)
----------------------------------------------------------------------
Traceback (most recent call last):
  File "apache_beam/runners/portability/fn_api_runner_test.py", line 142, in test_pardo_side_and_main_outputs
    assert_that(unnamed.odd, equal_to([1, 3]), label='unnamed.odd')
  File "apache_beam/pipeline.py", line 414, in __exit__
    self.run().wait_until_finish()
  File "apache_beam/runners/portability/portable_runner.py", line 209, in wait_until_finish
    'Pipeline %s failed in state %s.' % (self._job_id, self._state))
RuntimeError: Pipeline test_pardo_side_and_main_outputs_1537423580.02_04a393c7-6c1d-475f-a5b3-4731dfbc0684
failed in state FAILED.

======================================================================
ERROR: test_pardo_side_inputs (__main__.FlinkRunnerTest)
----------------------------------------------------------------------
Traceback (most recent call last):
  File "apache_beam/runners/portability/fn_api_runner_test.py", line 153, in test_pardo_side_inputs
    ('a', 'y'), ('b', 'y'), ('c', 'y')]))
  File "apache_beam/pipeline.py", line 414, in __exit__
    self.run().wait_until_finish()
  File "apache_beam/runners/portability/portable_runner.py", line 209, in wait_until_finish
    'Pipeline %s failed in state %s.' % (self._job_id, self._state))
RuntimeError: Pipeline test_pardo_side_inputs_1537423581.37_dc84d417-321c-4b35-94d1-6c9c923b6de1
failed in state FAILED.

======================================================================
ERROR: test_pardo_side_outputs (__main__.FlinkRunnerTest)
----------------------------------------------------------------------
Traceback (most recent call last):
  File "apache_beam/runners/portability/fn_api_runner_test.py", line 124, in test_pardo_side_outputs
    assert_that(xy.y, equal_to(['y', 'xy']), label='y')
  File "apache_beam/pipeline.py", line 414, in __exit__
    self.run().wait_until_finish()
  File "apache_beam/runners/portability/portable_runner.py", line 209, in wait_until_finish
    'Pipeline %s failed in state %s.' % (self._job_id, self._state))
RuntimeError: Pipeline test_pardo_side_outputs_1537423581.73_e26564de-d6e0-4fea-8af0-e00eb136dcb7
failed in state FAILED.

======================================================================
ERROR: test_pardo_unfusable_side_inputs (__main__.FlinkRunnerTest)
----------------------------------------------------------------------
Traceback (most recent call last):
  File "apache_beam/runners/portability/fn_api_runner_test.py", line 219, in test_pardo_unfusable_side_inputs
    equal_to([('a', 'a'), ('a', 'b'), ('b', 'a'), ('b', 'b')]))
  File "apache_beam/pipeline.py", line 414, in __exit__
    self.run().wait_until_finish()
  File "apache_beam/runners/portability/portable_runner.py", line 209, in wait_until_finish
    'Pipeline %s failed in state %s.' % (self._job_id, self._state))
RuntimeError: Pipeline test_pardo_unfusable_side_inputs_1537423582.19_5344a03f-8b63-4888-b482-dc9df6cbc300
failed in state FAILED.

======================================================================
ERROR: test_pardo_windowed_side_inputs (__main__.FlinkRunnerTest)
----------------------------------------------------------------------
Traceback (most recent call last):
  File "apache_beam/runners/portability/fn_api_runner_test.py", line 180, in test_pardo_windowed_side_inputs
    label='windowed')
  File "apache_beam/pipeline.py", line 414, in __exit__
    self.run().wait_until_finish()
  File "apache_beam/runners/portability/portable_runner.py", line 209, in wait_until_finish
    'Pipeline %s failed in state %s.' % (self._job_id, self._state))
RuntimeError: Pipeline test_pardo_windowed_side_inputs_1537423582.47_1408a42f-a2cc-4049-b3c2-86d7b21cdac1
failed in state FAILED.

======================================================================
ERROR: test_read (__main__.FlinkRunnerTest)
----------------------------------------------------------------------
Traceback (most recent call last):
  File "<https://builds.apache.org/job/beam_PostCommit_Python_PVR_Flink_Gradle/ws/src/sdks/python/apache_beam/runners/portability/flink_runner_test.py",>
line 78, in test_read
    assert_that(lines, lambda lines: len(lines) > 0)
  File "apache_beam/pipeline.py", line 414, in __exit__
    self.run().wait_until_finish()
  File "apache_beam/runners/portability/portable_runner.py", line 209, in wait_until_finish
    'Pipeline %s failed in state %s.' % (self._job_id, self._state))
RuntimeError: Pipeline test_read_1537423582.81_773ff588-2734-45df-939f-7f42bebcdbf4 failed
in state FAILED.

======================================================================
ERROR: test_windowing (__main__.FlinkRunnerTest)
----------------------------------------------------------------------
Traceback (most recent call last):
  File "apache_beam/runners/portability/fn_api_runner_test.py", line 274, in test_windowing
    assert_that(res, equal_to([('k', [1, 2]), ('k', [100, 101, 102])]))
  File "apache_beam/pipeline.py", line 414, in __exit__
    self.run().wait_until_finish()
  File "apache_beam/runners/portability/portable_runner.py", line 209, in wait_until_finish
    'Pipeline %s failed in state %s.' % (self._job_id, self._state))
RuntimeError: Pipeline test_windowing_1537423583.19_8dae7843-ce55-4e31-934f-e7663e65c8d6 failed
in state FAILED.

----------------------------------------------------------------------
Ran 23 tests in 11.228s

FAILED (errors=16, skipped=5)

> Task :beam-sdks-python:flinkCompatibilityMatrixStreaming FAILED
:beam-sdks-python:flinkCompatibilityMatrixStreaming (Thread[Task worker for ':' Thread 7,5,main])
completed. Took 12.92 secs.

FAILURE: Build completed with 2 failures.

1: Task failed with an exception.
-----------
* Where:
Build file '<https://builds.apache.org/job/beam_PostCommit_Python_PVR_Flink_Gradle/ws/src/sdks/python/build.gradle'>
line: 340

* What went wrong:
Execution failed for task ':beam-sdks-python:flinkCompatibilityMatrixBatch'.
> Process 'command 'sh'' finished with non-zero exit value 1

* Try:
Run with --stacktrace option to get the stack trace. Run with --debug option to get more log
output. Run with --scan to get full insights.
==============================================================================

2: Task failed with an exception.
-----------
* Where:
Build file '<https://builds.apache.org/job/beam_PostCommit_Python_PVR_Flink_Gradle/ws/src/sdks/python/build.gradle'>
line: 340

* What went wrong:
Execution failed for task ':beam-sdks-python:flinkCompatibilityMatrixStreaming'.
> Process 'command 'sh'' finished with non-zero exit value 1

* Try:
Run with --stacktrace option to get the stack trace. Run with --debug option to get more log
output. Run with --scan to get full insights.
==============================================================================

* Get more help at https://help.gradle.org

Deprecated Gradle features were used in this build, making it incompatible with Gradle 5.0.
See https://docs.gradle.org/4.8/userguide/command_line_interface.html#sec:command_line_warnings

BUILD FAILED in 6m 15s
59 actionable tasks: 54 executed, 4 from cache, 1 up-to-date

Publishing build scan...
https://gradle.com/s/ztekvqr6vwlag

Build step 'Invoke Gradle script' changed build result to FAILURE
Build step 'Invoke Gradle script' marked build as failure

Mime
View raw message