beam-commits mailing list archives

Site index · List index
Message view « Date » · « Thread »
Top « Date » · « Thread »
From Apache Jenkins Server <jenk...@builds.apache.org>
Subject Build failed in Jenkins: beam_PreCommit_Website_Cron #40
Date Mon, 10 Sep 2018 04:29:15 GMT
See <https://builds.apache.org/job/beam_PreCommit_Website_Cron/40/display/redirect>

------------------------------------------
[...truncated 7.81 KB...]

> Task :buildSrc:assemble
Skipping task ':buildSrc:assemble' as it has no actions.
:assemble (Thread[Task worker for ':buildSrc' Thread 8,5,main]) completed. Took 0.0 secs.
:spotlessGroovy (Thread[Task worker for ':buildSrc' Thread 8,5,main]) started.

> Task :buildSrc:spotlessGroovy
file or directory '<https://builds.apache.org/job/beam_PreCommit_Website_Cron/ws/src/buildSrc/src/test/groovy',>
not found
file or directory '<https://builds.apache.org/job/beam_PreCommit_Website_Cron/ws/src/buildSrc/src/test/groovy',>
not found
file or directory '<https://builds.apache.org/job/beam_PreCommit_Website_Cron/ws/src/buildSrc/src/test/groovy',>
not found
Caching disabled for task ':buildSrc:spotlessGroovy': Caching has not been enabled for the
task
Task ':buildSrc:spotlessGroovy' is not up-to-date because:
  No history is available.
All input files are considered out-of-date for incremental task ':buildSrc:spotlessGroovy'.
file or directory '<https://builds.apache.org/job/beam_PreCommit_Website_Cron/ws/src/buildSrc/src/test/groovy',>
not found
:spotlessGroovy (Thread[Task worker for ':buildSrc' Thread 8,5,main]) completed. Took 1.419
secs.
:spotlessGroovyCheck (Thread[Task worker for ':buildSrc' Thread 8,5,main]) started.

> Task :buildSrc:spotlessGroovyCheck
Skipping task ':buildSrc:spotlessGroovyCheck' as it has no actions.
:spotlessGroovyCheck (Thread[Task worker for ':buildSrc' Thread 8,5,main]) completed. Took
0.0 secs.
:spotlessGroovyGradle (Thread[Task worker for ':buildSrc' Thread 8,5,main]) started.

> Task :buildSrc:spotlessGroovyGradle
Caching disabled for task ':buildSrc:spotlessGroovyGradle': Caching has not been enabled for
the task
Task ':buildSrc:spotlessGroovyGradle' is not up-to-date because:
  No history is available.
All input files are considered out-of-date for incremental task ':buildSrc:spotlessGroovyGradle'.
:spotlessGroovyGradle (Thread[Task worker for ':buildSrc' Thread 8,5,main]) completed. Took
0.034 secs.
:spotlessGroovyGradleCheck (Thread[Task worker for ':buildSrc' Thread 8,5,main]) started.

> Task :buildSrc:spotlessGroovyGradleCheck
Skipping task ':buildSrc:spotlessGroovyGradleCheck' as it has no actions.
:spotlessGroovyGradleCheck (Thread[Task worker for ':buildSrc' Thread 8,5,main]) completed.
Took 0.0 secs.
:spotlessCheck (Thread[Task worker for ':buildSrc' Thread 8,5,main]) started.

> Task :buildSrc:spotlessCheck
Skipping task ':buildSrc:spotlessCheck' as it has no actions.
:spotlessCheck (Thread[Task worker for ':buildSrc' Thread 8,5,main]) completed. Took 0.0 secs.
:compileTestJava (Thread[Task worker for ':buildSrc' Thread 3,5,main]) started.

> Task :buildSrc:compileTestJava NO-SOURCE
file or directory '<https://builds.apache.org/job/beam_PreCommit_Website_Cron/ws/src/buildSrc/src/test/java',>
not found
Skipping task ':buildSrc:compileTestJava' as it has no source files and no previous output
files.
:compileTestJava (Thread[Task worker for ':buildSrc' Thread 3,5,main]) completed. Took 0.005
secs.
:compileTestGroovy (Thread[Task worker for ':buildSrc' Thread 3,5,main]) started.

> Task :buildSrc:compileTestGroovy NO-SOURCE
file or directory '<https://builds.apache.org/job/beam_PreCommit_Website_Cron/ws/src/buildSrc/src/test/groovy',>
not found
Skipping task ':buildSrc:compileTestGroovy' as it has no source files and no previous output
files.
:compileTestGroovy (Thread[Task worker for ':buildSrc' Thread 3,5,main]) completed. Took 0.004
secs.
:processTestResources (Thread[Task worker for ':buildSrc' Thread 3,5,main]) started.

> Task :buildSrc:processTestResources NO-SOURCE
file or directory '<https://builds.apache.org/job/beam_PreCommit_Website_Cron/ws/src/buildSrc/src/test/resources',>
not found
Skipping task ':buildSrc:processTestResources' as it has no source files and no previous output
files.
:processTestResources (Thread[Task worker for ':buildSrc' Thread 3,5,main]) completed. Took
0.003 secs.
:testClasses (Thread[Task worker for ':buildSrc' Thread 3,5,main]) started.

> Task :buildSrc:testClasses UP-TO-DATE
Skipping task ':buildSrc:testClasses' as it has no actions.
:testClasses (Thread[Task worker for ':buildSrc' Thread 3,5,main]) completed. Took 0.0 secs.
:test (Thread[Task worker for ':buildSrc' Thread 3,5,main]) started.

> Task :buildSrc:test NO-SOURCE
Skipping task ':buildSrc:test' as it has no source files and no previous output files.
:test (Thread[Task worker for ':buildSrc' Thread 3,5,main]) completed. Took 0.005 secs.
:check (Thread[Task worker for ':buildSrc' Thread 3,5,main]) started.

> Task :buildSrc:check
Skipping task ':buildSrc:check' as it has no actions.
:check (Thread[Task worker for ':buildSrc' Thread 3,5,main]) completed. Took 0.0 secs.
:build (Thread[Task worker for ':buildSrc' Thread 3,5,main]) started.

> Task :buildSrc:build
Skipping task ':buildSrc:build' as it has no actions.
:build (Thread[Task worker for ':buildSrc' Thread 3,5,main]) completed. Took 0.0 secs.
Settings evaluated using settings file '<https://builds.apache.org/job/beam_PreCommit_Website_Cron/ws/src/settings.gradle'.>
Using local directory build cache for the root build (location = /home/jenkins/.gradle/caches/build-cache-1,
removeUnusedEntriesAfter = 7 days).
Projects loaded. Root project using build file '<https://builds.apache.org/job/beam_PreCommit_Website_Cron/ws/src/build.gradle'.>
Included projects: [root project 'beam', project ':beam-examples-java', project ':beam-model-fn-execution',
project ':beam-model-job-management', project ':beam-model-pipeline', project ':beam-runners-apex',
project ':beam-runners-core-construction-java', project ':beam-runners-core-java', project
':beam-runners-direct-java', project ':beam-runners-extensions-java-metrics', project ':beam-runners-flink_2.11',
project ':beam-runners-flink_2.11-job-server', project ':beam-runners-flink_2.11-job-server-container',
project ':beam-runners-gcp-gcemd', project ':beam-runners-gcp-gcsproxy', project ':beam-runners-gearpump',
project ':beam-runners-google-cloud-dataflow-java', project ':beam-runners-google-cloud-dataflow-java-examples',
project ':beam-runners-google-cloud-dataflow-java-examples-streaming', project ':beam-runners-java-fn-execution',
project ':beam-runners-local-java-core', project ':beam-runners-reference-java', project ':beam-runners-samza',
project ':beam-runners-spark', project ':beam-sdks-go', project ':beam-sdks-go-container',
project ':beam-sdks-go-examples', project ':beam-sdks-go-test', project ':beam-sdks-java-build-tools',
project ':beam-sdks-java-container', project ':beam-sdks-java-core', project ':beam-sdks-java-extensions-google-cloud-platform-core',
project ':beam-sdks-java-extensions-join-library', project ':beam-sdks-java-extensions-json-jackson',
project ':beam-sdks-java-extensions-protobuf', project ':beam-sdks-java-extensions-sketching',
project ':beam-sdks-java-extensions-sorter', project ':beam-sdks-java-extensions-sql', project
':beam-sdks-java-extensions-sql-jdbc', project ':beam-sdks-java-extensions-sql-shell', project
':beam-sdks-java-fn-execution', project ':beam-sdks-java-harness', project ':beam-sdks-java-io-amazon-web-services',
project ':beam-sdks-java-io-amqp', project ':beam-sdks-java-io-cassandra', project ':beam-sdks-java-io-common',
project ':beam-sdks-java-io-elasticsearch', project ':beam-sdks-java-io-elasticsearch-tests-2',
project ':beam-sdks-java-io-elasticsearch-tests-5', project ':beam-sdks-java-io-elasticsearch-tests-6',
project ':beam-sdks-java-io-elasticsearch-tests-common', project ':beam-sdks-java-io-file-based-io-tests',
project ':beam-sdks-java-io-google-cloud-platform', project ':beam-sdks-java-io-hadoop-common',
project ':beam-sdks-java-io-hadoop-file-system', project ':beam-sdks-java-io-hadoop-input-format',
project ':beam-sdks-java-io-hbase', project ':beam-sdks-java-io-hcatalog', project ':beam-sdks-java-io-jdbc',
project ':beam-sdks-java-io-jms', project ':beam-sdks-java-io-kafka', project ':beam-sdks-java-io-kinesis',
project ':beam-sdks-java-io-kudu', project ':beam-sdks-java-io-mongodb', project ':beam-sdks-java-io-mqtt',
project ':beam-sdks-java-io-parquet', project ':beam-sdks-java-io-redis', project ':beam-sdks-java-io-solr',
project ':beam-sdks-java-io-synthetic', project ':beam-sdks-java-io-tika', project ':beam-sdks-java-io-xml',
project ':beam-sdks-java-javadoc', project ':beam-sdks-java-maven-archetypes-examples', project
':beam-sdks-java-maven-archetypes-starter', project ':beam-sdks-java-nexmark', project ':beam-sdks-python',
project ':beam-sdks-python-container', project ':beam-vendor-sdks-java-extensions-protobuf',
project ':beam-website', project ':release']
Parallel execution with configuration on demand is an incubating feature.

> Configure project :
Evaluating root project 'beam' using build file '<https://builds.apache.org/job/beam_PreCommit_Website_Cron/ws/src/build.gradle'.>
Selected primary task ':websitePreCommit' from project :

> Configure project :beam-website
Evaluating project ':beam-website' using build file '<https://builds.apache.org/job/beam_PreCommit_Website_Cron/ws/src/website/build.gradle'.>
All projects evaluated.
Tasks to be executed: [task ':rat', task ':beam-website:setupBuildDir', task ':beam-website:buildDockerImage',
task ':beam-website:createDockerContainer', task ':beam-website:startDockerContainer', task
':beam-website:buildWebsite', task ':beam-website:testWebsite', task ':beam-website:stopAndRemoveDockerContainer',
task ':beam-website:preCommit', task ':websitePreCommit']
VisTEG: Dependency graph written into <https://builds.apache.org/job/beam_PreCommit_Website_Cron/ws/src/build/reports/visteg.dot>
:rat (Thread[Task worker for ':',5,main]) started.
:beam-website:setupBuildDir (Thread[Task worker for ':' Thread 6,5,main]) started.

> Task :beam-website:setupBuildDir
Build cache key for task ':beam-website:setupBuildDir' is 7afd3bd0c1a9269d50131165bb8a63a1
Caching disabled for task ':beam-website:setupBuildDir': Caching has not been enabled for
the task
Task ':beam-website:setupBuildDir' is not up-to-date because:
  No history is available.
:beam-website:setupBuildDir (Thread[Task worker for ':' Thread 6,5,main]) completed. Took
0.034 secs.
:beam-website:buildDockerImage (Thread[Task worker for ':' Thread 6,5,main]) started.

> Task :beam-website:buildDockerImage
Caching disabled for task ':beam-website:buildDockerImage': Caching has not been enabled for
the task
Task ':beam-website:buildDockerImage' is not up-to-date because:
  Task has not declared any outputs despite executing actions.
Starting process 'command 'docker''. Working directory: <https://builds.apache.org/job/beam_PreCommit_Website_Cron/ws/src/website>
Command: docker build -t beam-website .
Successfully started process 'command 'docker''
Sending build context to Docker daemon  24.51MB
Step 1/7 : FROM ruby:2.5
 ---> 88666731c3e1
Step 2/7 : WORKDIR /ruby
 ---> Using cache
 ---> d67baab7ab9b
Step 3/7 : RUN gem install bundler
 ---> Using cache
 ---> 6b624ce3f83b
Step 4/7 : ADD Gemfile Gemfile.lock /ruby/
 ---> Using cache
 ---> f75fd93d65eb
Step 5/7 : RUN bundle install --deployment --path $GEM_HOME
 ---> Using cache
 ---> 435c2b08d6d0
Step 6/7 : ENV LC_ALL C.UTF-8
 ---> Using cache
 ---> 680cdf1ba8a5
Step 7/7 : CMD sleep 3600
 ---> Using cache
 ---> 7fb83dcd73ef
Successfully built 7fb83dcd73ef
Successfully tagged beam-website:latest
:beam-website:buildDockerImage (Thread[Task worker for ':' Thread 6,5,main]) completed. Took
0.282 secs.
:beam-website:createDockerContainer (Thread[Task worker for ':' Thread 6,5,main]) started.

> Task :beam-website:createDockerContainer
Caching disabled for task ':beam-website:createDockerContainer': Caching has not been enabled
for the task
Task ':beam-website:createDockerContainer' is not up-to-date because:
  Task has not declared any outputs despite executing actions.
Starting process 'command '/bin/bash''. Working directory: <https://builds.apache.org/job/beam_PreCommit_Website_Cron/ws/src/website>
Command: /bin/bash -c docker create -v <https://builds.apache.org/job/beam_PreCommit_Website_Cron/ws/src>:/repo
-u $(id -u):$(id -g) beam-website
Successfully started process 'command '/bin/bash''
:beam-website:createDockerContainer (Thread[Task worker for ':' Thread 6,5,main]) completed.
Took 0.212 secs.
:beam-website:startDockerContainer (Thread[Task worker for ':' Thread 6,5,main]) started.

> Task :beam-website:startDockerContainer
Caching disabled for task ':beam-website:startDockerContainer': Caching has not been enabled
for the task
Task ':beam-website:startDockerContainer' is not up-to-date because:
  Task has not declared any outputs despite executing actions.
Starting process 'command 'docker''. Working directory: <https://builds.apache.org/job/beam_PreCommit_Website_Cron/ws/src/website>
Command: docker start 3ee9a69ac764e7119449e2b838b1024c068dd557d9ccf714726e1f444610572f
Successfully started process 'command 'docker''
3ee9a69ac764e7119449e2b838b1024c068dd557d9ccf714726e1f444610572f
:beam-website:startDockerContainer (Thread[Task worker for ':' Thread 6,5,main]) completed.
Took 0.289 secs.
:beam-website:buildWebsite (Thread[Task worker for ':' Thread 6,5,main]) started.

> Task :rat
Build cache key for task ':rat' is d7af94837ebf442a0f22b045a3f4dd72
Caching disabled for task ':rat': Caching has not been enabled for the task
Task ':rat' is not up-to-date because:
  No history is available.
Rat XML report: <https://builds.apache.org/job/beam_PreCommit_Website_Cron/ws/src/build/reports/rat/rat-report.xml>
:rat (Thread[Task worker for ':',5,main]) completed. Took 3.238 secs.

> Task :beam-website:buildWebsite
Build cache key for task ':beam-website:buildWebsite' is 35c9454ac55811536b0a1625deefcd85
Caching disabled for task ':beam-website:buildWebsite': Caching has not been enabled for the
task
Task ':beam-website:buildWebsite' is not up-to-date because:
  No history is available.
Starting process 'command 'docker''. Working directory: <https://builds.apache.org/job/beam_PreCommit_Website_Cron/ws/src/website>
Command: docker exec 3ee9a69ac764e7119449e2b838b1024c068dd557d9ccf714726e1f444610572f /bin/bash
-c cd /repo/build/website &&       bundle exec jekyll build       --config /repo/website/_config.yml
      --incremental       --source /repo/website/src
      
Successfully started process 'command 'docker''
`/` is not writable.
Bundler will use `/tmp/bundler/home/unknown' as your home directory temporarily.
Configuration file: /repo/website/_config.yml
            Source: /repo/website/src
       Destination: content
 Incremental build: enabled
      Generating... 
                    done in 12.581 seconds.
 Auto-regeneration: disabled. Use --watch to enable.
:beam-website:buildWebsite (Thread[Task worker for ':' Thread 6,5,main]) completed. Took 14.409
secs.
:beam-website:testWebsite (Thread[Task worker for ':' Thread 6,5,main]) started.

> Task :beam-website:testWebsite
Caching disabled for task ':beam-website:testWebsite': Caching has not been enabled for the
task
Task ':beam-website:testWebsite' is not up-to-date because:
  Task has not declared any outputs despite executing actions.
Starting process 'command 'docker''. Working directory: <https://builds.apache.org/job/beam_PreCommit_Website_Cron/ws/src/website>
Command: docker exec 3ee9a69ac764e7119449e2b838b1024c068dd557d9ccf714726e1f444610572f /bin/bash
-c cd /repo/build/website &&       bundle exec rake test
Successfully started process 'command 'docker''
`/` is not writable.
Bundler will use `/tmp/bundler/home/unknown' as your home directory temporarily.
Running ["HtmlCheck", "LinkCheck", "ImageCheck", "ScriptCheck"] on ["./content"] on *.html...



Checking 566 external links...
Ran on 135 files!


- ./content/contribute/release-guide/index.html
  *  External link https://github.com/apache/beam/blob/master/runners/google-cloud-dataflow-java/pom.xml
failed: 404 No error
- ./content/get-started/downloads/index.html
  *  External link https://dist.apache.org/repos/dist/release/beam/2.5.0/apache-beam-2.5.0-source-release.zip
failed: 404 No error
  *  External link https://dist.apache.org/repos/dist/release/beam/2.5.0/apache-beam-2.5.0-source-release.zip.asc
failed: 404 No error
  *  External link https://dist.apache.org/repos/dist/release/beam/2.5.0/apache-beam-2.5.0-source-release.zip.sha512
failed: 404 No error
rake aborted!
HTML-Proofer found 4 failures!
/usr/local/bundle/ruby/2.5.0/gems/html-proofer-3.8.0/lib/html-proofer/runner.rb:167:in `print_failed_tests'
/usr/local/bundle/ruby/2.5.0/gems/html-proofer-3.8.0/lib/html-proofer/runner.rb:48:in `run'
/repo/build/website/Rakefile:23:in `block in <top (required)>'
/usr/local/bundle/ruby/2.5.0/gems/rake-12.3.0/exe/rake:27:in `<top (required)>'
/usr/local/bundle/bin/bundle:23:in `load'
/usr/local/bundle/bin/bundle:23:in `<main>'
Tasks: TOP => test
(See full trace by running task with --trace)

> Task :beam-website:testWebsite FAILED
:beam-website:testWebsite (Thread[Task worker for ':' Thread 6,5,main]) completed. Took 23.348
secs.
:beam-website:stopAndRemoveDockerContainer (Thread[Task worker for ':' Thread 6,5,main]) started.

> Task :beam-website:stopAndRemoveDockerContainer
Caching disabled for task ':beam-website:stopAndRemoveDockerContainer': Caching has not been
enabled for the task
Task ':beam-website:stopAndRemoveDockerContainer' is not up-to-date because:
  Task has not declared any outputs despite executing actions.
Starting process 'command 'docker''. Working directory: <https://builds.apache.org/job/beam_PreCommit_Website_Cron/ws/src/website>
Command: docker rm -f 3ee9a69ac764e7119449e2b838b1024c068dd557d9ccf714726e1f444610572f
Successfully started process 'command 'docker''
3ee9a69ac764e7119449e2b838b1024c068dd557d9ccf714726e1f444610572f
:beam-website:stopAndRemoveDockerContainer (Thread[Task worker for ':' Thread 6,5,main]) completed.
Took 0.371 secs.

FAILURE: Build failed with an exception.

* What went wrong:
Execution failed for task ':beam-website:testWebsite'.
> Process 'command 'docker'' finished with non-zero exit value 1

* Try:
Run with --stacktrace option to get the stack trace. Run with --debug option to get more log
output. Run with --scan to get full insights.

* Get more help at https://help.gradle.org

Deprecated Gradle features were used in this build, making it incompatible with Gradle 5.0.
See https://docs.gradle.org/4.8/userguide/command_line_interface.html#sec:command_line_warnings

BUILD FAILED in 50s
8 actionable tasks: 8 executed

Publishing build scan...
https://gradle.com/s/nqsh2mx2tz66g

Build step 'Invoke Gradle script' changed build result to FAILURE
Build step 'Invoke Gradle script' marked build as failure

Mime
View raw message