beam-commits mailing list archives

Site index · List index
Message view « Date » · « Thread »
Top « Date » · « Thread »
From Apache Jenkins Server <jenk...@builds.apache.org>
Subject Build failed in Jenkins: beam_PerformanceTests_Python #1375
Date Mon, 03 Sep 2018 12:18:32 GMT
See <https://builds.apache.org/job/beam_PerformanceTests_Python/1375/display/redirect?page=changes>

Changes:

[rpathak] [BEAM-3820] Exposing batchSize for SolrIO Writes

[rpathak] [BEAM-3820] Updating comments adding default batch size in javadoc

[Jozef.Vilcek] Remove slf4j-simple binding from dependencies

------------------------------------------
[...truncated 46.67 KB...]
copying apache_beam/runners/interactive/interactive_pipeline_graph.py -> apache-beam-2.8.0.dev0/apache_beam/runners/interactive
copying apache_beam/runners/interactive/interactive_runner.py -> apache-beam-2.8.0.dev0/apache_beam/runners/interactive
copying apache_beam/runners/interactive/interactive_runner_test.py -> apache-beam-2.8.0.dev0/apache_beam/runners/interactive
copying apache_beam/runners/interactive/pipeline_analyzer.py -> apache-beam-2.8.0.dev0/apache_beam/runners/interactive
copying apache_beam/runners/interactive/pipeline_analyzer_test.py -> apache-beam-2.8.0.dev0/apache_beam/runners/interactive
copying apache_beam/runners/interactive/pipeline_graph.py -> apache-beam-2.8.0.dev0/apache_beam/runners/interactive
copying apache_beam/runners/job/__init__.py -> apache-beam-2.8.0.dev0/apache_beam/runners/job
copying apache_beam/runners/job/manager.py -> apache-beam-2.8.0.dev0/apache_beam/runners/job
copying apache_beam/runners/job/utils.py -> apache-beam-2.8.0.dev0/apache_beam/runners/job
copying apache_beam/runners/portability/__init__.py -> apache-beam-2.8.0.dev0/apache_beam/runners/portability
copying apache_beam/runners/portability/flink_runner_test.py -> apache-beam-2.8.0.dev0/apache_beam/runners/portability
copying apache_beam/runners/portability/fn_api_runner.py -> apache-beam-2.8.0.dev0/apache_beam/runners/portability
copying apache_beam/runners/portability/fn_api_runner_test.py -> apache-beam-2.8.0.dev0/apache_beam/runners/portability
copying apache_beam/runners/portability/job_server.py -> apache-beam-2.8.0.dev0/apache_beam/runners/portability
copying apache_beam/runners/portability/local_job_service.py -> apache-beam-2.8.0.dev0/apache_beam/runners/portability
copying apache_beam/runners/portability/local_job_service_main.py -> apache-beam-2.8.0.dev0/apache_beam/runners/portability
copying apache_beam/runners/portability/portable_runner.py -> apache-beam-2.8.0.dev0/apache_beam/runners/portability
copying apache_beam/runners/portability/portable_runner_test.py -> apache-beam-2.8.0.dev0/apache_beam/runners/portability
copying apache_beam/runners/portability/portable_stager.py -> apache-beam-2.8.0.dev0/apache_beam/runners/portability
copying apache_beam/runners/portability/portable_stager_test.py -> apache-beam-2.8.0.dev0/apache_beam/runners/portability
copying apache_beam/runners/portability/stager.py -> apache-beam-2.8.0.dev0/apache_beam/runners/portability
copying apache_beam/runners/portability/stager_test.py -> apache-beam-2.8.0.dev0/apache_beam/runners/portability
copying apache_beam/runners/test/__init__.py -> apache-beam-2.8.0.dev0/apache_beam/runners/test
copying apache_beam/runners/worker/__init__.py -> apache-beam-2.8.0.dev0/apache_beam/runners/worker
copying apache_beam/runners/worker/bundle_processor.py -> apache-beam-2.8.0.dev0/apache_beam/runners/worker
copying apache_beam/runners/worker/data_plane.py -> apache-beam-2.8.0.dev0/apache_beam/runners/worker
copying apache_beam/runners/worker/data_plane_test.py -> apache-beam-2.8.0.dev0/apache_beam/runners/worker
copying apache_beam/runners/worker/log_handler.py -> apache-beam-2.8.0.dev0/apache_beam/runners/worker
copying apache_beam/runners/worker/log_handler_test.py -> apache-beam-2.8.0.dev0/apache_beam/runners/worker
copying apache_beam/runners/worker/logger.py -> apache-beam-2.8.0.dev0/apache_beam/runners/worker
copying apache_beam/runners/worker/logger_test.py -> apache-beam-2.8.0.dev0/apache_beam/runners/worker
copying apache_beam/runners/worker/opcounters.pxd -> apache-beam-2.8.0.dev0/apache_beam/runners/worker
copying apache_beam/runners/worker/opcounters.py -> apache-beam-2.8.0.dev0/apache_beam/runners/worker
copying apache_beam/runners/worker/opcounters_test.py -> apache-beam-2.8.0.dev0/apache_beam/runners/worker
copying apache_beam/runners/worker/operation_specs.py -> apache-beam-2.8.0.dev0/apache_beam/runners/worker
copying apache_beam/runners/worker/operations.pxd -> apache-beam-2.8.0.dev0/apache_beam/runners/worker
copying apache_beam/runners/worker/operations.py -> apache-beam-2.8.0.dev0/apache_beam/runners/worker
copying apache_beam/runners/worker/sdk_worker.py -> apache-beam-2.8.0.dev0/apache_beam/runners/worker
copying apache_beam/runners/worker/sdk_worker_main.py -> apache-beam-2.8.0.dev0/apache_beam/runners/worker
copying apache_beam/runners/worker/sdk_worker_main_test.py -> apache-beam-2.8.0.dev0/apache_beam/runners/worker
copying apache_beam/runners/worker/sdk_worker_test.py -> apache-beam-2.8.0.dev0/apache_beam/runners/worker
copying apache_beam/runners/worker/sideinputs.py -> apache-beam-2.8.0.dev0/apache_beam/runners/worker
copying apache_beam/runners/worker/sideinputs_test.py -> apache-beam-2.8.0.dev0/apache_beam/runners/worker
copying apache_beam/runners/worker/statesampler.py -> apache-beam-2.8.0.dev0/apache_beam/runners/worker
copying apache_beam/runners/worker/statesampler_fast.pxd -> apache-beam-2.8.0.dev0/apache_beam/runners/worker
copying apache_beam/runners/worker/statesampler_fast.pyx -> apache-beam-2.8.0.dev0/apache_beam/runners/worker
copying apache_beam/runners/worker/statesampler_slow.py -> apache-beam-2.8.0.dev0/apache_beam/runners/worker
copying apache_beam/runners/worker/statesampler_test.py -> apache-beam-2.8.0.dev0/apache_beam/runners/worker
copying apache_beam/runners/worker/worker_id_interceptor.py -> apache-beam-2.8.0.dev0/apache_beam/runners/worker
copying apache_beam/runners/worker/worker_id_interceptor_test.py -> apache-beam-2.8.0.dev0/apache_beam/runners/worker
copying apache_beam/testing/__init__.py -> apache-beam-2.8.0.dev0/apache_beam/testing
copying apache_beam/testing/pipeline_verifiers.py -> apache-beam-2.8.0.dev0/apache_beam/testing
copying apache_beam/testing/pipeline_verifiers_test.py -> apache-beam-2.8.0.dev0/apache_beam/testing
copying apache_beam/testing/synthetic_pipeline.py -> apache-beam-2.8.0.dev0/apache_beam/testing
copying apache_beam/testing/synthetic_pipeline_test.py -> apache-beam-2.8.0.dev0/apache_beam/testing
copying apache_beam/testing/test_pipeline.py -> apache-beam-2.8.0.dev0/apache_beam/testing
copying apache_beam/testing/test_pipeline_test.py -> apache-beam-2.8.0.dev0/apache_beam/testing
copying apache_beam/testing/test_stream.py -> apache-beam-2.8.0.dev0/apache_beam/testing
copying apache_beam/testing/test_stream_test.py -> apache-beam-2.8.0.dev0/apache_beam/testing
copying apache_beam/testing/test_utils.py -> apache-beam-2.8.0.dev0/apache_beam/testing
copying apache_beam/testing/test_utils_test.py -> apache-beam-2.8.0.dev0/apache_beam/testing
copying apache_beam/testing/util.py -> apache-beam-2.8.0.dev0/apache_beam/testing
copying apache_beam/testing/util_test.py -> apache-beam-2.8.0.dev0/apache_beam/testing
copying apache_beam/testing/benchmarks/__init__.py -> apache-beam-2.8.0.dev0/apache_beam/testing/benchmarks
copying apache_beam/testing/benchmarks/nexmark/__init__.py -> apache-beam-2.8.0.dev0/apache_beam/testing/benchmarks/nexmark
copying apache_beam/testing/benchmarks/nexmark/nexmark_launcher.py -> apache-beam-2.8.0.dev0/apache_beam/testing/benchmarks/nexmark
copying apache_beam/testing/benchmarks/nexmark/nexmark_util.py -> apache-beam-2.8.0.dev0/apache_beam/testing/benchmarks/nexmark
copying apache_beam/testing/benchmarks/nexmark/models/__init__.py -> apache-beam-2.8.0.dev0/apache_beam/testing/benchmarks/nexmark/models
copying apache_beam/testing/benchmarks/nexmark/models/nexmark_model.py -> apache-beam-2.8.0.dev0/apache_beam/testing/benchmarks/nexmark/models
copying apache_beam/testing/benchmarks/nexmark/queries/__init__.py -> apache-beam-2.8.0.dev0/apache_beam/testing/benchmarks/nexmark/queries
copying apache_beam/testing/benchmarks/nexmark/queries/query0.py -> apache-beam-2.8.0.dev0/apache_beam/testing/benchmarks/nexmark/queries
copying apache_beam/testing/benchmarks/nexmark/queries/query1.py -> apache-beam-2.8.0.dev0/apache_beam/testing/benchmarks/nexmark/queries
copying apache_beam/testing/benchmarks/nexmark/queries/query2.py -> apache-beam-2.8.0.dev0/apache_beam/testing/benchmarks/nexmark/queries
copying apache_beam/testing/data/standard_coders.yaml -> apache-beam-2.8.0.dev0/apache_beam/testing/data
copying apache_beam/testing/data/trigger_transcripts.yaml -> apache-beam-2.8.0.dev0/apache_beam/testing/data
copying apache_beam/tools/__init__.py -> apache-beam-2.8.0.dev0/apache_beam/tools
copying apache_beam/tools/coders_microbenchmark.py -> apache-beam-2.8.0.dev0/apache_beam/tools
copying apache_beam/tools/distribution_counter_microbenchmark.py -> apache-beam-2.8.0.dev0/apache_beam/tools
copying apache_beam/tools/map_fn_microbenchmark.py -> apache-beam-2.8.0.dev0/apache_beam/tools
copying apache_beam/tools/microbenchmarks_test.py -> apache-beam-2.8.0.dev0/apache_beam/tools
copying apache_beam/tools/sideinput_microbenchmark.py -> apache-beam-2.8.0.dev0/apache_beam/tools
copying apache_beam/tools/utils.py -> apache-beam-2.8.0.dev0/apache_beam/tools
copying apache_beam/transforms/__init__.py -> apache-beam-2.8.0.dev0/apache_beam/transforms
copying apache_beam/transforms/combiners.py -> apache-beam-2.8.0.dev0/apache_beam/transforms
copying apache_beam/transforms/combiners_test.py -> apache-beam-2.8.0.dev0/apache_beam/transforms
copying apache_beam/transforms/core.py -> apache-beam-2.8.0.dev0/apache_beam/transforms
copying apache_beam/transforms/create_source.py -> apache-beam-2.8.0.dev0/apache_beam/transforms
copying apache_beam/transforms/create_test.py -> apache-beam-2.8.0.dev0/apache_beam/transforms
copying apache_beam/transforms/cy_combiners.pxd -> apache-beam-2.8.0.dev0/apache_beam/transforms
copying apache_beam/transforms/cy_combiners.py -> apache-beam-2.8.0.dev0/apache_beam/transforms
copying apache_beam/transforms/cy_dataflow_distribution_counter.pxd -> apache-beam-2.8.0.dev0/apache_beam/transforms
copying apache_beam/transforms/cy_dataflow_distribution_counter.pyx -> apache-beam-2.8.0.dev0/apache_beam/transforms
copying apache_beam/transforms/dataflow_distribution_counter_test.py -> apache-beam-2.8.0.dev0/apache_beam/transforms
copying apache_beam/transforms/display.py -> apache-beam-2.8.0.dev0/apache_beam/transforms
copying apache_beam/transforms/display_test.py -> apache-beam-2.8.0.dev0/apache_beam/transforms
copying apache_beam/transforms/ptransform.py -> apache-beam-2.8.0.dev0/apache_beam/transforms
copying apache_beam/transforms/ptransform_test.py -> apache-beam-2.8.0.dev0/apache_beam/transforms
copying apache_beam/transforms/py_dataflow_distribution_counter.py -> apache-beam-2.8.0.dev0/apache_beam/transforms
copying apache_beam/transforms/sideinputs.py -> apache-beam-2.8.0.dev0/apache_beam/transforms
copying apache_beam/transforms/sideinputs_test.py -> apache-beam-2.8.0.dev0/apache_beam/transforms
copying apache_beam/transforms/timeutil.py -> apache-beam-2.8.0.dev0/apache_beam/transforms
copying apache_beam/transforms/trigger.py -> apache-beam-2.8.0.dev0/apache_beam/transforms
copying apache_beam/transforms/trigger_test.py -> apache-beam-2.8.0.dev0/apache_beam/transforms
copying apache_beam/transforms/userstate.py -> apache-beam-2.8.0.dev0/apache_beam/transforms
copying apache_beam/transforms/userstate_test.py -> apache-beam-2.8.0.dev0/apache_beam/transforms
copying apache_beam/transforms/util.py -> apache-beam-2.8.0.dev0/apache_beam/transforms
copying apache_beam/transforms/util_test.py -> apache-beam-2.8.0.dev0/apache_beam/transforms
copying apache_beam/transforms/window.py -> apache-beam-2.8.0.dev0/apache_beam/transforms
copying apache_beam/transforms/window_test.py -> apache-beam-2.8.0.dev0/apache_beam/transforms
copying apache_beam/transforms/write_ptransform_test.py -> apache-beam-2.8.0.dev0/apache_beam/transforms
copying apache_beam/typehints/__init__.py -> apache-beam-2.8.0.dev0/apache_beam/typehints
copying apache_beam/typehints/decorators.py -> apache-beam-2.8.0.dev0/apache_beam/typehints
copying apache_beam/typehints/native_type_compatibility.py -> apache-beam-2.8.0.dev0/apache_beam/typehints
copying apache_beam/typehints/native_type_compatibility_test.py -> apache-beam-2.8.0.dev0/apache_beam/typehints
copying apache_beam/typehints/opcodes.py -> apache-beam-2.8.0.dev0/apache_beam/typehints
copying apache_beam/typehints/trivial_inference.py -> apache-beam-2.8.0.dev0/apache_beam/typehints
copying apache_beam/typehints/trivial_inference_test.py -> apache-beam-2.8.0.dev0/apache_beam/typehints
copying apache_beam/typehints/typecheck.py -> apache-beam-2.8.0.dev0/apache_beam/typehints
copying apache_beam/typehints/typed_pipeline_test.py -> apache-beam-2.8.0.dev0/apache_beam/typehints
copying apache_beam/typehints/typehints.py -> apache-beam-2.8.0.dev0/apache_beam/typehints
copying apache_beam/typehints/typehints_test.py -> apache-beam-2.8.0.dev0/apache_beam/typehints
copying apache_beam/utils/__init__.py -> apache-beam-2.8.0.dev0/apache_beam/utils
copying apache_beam/utils/annotations.py -> apache-beam-2.8.0.dev0/apache_beam/utils
copying apache_beam/utils/annotations_test.py -> apache-beam-2.8.0.dev0/apache_beam/utils
copying apache_beam/utils/counters.pxd -> apache-beam-2.8.0.dev0/apache_beam/utils
copying apache_beam/utils/counters.py -> apache-beam-2.8.0.dev0/apache_beam/utils
copying apache_beam/utils/counters_test.py -> apache-beam-2.8.0.dev0/apache_beam/utils
copying apache_beam/utils/plugin.py -> apache-beam-2.8.0.dev0/apache_beam/utils
copying apache_beam/utils/processes.py -> apache-beam-2.8.0.dev0/apache_beam/utils
copying apache_beam/utils/processes_test.py -> apache-beam-2.8.0.dev0/apache_beam/utils
copying apache_beam/utils/profiler.py -> apache-beam-2.8.0.dev0/apache_beam/utils
copying apache_beam/utils/proto_utils.py -> apache-beam-2.8.0.dev0/apache_beam/utils
copying apache_beam/utils/retry.py -> apache-beam-2.8.0.dev0/apache_beam/utils
copying apache_beam/utils/retry_test.py -> apache-beam-2.8.0.dev0/apache_beam/utils
copying apache_beam/utils/timestamp.py -> apache-beam-2.8.0.dev0/apache_beam/utils
copying apache_beam/utils/timestamp_test.py -> apache-beam-2.8.0.dev0/apache_beam/utils
copying apache_beam/utils/urns.py -> apache-beam-2.8.0.dev0/apache_beam/utils
copying apache_beam/utils/windowed_value.pxd -> apache-beam-2.8.0.dev0/apache_beam/utils
copying apache_beam/utils/windowed_value.py -> apache-beam-2.8.0.dev0/apache_beam/utils
copying apache_beam/utils/windowed_value_test.py -> apache-beam-2.8.0.dev0/apache_beam/utils
Writing apache-beam-2.8.0.dev0/setup.cfg
creating target
Creating tar archive
removing 'apache-beam-2.8.0.dev0' (and everything under it)
[beam_PerformanceTests_Python] $ /bin/bash -xe /tmp/jenkins4847210349522125141.sh
+ <https://builds.apache.org/job/beam_PerformanceTests_Python/ws/env/.perfkit_env/bin/pip>
install -r <https://builds.apache.org/job/beam_PerformanceTests_Python/ws/PerfKitBenchmarker/requirements.txt>
Requirement already satisfied: absl-py in /home/jenkins/.local/lib/python2.7/site-packages
(from -r <https://builds.apache.org/job/beam_PerformanceTests_Python/ws/PerfKitBenchmarker/requirements.txt>
(line 14)) (0.2.2)
Requirement already satisfied: jinja2>=2.7 in /usr/local/lib/python2.7/dist-packages (from
-r <https://builds.apache.org/job/beam_PerformanceTests_Python/ws/PerfKitBenchmarker/requirements.txt>
(line 15)) (2.10)
Requirement already satisfied: setuptools in ./env/.perfkit_env/lib/python2.7/site-packages
(from -r <https://builds.apache.org/job/beam_PerformanceTests_Python/ws/PerfKitBenchmarker/requirements.txt>
(line 16)) (40.2.0)
Requirement already satisfied: colorlog[windows]==2.6.0 in /home/jenkins/.local/lib/python2.7/site-packages
(from -r <https://builds.apache.org/job/beam_PerformanceTests_Python/ws/PerfKitBenchmarker/requirements.txt>
(line 17)) (2.6.0)
Requirement already satisfied: blinker>=1.3 in /home/jenkins/.local/lib/python2.7/site-packages
(from -r <https://builds.apache.org/job/beam_PerformanceTests_Python/ws/PerfKitBenchmarker/requirements.txt>
(line 18)) (1.4)
Requirement already satisfied: futures>=3.0.3 in /home/jenkins/.local/lib/python2.7/site-packages
(from -r <https://builds.apache.org/job/beam_PerformanceTests_Python/ws/PerfKitBenchmarker/requirements.txt>
(line 19)) (3.2.0)
Requirement already satisfied: PyYAML==3.12 in /usr/local/lib/python2.7/dist-packages (from
-r <https://builds.apache.org/job/beam_PerformanceTests_Python/ws/PerfKitBenchmarker/requirements.txt>
(line 20)) (3.12)
Requirement already satisfied: pint>=0.7 in /home/jenkins/.local/lib/python2.7/site-packages
(from -r <https://builds.apache.org/job/beam_PerformanceTests_Python/ws/PerfKitBenchmarker/requirements.txt>
(line 21)) (0.8.1)
Requirement already satisfied: numpy==1.13.3 in /home/jenkins/.local/lib/python2.7/site-packages
(from -r <https://builds.apache.org/job/beam_PerformanceTests_Python/ws/PerfKitBenchmarker/requirements.txt>
(line 22)) (1.13.3)
Requirement already satisfied: functools32 in /usr/local/lib/python2.7/dist-packages (from
-r <https://builds.apache.org/job/beam_PerformanceTests_Python/ws/PerfKitBenchmarker/requirements.txt>
(line 23)) (3.2.3.post2)
Requirement already satisfied: contextlib2>=0.5.1 in /home/jenkins/.local/lib/python2.7/site-packages
(from -r <https://builds.apache.org/job/beam_PerformanceTests_Python/ws/PerfKitBenchmarker/requirements.txt>
(line 24)) (0.5.5)
Requirement already satisfied: pywinrm in /home/jenkins/.local/lib/python2.7/site-packages
(from -r <https://builds.apache.org/job/beam_PerformanceTests_Python/ws/PerfKitBenchmarker/requirements.txt>
(line 25)) (0.3.0)
Requirement already satisfied: timeout-decorator in /home/jenkins/.local/lib/python2.7/site-packages
(from -r <https://builds.apache.org/job/beam_PerformanceTests_Python/ws/PerfKitBenchmarker/requirements.txt>
(line 26)) (0.4.0)
Requirement already satisfied: six in /usr/local/lib/python2.7/dist-packages (from absl-py->-r
<https://builds.apache.org/job/beam_PerformanceTests_Python/ws/PerfKitBenchmarker/requirements.txt>
(line 14)) (1.11.0)
Requirement already satisfied: MarkupSafe>=0.23 in /usr/local/lib/python2.7/dist-packages
(from jinja2>=2.7->-r <https://builds.apache.org/job/beam_PerformanceTests_Python/ws/PerfKitBenchmarker/requirements.txt>
(line 15)) (1.0)
Requirement already satisfied: colorama; extra == "windows" in /home/jenkins/.local/lib/python2.7/site-packages
(from colorlog[windows]==2.6.0->-r <https://builds.apache.org/job/beam_PerformanceTests_Python/ws/PerfKitBenchmarker/requirements.txt>
(line 17)) (0.3.9)
Requirement already satisfied: requests-ntlm>=0.3.0 in /home/jenkins/.local/lib/python2.7/site-packages
(from pywinrm->-r <https://builds.apache.org/job/beam_PerformanceTests_Python/ws/PerfKitBenchmarker/requirements.txt>
(line 25)) (1.1.0)
Requirement already satisfied: requests>=2.9.1 in /usr/local/lib/python2.7/dist-packages
(from pywinrm->-r <https://builds.apache.org/job/beam_PerformanceTests_Python/ws/PerfKitBenchmarker/requirements.txt>
(line 25)) (2.18.4)
Requirement already satisfied: xmltodict in /home/jenkins/.local/lib/python2.7/site-packages
(from pywinrm->-r <https://builds.apache.org/job/beam_PerformanceTests_Python/ws/PerfKitBenchmarker/requirements.txt>
(line 25)) (0.11.0)
Requirement already satisfied: cryptography>=1.3 in /usr/local/lib/python2.7/dist-packages
(from requests-ntlm>=0.3.0->pywinrm->-r <https://builds.apache.org/job/beam_PerformanceTests_Python/ws/PerfKitBenchmarker/requirements.txt>
(line 25)) (2.2.2)
Requirement already satisfied: ntlm-auth>=1.0.2 in /home/jenkins/.local/lib/python2.7/site-packages
(from requests-ntlm>=0.3.0->pywinrm->-r <https://builds.apache.org/job/beam_PerformanceTests_Python/ws/PerfKitBenchmarker/requirements.txt>
(line 25)) (1.2.0)
Requirement already satisfied: certifi>=2017.4.17 in /usr/local/lib/python2.7/dist-packages
(from requests>=2.9.1->pywinrm->-r <https://builds.apache.org/job/beam_PerformanceTests_Python/ws/PerfKitBenchmarker/requirements.txt>
(line 25)) (2018.4.16)
Requirement already satisfied: chardet<3.1.0,>=3.0.2 in /usr/local/lib/python2.7/dist-packages
(from requests>=2.9.1->pywinrm->-r <https://builds.apache.org/job/beam_PerformanceTests_Python/ws/PerfKitBenchmarker/requirements.txt>
(line 25)) (3.0.4)
Requirement already satisfied: idna<2.7,>=2.5 in /usr/local/lib/python2.7/dist-packages
(from requests>=2.9.1->pywinrm->-r <https://builds.apache.org/job/beam_PerformanceTests_Python/ws/PerfKitBenchmarker/requirements.txt>
(line 25)) (2.6)
Requirement already satisfied: urllib3<1.23,>=1.21.1 in /usr/local/lib/python2.7/dist-packages
(from requests>=2.9.1->pywinrm->-r <https://builds.apache.org/job/beam_PerformanceTests_Python/ws/PerfKitBenchmarker/requirements.txt>
(line 25)) (1.22)
Requirement already satisfied: cffi>=1.7; platform_python_implementation != "PyPy" in /usr/local/lib/python2.7/dist-packages
(from cryptography>=1.3->requests-ntlm>=0.3.0->pywinrm->-r <https://builds.apache.org/job/beam_PerformanceTests_Python/ws/PerfKitBenchmarker/requirements.txt>
(line 25)) (1.11.5)
Requirement already satisfied: enum34; python_version < "3" in /usr/local/lib/python2.7/dist-packages
(from cryptography>=1.3->requests-ntlm>=0.3.0->pywinrm->-r <https://builds.apache.org/job/beam_PerformanceTests_Python/ws/PerfKitBenchmarker/requirements.txt>
(line 25)) (1.1.6)
Requirement already satisfied: asn1crypto>=0.21.0 in /usr/local/lib/python2.7/dist-packages
(from cryptography>=1.3->requests-ntlm>=0.3.0->pywinrm->-r <https://builds.apache.org/job/beam_PerformanceTests_Python/ws/PerfKitBenchmarker/requirements.txt>
(line 25)) (0.24.0)
Requirement already satisfied: ipaddress; python_version < "3" in /usr/local/lib/python2.7/dist-packages
(from cryptography>=1.3->requests-ntlm>=0.3.0->pywinrm->-r <https://builds.apache.org/job/beam_PerformanceTests_Python/ws/PerfKitBenchmarker/requirements.txt>
(line 25)) (1.0.22)
Requirement already satisfied: pycparser in /usr/local/lib/python2.7/dist-packages (from cffi>=1.7;
platform_python_implementation != "PyPy"->cryptography>=1.3->requests-ntlm>=0.3.0->pywinrm->-r
<https://builds.apache.org/job/beam_PerformanceTests_Python/ws/PerfKitBenchmarker/requirements.txt>
(line 25)) (2.18)
[beam_PerformanceTests_Python] $ /bin/bash -xe /tmp/jenkins51757034360823536.sh
+ <https://builds.apache.org/job/beam_PerformanceTests_Python/ws/env/.perfkit_env/bin/python>
<https://builds.apache.org/job/beam_PerformanceTests_Python/ws/PerfKitBenchmarker/pkb.py>
--project=apache-beam-testing --dpb_log_level=INFO --bigquery_table=beam_performance.wordcount_py_pkb_results
--k8s_get_retry_count=36 --k8s_get_wait_interval=10 --python_binary=<https://builds.apache.org/job/beam_PerformanceTests_Python/ws/.beam_env/bin/python>
--temp_dir=<https://builds.apache.org/job/beam_PerformanceTests_Python/ws/> --beam_location=<https://builds.apache.org/job/beam_PerformanceTests_Python/ws/src>
--official=true --beam_sdk=python --benchmarks=beam_integration_benchmark --beam_it_class=apache_beam.examples.wordcount_it_test:WordCountIT.test_wordcount_it
--beam_prebuilt=true --beam_it_args=--project=apache-beam-testing,--staging_location=gs://temp-storage-for-end-to-end-tests/staging-it,--temp_location=gs://temp-storage-for-end-to-end-tests/temp-it,--output=gs://temp-storage-for-end-to-end-tests/py-it-cloud/output
2018-09-03 12:18:30,728 5c8a04e1 MainThread INFO     Verbose logging to: <https://builds.apache.org/job/beam_PerformanceTests_Python/ws/runs/5c8a04e1/pkb.log>
2018-09-03 12:18:30,728 5c8a04e1 MainThread INFO     PerfKitBenchmarker version: v1.12.0-812-gcdde510
2018-09-03 12:18:30,729 5c8a04e1 MainThread INFO     Flag values:
--beam_it_class=apache_beam.examples.wordcount_it_test:WordCountIT.test_wordcount_it
--beam_sdk=python
--k8s_get_wait_interval=10
--python_binary=<https://builds.apache.org/job/beam_PerformanceTests_Python/ws/.beam_env/bin/python>
--temp_dir=<https://builds.apache.org/job/beam_PerformanceTests_Python/ws/>
--beam_it_args=--project=apache-beam-testing,--staging_location=gs://temp-storage-for-end-to-end-tests/staging-it,--temp_location=gs://temp-storage-for-end-to-end-tests/temp-it,--output=gs://temp-storage-for-end-to-end-tests/py-it-cloud/output
--beam_prebuilt
--project=apache-beam-testing
--bigquery_table=beam_performance.wordcount_py_pkb_results
--official
--dpb_log_level=INFO
--beam_location=<https://builds.apache.org/job/beam_PerformanceTests_Python/ws/src>
--k8s_get_retry_count=36
--benchmarks=beam_integration_benchmark
2018-09-03 12:18:30,956 5c8a04e1 MainThread WARNING  The key "flags" was not in the default
config, but was in user overrides. This may indicate a typo.
2018-09-03 12:18:31,120 5c8a04e1 MainThread beam_integration_benchmark(1/1) INFO     Provisioning
resources for benchmark beam_integration_benchmark
2018-09-03 12:18:31,123 5c8a04e1 MainThread beam_integration_benchmark(1/1) INFO     Preparing
benchmark beam_integration_benchmark
2018-09-03 12:18:31,124 5c8a04e1 MainThread beam_integration_benchmark(1/1) INFO     Running
benchmark beam_integration_benchmark
2018-09-03 12:18:31,136 5c8a04e1 MainThread beam_integration_benchmark(1/1) INFO     Running:
<https://builds.apache.org/job/beam_PerformanceTests_Python/ws/.beam_env/bin/python>
setup.py nosetests --tests=apache_beam.examples.wordcount_it_test:WordCountIT.test_wordcount_it
--attr=IT --test-pipeline-options="--project=apache-beam-testing" "--staging_location=gs://temp-storage-for-end-to-end-tests/staging-it"
"--temp_location=gs://temp-storage-for-end-to-end-tests/temp-it" "--output=gs://temp-storage-for-end-to-end-tests/py-it-cloud/output"
"--runner=TestDataflowRunner" "--sdk_location=<https://builds.apache.org/job/beam_PerformanceTests_Python/ws/src/sdks/python/target/apache-beam-2.8.0.dev0.tar.gz">
2018-09-03 12:18:31,486 5c8a04e1 MainThread beam_integration_benchmark(1/1) INFO     Ran:
{<https://builds.apache.org/job/beam_PerformanceTests_Python/ws/.beam_env/bin/python>
setup.py nosetests --tests=apache_beam.examples.wordcount_it_test:WordCountIT.test_wordcount_it
--attr=IT --test-pipeline-options="--project=apache-beam-testing" "--staging_location=gs://temp-storage-for-end-to-end-tests/staging-it"
"--temp_location=gs://temp-storage-for-end-to-end-tests/temp-it" "--output=gs://temp-storage-for-end-to-end-tests/py-it-cloud/output"
"--runner=TestDataflowRunner" "--sdk_location=<https://builds.apache.org/job/beam_PerformanceTests_Python/ws/src/sdks/python/target/apache-beam-2.8.0.dev0.tar.gz"}>
 ReturnCode:1
STDOUT: 
STDERR: <https://builds.apache.org/job/beam_PerformanceTests_Python/ws/.beam_env/local/lib/python2.7/site-packages/setuptools/dist.py>:398:
UserWarning: Normalizing '2.8.0.dev' to '2.8.0.dev0'
  normalized_version,
/home/jenkins/.local/lib/python2.7/site-packages/nose/plugins/manager.py:395: RuntimeWarning:
Unable to load plugin beam_test_plugin = test_config:BeamTestPlugin: (fastavro 0.19.7 (/home/jenkins/.local/lib/python2.7/site-packages),
Requirement.parse('fastavro==0.21.4'))
  RuntimeWarning)
usage: setup.py [global_opts] cmd1 [cmd1_opts] [cmd2 [cmd2_opts] ...]
   or: setup.py --help [cmd1 cmd2 ...]
   or: setup.py --help-commands
   or: setup.py cmd --help

error: option --test-pipeline-options not recognized

2018-09-03 12:18:31,486 5c8a04e1 MainThread beam_integration_benchmark(1/1) ERROR    Error
during benchmark beam_integration_benchmark
Traceback (most recent call last):
  File "<https://builds.apache.org/job/beam_PerformanceTests_Python/ws/PerfKitBenchmarker/perfkitbenchmarker/pkb.py",>
line 676, in RunBenchmark
    DoRunPhase(spec, collector, detailed_timer)
  File "<https://builds.apache.org/job/beam_PerformanceTests_Python/ws/PerfKitBenchmarker/perfkitbenchmarker/pkb.py",>
line 556, in DoRunPhase
    samples = spec.BenchmarkRun(spec)
  File "<https://builds.apache.org/job/beam_PerformanceTests_Python/ws/PerfKitBenchmarker/perfkitbenchmarker/linux_benchmarks/beam_integration_benchmark.py",>
line 160, in Run
    job_type=job_type)
  File "<https://builds.apache.org/job/beam_PerformanceTests_Python/ws/PerfKitBenchmarker/perfkitbenchmarker/providers/gcp/gcp_dpb_dataflow.py",>
line 90, in SubmitJob
    assert retcode == 0, "Integration Test Failed."
AssertionError: Integration Test Failed.
2018-09-03 12:18:31,488 5c8a04e1 MainThread beam_integration_benchmark(1/1) INFO     Cleaning
up benchmark beam_integration_benchmark
2018-09-03 12:18:31,489 5c8a04e1 MainThread beam_integration_benchmark(1/1) ERROR    Exception
running benchmark
Traceback (most recent call last):
  File "<https://builds.apache.org/job/beam_PerformanceTests_Python/ws/PerfKitBenchmarker/perfkitbenchmarker/pkb.py",>
line 812, in RunBenchmarkTask
    RunBenchmark(spec, collector)
  File "<https://builds.apache.org/job/beam_PerformanceTests_Python/ws/PerfKitBenchmarker/perfkitbenchmarker/pkb.py",>
line 676, in RunBenchmark
    DoRunPhase(spec, collector, detailed_timer)
  File "<https://builds.apache.org/job/beam_PerformanceTests_Python/ws/PerfKitBenchmarker/perfkitbenchmarker/pkb.py",>
line 556, in DoRunPhase
    samples = spec.BenchmarkRun(spec)
  File "<https://builds.apache.org/job/beam_PerformanceTests_Python/ws/PerfKitBenchmarker/perfkitbenchmarker/linux_benchmarks/beam_integration_benchmark.py",>
line 160, in Run
    job_type=job_type)
  File "<https://builds.apache.org/job/beam_PerformanceTests_Python/ws/PerfKitBenchmarker/perfkitbenchmarker/providers/gcp/gcp_dpb_dataflow.py",>
line 90, in SubmitJob
    assert retcode == 0, "Integration Test Failed."
AssertionError: Integration Test Failed.
2018-09-03 12:18:31,490 5c8a04e1 MainThread beam_integration_benchmark(1/1) ERROR    Benchmark
1/1 beam_integration_benchmark (UID: beam_integration_benchmark0) failed. Execution will continue.
2018-09-03 12:18:31,531 5c8a04e1 MainThread INFO     Benchmark run statuses:
---------------------------------------------------------------------------------
Name                        UID                          Status  Failed Substatus
---------------------------------------------------------------------------------
beam_integration_benchmark  beam_integration_benchmark0  FAILED                  
---------------------------------------------------------------------------------
Success rate: 0.00% (0/1)
2018-09-03 12:18:31,531 5c8a04e1 MainThread INFO     Complete logs can be found at: <https://builds.apache.org/job/beam_PerformanceTests_Python/ws/runs/5c8a04e1/pkb.log>
2018-09-03 12:18:31,532 5c8a04e1 MainThread INFO     Completion statuses can be found at:
<https://builds.apache.org/job/beam_PerformanceTests_Python/ws/runs/5c8a04e1/completion_statuses.json>
Build step 'Execute shell' marked build as failure

Mime
View raw message