beam-commits mailing list archives

Site index · List index
Message view « Date » · « Thread »
Top « Date » · « Thread »
From Apache Jenkins Server <jenk...@builds.apache.org>
Subject Build failed in Jenkins: beam_PostCommit_Py_VR_Dataflow #1078
Date Tue, 18 Sep 2018 16:51:54 GMT
See <https://builds.apache.org/job/beam_PostCommit_Py_VR_Dataflow/1078/display/redirect?page=changes>

Changes:

[ccy] [BEAM-5264] Reference DirectRunner implementation of Python User State

[ccy] Address review comments

[ccy] Address additional comments

[ccy] Address more comments

------------------------------------------
[...truncated 89.38 KB...]
Collecting pbr>=0.11 (from mock->-r postcommit_requirements.txt (line 2))
  File was already downloaded /tmp/dataflow-requirements-cache/pbr-4.2.0.tar.gz
Successfully downloaded pyhamcrest mock setuptools six funcsigs pbr
Successfully downloaded pyhamcrest mock setuptools six funcsigs pbr
Successfully downloaded pyhamcrest mock setuptools six funcsigs pbr
WARNING:root:Waiting indefinitely for streaming job.
test_as_singleton_with_different_defaults (apache_beam.transforms.sideinputs_test.SideInputsTest)
... FAIL
WARNING:root:Waiting indefinitely for streaming job.
test_as_singleton_without_unique_labels (apache_beam.transforms.sideinputs_test.SideInputsTest)
... FAIL
WARNING:root:Waiting indefinitely for streaming job.
test_default_value_singleton_side_input (apache_beam.transforms.sideinputs_test.SideInputsTest)
... FAIL
WARNING:root:Waiting indefinitely for streaming job.
test_iterable_side_input (apache_beam.transforms.sideinputs_test.SideInputsTest) ... FAIL
WARNING:root:Waiting indefinitely for streaming job.
test_flattened_side_input (apache_beam.transforms.sideinputs_test.SideInputsTest) ... FAIL
WARNING:root:Waiting indefinitely for streaming job.
test_empty_singleton_side_input (apache_beam.transforms.sideinputs_test.SideInputsTest) ...
FAIL

======================================================================
FAIL: test_par_do_with_multiple_outputs_and_using_yield (apache_beam.transforms.ptransform_test.PTransformTest)
----------------------------------------------------------------------
Traceback (most recent call last):
  File "<https://builds.apache.org/job/beam_PostCommit_Py_VR_Dataflow/ws/src/sdks/python/apache_beam/transforms/ptransform_test.py",>
line 234, in test_par_do_with_multiple_outputs_and_using_yield
    pipeline.run()
  File "<https://builds.apache.org/job/beam_PostCommit_Py_VR_Dataflow/ws/src/sdks/python/apache_beam/testing/test_pipeline.py",>
line 108, in run
    "Pipeline execution failed."
AssertionError: Pipeline execution failed.
-------------------- >> begin captured stdout << ---------------------
Found: https://console.cloud.google.com/dataflow/jobsDetail/locations/us-central1/jobs/2018-09-18_09_51_20-1067238010711690617?project=apache-beam-testing.

--------------------- >> end captured stdout << ----------------------

======================================================================
FAIL: test_as_dict_twice (apache_beam.transforms.sideinputs_test.SideInputsTest)
----------------------------------------------------------------------
Traceback (most recent call last):
  File "<https://builds.apache.org/job/beam_PostCommit_Py_VR_Dataflow/ws/src/sdks/python/apache_beam/transforms/sideinputs_test.py",>
line 296, in test_as_dict_twice
    pipeline.run()
  File "<https://builds.apache.org/job/beam_PostCommit_Py_VR_Dataflow/ws/src/sdks/python/apache_beam/testing/test_pipeline.py",>
line 108, in run
    "Pipeline execution failed."
AssertionError: Pipeline execution failed.
-------------------- >> begin captured stdout << ---------------------
Found: https://console.cloud.google.com/dataflow/jobsDetail/locations/us-central1/jobs/2018-09-18_09_51_20-15133215955618914617?project=apache-beam-testing.

--------------------- >> end captured stdout << ----------------------

======================================================================
FAIL: test_flatten_multiple_pcollections_having_multiple_consumers (apache_beam.transforms.ptransform_test.PTransformTest)
----------------------------------------------------------------------
Traceback (most recent call last):
  File "<https://builds.apache.org/job/beam_PostCommit_Py_VR_Dataflow/ws/src/sdks/python/apache_beam/transforms/ptransform_test.py",>
line 564, in test_flatten_multiple_pcollections_having_multiple_consumers
    pipeline.run()
  File "<https://builds.apache.org/job/beam_PostCommit_Py_VR_Dataflow/ws/src/sdks/python/apache_beam/testing/test_pipeline.py",>
line 108, in run
    "Pipeline execution failed."
AssertionError: Pipeline execution failed.
-------------------- >> begin captured stdout << ---------------------
Found: https://console.cloud.google.com/dataflow/jobsDetail/locations/us-central1/jobs/2018-09-18_09_51_19-15381888344708681195?project=apache-beam-testing.

--------------------- >> end captured stdout << ----------------------

======================================================================
FAIL: test_as_list_twice (apache_beam.transforms.sideinputs_test.SideInputsTest)
----------------------------------------------------------------------
Traceback (most recent call last):
  File "<https://builds.apache.org/job/beam_PostCommit_Py_VR_Dataflow/ws/src/sdks/python/apache_beam/transforms/sideinputs_test.py",>
line 274, in test_as_list_twice
    pipeline.run()
  File "<https://builds.apache.org/job/beam_PostCommit_Py_VR_Dataflow/ws/src/sdks/python/apache_beam/testing/test_pipeline.py",>
line 108, in run
    "Pipeline execution failed."
AssertionError: Pipeline execution failed.
-------------------- >> begin captured stdout << ---------------------
Found: https://console.cloud.google.com/dataflow/jobsDetail/locations/us-central1/jobs/2018-09-18_09_51_19-17914194021834479985?project=apache-beam-testing.

--------------------- >> end captured stdout << ----------------------

======================================================================
FAIL: test_multiple_empty_outputs (apache_beam.transforms.ptransform_test.PTransformTest)
----------------------------------------------------------------------
Traceback (most recent call last):
  File "<https://builds.apache.org/job/beam_PostCommit_Py_VR_Dataflow/ws/src/sdks/python/apache_beam/transforms/ptransform_test.py",>
line 277, in test_multiple_empty_outputs
    pipeline.run()
  File "<https://builds.apache.org/job/beam_PostCommit_Py_VR_Dataflow/ws/src/sdks/python/apache_beam/testing/test_pipeline.py",>
line 108, in run
    "Pipeline execution failed."
AssertionError: Pipeline execution failed.
-------------------- >> begin captured stdout << ---------------------
Found: https://console.cloud.google.com/dataflow/jobsDetail/locations/us-central1/jobs/2018-09-18_09_51_20-5805834795346200990?project=apache-beam-testing.

--------------------- >> end captured stdout << ----------------------

======================================================================
FAIL: test_undeclared_outputs (apache_beam.transforms.ptransform_test.PTransformTest)
----------------------------------------------------------------------
Traceback (most recent call last):
  File "<https://builds.apache.org/job/beam_PostCommit_Py_VR_Dataflow/ws/src/sdks/python/apache_beam/transforms/ptransform_test.py",>
line 264, in test_undeclared_outputs
    pipeline.run()
  File "<https://builds.apache.org/job/beam_PostCommit_Py_VR_Dataflow/ws/src/sdks/python/apache_beam/testing/test_pipeline.py",>
line 108, in run
    "Pipeline execution failed."
AssertionError: Pipeline execution failed.
-------------------- >> begin captured stdout << ---------------------
Found: https://console.cloud.google.com/dataflow/jobsDetail/locations/us-central1/jobs/2018-09-18_09_51_20-7399237819286542810?project=apache-beam-testing.

--------------------- >> end captured stdout << ----------------------

======================================================================
FAIL: test_par_do_with_multiple_outputs_and_using_return (apache_beam.transforms.ptransform_test.PTransformTest)
----------------------------------------------------------------------
Traceback (most recent call last):
  File "<https://builds.apache.org/job/beam_PostCommit_Py_VR_Dataflow/ws/src/sdks/python/apache_beam/transforms/ptransform_test.py",>
line 250, in test_par_do_with_multiple_outputs_and_using_return
    pipeline.run()
  File "<https://builds.apache.org/job/beam_PostCommit_Py_VR_Dataflow/ws/src/sdks/python/apache_beam/testing/test_pipeline.py",>
line 108, in run
    "Pipeline execution failed."
AssertionError: Pipeline execution failed.
-------------------- >> begin captured stdout << ---------------------
Found: https://console.cloud.google.com/dataflow/jobsDetail/locations/us-central1/jobs/2018-09-18_09_51_20-819507132308761214?project=apache-beam-testing.

--------------------- >> end captured stdout << ----------------------

======================================================================
FAIL: test_as_list_and_as_dict_side_inputs (apache_beam.transforms.sideinputs_test.SideInputsTest)
----------------------------------------------------------------------
Traceback (most recent call last):
  File "<https://builds.apache.org/job/beam_PostCommit_Py_VR_Dataflow/ws/src/sdks/python/apache_beam/transforms/sideinputs_test.py",>
line 205, in test_as_list_and_as_dict_side_inputs
    pipeline.run()
  File "<https://builds.apache.org/job/beam_PostCommit_Py_VR_Dataflow/ws/src/sdks/python/apache_beam/testing/test_pipeline.py",>
line 108, in run
    "Pipeline execution failed."
AssertionError: Pipeline execution failed.
-------------------- >> begin captured stdout << ---------------------
Found: https://console.cloud.google.com/dataflow/jobsDetail/locations/us-central1/jobs/2018-09-18_09_51_20-13311491882919367213?project=apache-beam-testing.

--------------------- >> end captured stdout << ----------------------

======================================================================
FAIL: test_as_singleton_with_different_defaults (apache_beam.transforms.sideinputs_test.SideInputsTest)
----------------------------------------------------------------------
Traceback (most recent call last):
  File "<https://builds.apache.org/job/beam_PostCommit_Py_VR_Dataflow/ws/src/sdks/python/apache_beam/transforms/sideinputs_test.py",>
line 251, in test_as_singleton_with_different_defaults
    pipeline.run()
  File "<https://builds.apache.org/job/beam_PostCommit_Py_VR_Dataflow/ws/src/sdks/python/apache_beam/testing/test_pipeline.py",>
line 108, in run
    "Pipeline execution failed."
AssertionError: Pipeline execution failed.
-------------------- >> begin captured stdout << ---------------------
Found: https://console.cloud.google.com/dataflow/jobsDetail/locations/us-central1/jobs/2018-09-18_09_51_39-9459345221081533944?project=apache-beam-testing.

--------------------- >> end captured stdout << ----------------------

======================================================================
FAIL: test_as_singleton_without_unique_labels (apache_beam.transforms.sideinputs_test.SideInputsTest)
----------------------------------------------------------------------
Traceback (most recent call last):
  File "<https://builds.apache.org/job/beam_PostCommit_Py_VR_Dataflow/ws/src/sdks/python/apache_beam/transforms/sideinputs_test.py",>
line 229, in test_as_singleton_without_unique_labels
    pipeline.run()
  File "<https://builds.apache.org/job/beam_PostCommit_Py_VR_Dataflow/ws/src/sdks/python/apache_beam/testing/test_pipeline.py",>
line 108, in run
    "Pipeline execution failed."
AssertionError: Pipeline execution failed.
-------------------- >> begin captured stdout << ---------------------
Found: https://console.cloud.google.com/dataflow/jobsDetail/locations/us-central1/jobs/2018-09-18_09_51_39-17053416599181811549?project=apache-beam-testing.

--------------------- >> end captured stdout << ----------------------

======================================================================
FAIL: test_default_value_singleton_side_input (apache_beam.transforms.sideinputs_test.SideInputsTest)
----------------------------------------------------------------------
Traceback (most recent call last):
  File "<https://builds.apache.org/job/beam_PostCommit_Py_VR_Dataflow/ws/src/sdks/python/apache_beam/transforms/sideinputs_test.py",>
line 171, in test_default_value_singleton_side_input
    pipeline.run()
  File "<https://builds.apache.org/job/beam_PostCommit_Py_VR_Dataflow/ws/src/sdks/python/apache_beam/testing/test_pipeline.py",>
line 108, in run
    "Pipeline execution failed."
AssertionError: Pipeline execution failed.
-------------------- >> begin captured stdout << ---------------------
Found: https://console.cloud.google.com/dataflow/jobsDetail/locations/us-central1/jobs/2018-09-18_09_51_39-6063004108430547816?project=apache-beam-testing.

--------------------- >> end captured stdout << ----------------------

======================================================================
FAIL: test_iterable_side_input (apache_beam.transforms.sideinputs_test.SideInputsTest)
----------------------------------------------------------------------
Traceback (most recent call last):
  File "<https://builds.apache.org/job/beam_PostCommit_Py_VR_Dataflow/ws/src/sdks/python/apache_beam/transforms/sideinputs_test.py",>
line 182, in test_iterable_side_input
    pipeline.run()
  File "<https://builds.apache.org/job/beam_PostCommit_Py_VR_Dataflow/ws/src/sdks/python/apache_beam/testing/test_pipeline.py",>
line 108, in run
    "Pipeline execution failed."
AssertionError: Pipeline execution failed.
-------------------- >> begin captured stdout << ---------------------
Found: https://console.cloud.google.com/dataflow/jobsDetail/locations/us-central1/jobs/2018-09-18_09_51_40-2994974700288103811?project=apache-beam-testing.

--------------------- >> end captured stdout << ----------------------

======================================================================
FAIL: test_flattened_side_input (apache_beam.transforms.sideinputs_test.SideInputsTest)
----------------------------------------------------------------------
Traceback (most recent call last):
  File "<https://builds.apache.org/job/beam_PostCommit_Py_VR_Dataflow/ws/src/sdks/python/apache_beam/transforms/sideinputs_test.py",>
line 310, in test_flattened_side_input
    pipeline.run()
  File "<https://builds.apache.org/job/beam_PostCommit_Py_VR_Dataflow/ws/src/sdks/python/apache_beam/testing/test_pipeline.py",>
line 108, in run
    "Pipeline execution failed."
AssertionError: Pipeline execution failed.
-------------------- >> begin captured stdout << ---------------------
Found: https://console.cloud.google.com/dataflow/jobsDetail/locations/us-central1/jobs/2018-09-18_09_51_39-517518687423989549?project=apache-beam-testing.

--------------------- >> end captured stdout << ----------------------

======================================================================
FAIL: test_empty_singleton_side_input (apache_beam.transforms.sideinputs_test.SideInputsTest)
----------------------------------------------------------------------
Traceback (most recent call last):
  File "<https://builds.apache.org/job/beam_PostCommit_Py_VR_Dataflow/ws/src/sdks/python/apache_beam/transforms/sideinputs_test.py",>
line 149, in test_empty_singleton_side_input
    pipeline.run()
  File "<https://builds.apache.org/job/beam_PostCommit_Py_VR_Dataflow/ws/src/sdks/python/apache_beam/testing/test_pipeline.py",>
line 108, in run
    "Pipeline execution failed."
AssertionError: Pipeline execution failed.
-------------------- >> begin captured stdout << ---------------------
Found: https://console.cloud.google.com/dataflow/jobsDetail/locations/us-central1/jobs/2018-09-18_09_51_39-14875348140374748919?project=apache-beam-testing.

--------------------- >> end captured stdout << ----------------------

----------------------------------------------------------------------
XML: <https://builds.apache.org/job/beam_PostCommit_Py_VR_Dataflow/ws/src/sdks/python/nosetests.xml>
----------------------------------------------------------------------
Ran 14 tests in 41.455s

FAILED (failures=14)

> Task :beam-sdks-python:validatesRunnerStreamingTests FAILED
:beam-sdks-python:validatesRunnerStreamingTests (Thread[Task worker for ':',5,main]) completed.
Took 42.995 secs.

FAILURE: Build failed with an exception.

* Where:
Build file '<https://builds.apache.org/job/beam_PostCommit_Py_VR_Dataflow/ws/src/sdks/python/build.gradle'>
line: 315

* What went wrong:
Execution failed for task ':beam-sdks-python:validatesRunnerStreamingTests'.
> Process 'command 'sh'' finished with non-zero exit value 1

* Try:
Run with --stacktrace option to get the stack trace. Run with --debug option to get more log
output. Run with --scan to get full insights.

* Get more help at https://help.gradle.org

Deprecated Gradle features were used in this build, making it incompatible with Gradle 5.0.
See https://docs.gradle.org/4.8/userguide/command_line_interface.html#sec:command_line_warnings

BUILD FAILED in 16m 11s
4 actionable tasks: 4 executed

Publishing build scan...
https://gradle.com/s/etsrjkzduzqrm

Build step 'Invoke Gradle script' changed build result to FAILURE
Build step 'Invoke Gradle script' marked build as failure

Mime
View raw message