beam-commits mailing list archives

Site index · List index
Message view « Date » · « Thread »
Top « Date » · « Thread »
From Apache Jenkins Server <jenk...@builds.apache.org>
Subject Build failed in Jenkins: beam_PostCommit_Go_GradleBuild #893
Date Tue, 11 Sep 2018 12:06:54 GMT
See <https://builds.apache.org/job/beam_PostCommit_Go_GradleBuild/893/display/redirect>

------------------------------------------
[...truncated 537.77 KB...]
      "name": "e4",
      "properties": {
        "user_name": "passert.Sum(emit1)/beam.addFixedKeyFn'1",
        "output_info": [
          {
            "user_name": "i0",
            "output_name": "i0",
            "encoding": {
              "@type": "kind:windowed_value",
              "component_encodings": [
                {
                  "@type": "kind:pair",
                  "component_encodings": [
                    {
                      "@type": "kind:length_prefix",
                      "component_encodings": [
                        {
                          "@type": "Cgd2YXJpbnR6EgIIAhqFAQpxZ2l0aHViLmNvbS9hcGFjaGUvYmVhbS9zZGtzL2dvL3Rlc3QvdmVuZG9yL2dpdGh1Yi5jb20vYXBhY2hlL2JlYW0vc2Rrcy9nby9wa2cvYmVhbS9jb3JlL3J1bnRpbWUvY29kZXJ4LmVuY1ZhckludFoSEAgWIgQIGUAPKgYIFBICCAgikQEKcWdpdGh1Yi5jb20vYXBhY2hlL2JlYW0vc2Rrcy9nby90ZXN0L3ZlbmRvci9naXRodWIuY29tL2FwYWNoZS9iZWFtL3Nka3MvZ28vcGtnL2JlYW0vY29yZS9ydW50aW1lL2NvZGVyeC5kZWNWYXJJbnRaEhwIFiIECBlAAyIGCBQSAggIKgQIGUAPKgQIGUAB"
                        }
                      ]
                    },
                    {
                      "@type": "kind:length_prefix",
                      "component_encodings": [
                        {
                          "@type": "Cgd2YXJpbnR6EgIIAhqFAQpxZ2l0aHViLmNvbS9hcGFjaGUvYmVhbS9zZGtzL2dvL3Rlc3QvdmVuZG9yL2dpdGh1Yi5jb20vYXBhY2hlL2JlYW0vc2Rrcy9nby9wa2cvYmVhbS9jb3JlL3J1bnRpbWUvY29kZXJ4LmVuY1ZhckludFoSEAgWIgQIGUAPKgYIFBICCAgikQEKcWdpdGh1Yi5jb20vYXBhY2hlL2JlYW0vc2Rrcy9nby90ZXN0L3ZlbmRvci9naXRodWIuY29tL2FwYWNoZS9iZWFtL3Nka3MvZ28vcGtnL2JlYW0vY29yZS9ydW50aW1lL2NvZGVyeC5kZWNWYXJJbnRaEhwIFiIECBlAAyIGCBQSAggIKgQIGUAPKgQIGUAB"
                        }
                      ]
                    }
                  ],
                  "is_pair_like": true
                },
                {
                  "@type": "kind:global_window"
                }
              ],
              "is_wrapper": true
            }
          }
        ],
        "parallel_input": {
          "@type": "OutputReference",
          "step_name": "e3",
          "output_name": "i0"
        },
        "serialized_fn": "e4"
      }
    },
    {
      "kind": "GroupByKey",
      "name": "e5",
      "properties": {
        "user_name": "passert.Sum(emit1)/CoGBK'1",
        "output_info": [
          {
            "user_name": "i0",
            "output_name": "i0",
            "encoding": {
              "@type": "kind:windowed_value",
              "component_encodings": [
                {
                  "@type": "kind:pair",
                  "component_encodings": [
                    {
                      "@type": "kind:length_prefix",
                      "component_encodings": [
                        {
                          "@type": "Cgd2YXJpbnR6EgIIAhqFAQpxZ2l0aHViLmNvbS9hcGFjaGUvYmVhbS9zZGtzL2dvL3Rlc3QvdmVuZG9yL2dpdGh1Yi5jb20vYXBhY2hlL2JlYW0vc2Rrcy9nby9wa2cvYmVhbS9jb3JlL3J1bnRpbWUvY29kZXJ4LmVuY1ZhckludFoSEAgWIgQIGUAPKgYIFBICCAgikQEKcWdpdGh1Yi5jb20vYXBhY2hlL2JlYW0vc2Rrcy9nby90ZXN0L3ZlbmRvci9naXRodWIuY29tL2FwYWNoZS9iZWFtL3Nka3MvZ28vcGtnL2JlYW0vY29yZS9ydW50aW1lL2NvZGVyeC5kZWNWYXJJbnRaEhwIFiIECBlAAyIGCBQSAggIKgQIGUAPKgQIGUAB"
                        }
                      ]
                    },
                    {
                      "@type": "kind:stream",
                      "component_encodings": [
                        {
                          "@type": "kind:length_prefix",
                          "component_encodings": [
                            {
                              "@type": "Cgd2YXJpbnR6EgIIAhqFAQpxZ2l0aHViLmNvbS9hcGFjaGUvYmVhbS9zZGtzL2dvL3Rlc3QvdmVuZG9yL2dpdGh1Yi5jb20vYXBhY2hlL2JlYW0vc2Rrcy9nby9wa2cvYmVhbS9jb3JlL3J1bnRpbWUvY29kZXJ4LmVuY1ZhckludFoSEAgWIgQIGUAPKgYIFBICCAgikQEKcWdpdGh1Yi5jb20vYXBhY2hlL2JlYW0vc2Rrcy9nby90ZXN0L3ZlbmRvci9naXRodWIuY29tL2FwYWNoZS9iZWFtL3Nka3MvZ28vcGtnL2JlYW0vY29yZS9ydW50aW1lL2NvZGVyeC5kZWNWYXJJbnRaEhwIFiIECBlAAyIGCBQSAggIKgQIGUAPKgQIGUAB"
                            }
                          ]
                        }
                      ],
                      "is_stream_like": true
                    }
                  ],
                  "is_pair_like": true
                },
                {
                  "@type": "kind:global_window"
                }
              ],
              "is_wrapper": true
            }
          }
        ],
        "parallel_input": {
          "@type": "OutputReference",
          "step_name": "e4",
          "output_name": "i0"
        },
        "serialized_fn": "%0A%29%22%27%0A%02c1%12%21%0A%1F%0A%1D%0A%1Bbeam:coder:global_window:v1j9%0A%25%0A%23%0A%21beam:windowfn:global_windows:v0.1%10%01%1A%02c1%22%02:%00%28%010%018%02H%01"
      }
    },
    {
      "kind": "ParallelDo",
      "name": "e6",
      "properties": {
        "user_name": "passert.Sum(emit1)/passert.sumFn'1",
        "output_info": [
          {
            "user_name": "bogus",
            "output_name": "bogus",
            "encoding": {
              "@type": "kind:windowed_value",
              "component_encodings": [
                {
                  "@type": "kind:bytes"
                },
                {
                  "@type": "kind:global_window"
                }
              ],
              "is_wrapper": true
            }
          }
        ],
        "parallel_input": {
          "@type": "OutputReference",
          "step_name": "e5",
          "output_name": "i0"
        },
        "serialized_fn": "e6"
      }
    }
  ],
  "type": "JOB_TYPE_BATCH"
}
2018/09/11 12:03:20 Submitted job: 2018-09-11_05_03_17-7135346173779950927
2018/09/11 12:03:20 Console: https://console.cloud.google.com/dataflow/job/2018-09-11_05_03_17-7135346173779950927?project=apache-beam-testing
2018/09/11 12:03:20 Submitted job: 2018-09-11_05_03_18-7235842332891011540
2018/09/11 12:03:20 Console: https://console.cloud.google.com/dataflow/job/2018-09-11_05_03_18-7235842332891011540?project=apache-beam-testing
2018/09/11 12:03:20 Logs: https://console.cloud.google.com/logs/viewer?project=apache-beam-testing&resource=dataflow_step%2Fjob_id%2F2018-09-11_05_03_18-7235842332891011540
2018/09/11 12:03:20 Logs: https://console.cloud.google.com/logs/viewer?project=apache-beam-testing&resource=dataflow_step%2Fjob_id%2F2018-09-11_05_03_17-7135346173779950927
2018/09/11 12:03:20 Submitted job: 2018-09-11_05_03_17-12088031532843438528
2018/09/11 12:03:20 Console: https://console.cloud.google.com/dataflow/job/2018-09-11_05_03_17-12088031532843438528?project=apache-beam-testing
2018/09/11 12:03:20 Logs: https://console.cloud.google.com/logs/viewer?project=apache-beam-testing&resource=dataflow_step%2Fjob_id%2F2018-09-11_05_03_17-12088031532843438528
2018/09/11 12:03:20 Submitted job: 2018-09-11_05_03_17-6146526175682647009
2018/09/11 12:03:20 Console: https://console.cloud.google.com/dataflow/job/2018-09-11_05_03_17-6146526175682647009?project=apache-beam-testing
2018/09/11 12:03:20 Logs: https://console.cloud.google.com/logs/viewer?project=apache-beam-testing&resource=dataflow_step%2Fjob_id%2F2018-09-11_05_03_17-6146526175682647009
2018/09/11 12:03:20 Job state: JOB_STATE_PENDING ...
2018/09/11 12:03:20 Job state: JOB_STATE_PENDING ...
2018/09/11 12:03:20 Job state: JOB_STATE_PENDING ...
2018/09/11 12:03:20 Job state: JOB_STATE_PENDING ...
2018/09/11 12:03:20 Submitted job: 2018-09-11_05_03_18-5566780942775564030
2018/09/11 12:03:20 Console: https://console.cloud.google.com/dataflow/job/2018-09-11_05_03_18-5566780942775564030?project=apache-beam-testing
2018/09/11 12:03:20 Logs: https://console.cloud.google.com/logs/viewer?project=apache-beam-testing&resource=dataflow_step%2Fjob_id%2F2018-09-11_05_03_18-5566780942775564030
2018/09/11 12:03:20 Job state: JOB_STATE_PENDING ...
2018/09/11 12:03:50 Job still running ...
2018/09/11 12:03:50 Job still running ...
2018/09/11 12:03:50 Job still running ...
2018/09/11 12:03:50 Job still running ...
2018/09/11 12:03:50 Job still running ...
2018/09/11 12:04:20 Job still running ...
2018/09/11 12:04:20 Job still running ...
2018/09/11 12:04:20 Job still running ...
2018/09/11 12:04:20 Job still running ...
2018/09/11 12:04:20 Job still running ...
2018/09/11 12:04:50 Job still running ...
2018/09/11 12:04:50 Job still running ...
2018/09/11 12:04:50 Job still running ...
2018/09/11 12:04:50 Job still running ...
2018/09/11 12:04:50 Job still running ...
2018/09/11 12:05:20 Job still running ...
2018/09/11 12:05:20 Job still running ...
2018/09/11 12:05:20 Job still running ...
2018/09/11 12:05:20 Job still running ...
2018/09/11 12:05:20 Job still running ...
2018/09/11 12:05:50 Job still running ...
2018/09/11 12:05:50 Job still running ...
2018/09/11 12:05:50 Job still running ...
2018/09/11 12:05:50 Job still running ...
2018/09/11 12:05:50 Job still running ...
2018/09/11 12:06:20 Job still running ...
2018/09/11 12:06:20 Job still running ...
2018/09/11 12:06:20 Job succeeded!
2018/09/11 12:06:20 Test wordcount:memfs completed
2018/09/11 12:06:20 Job succeeded!
2018/09/11 12:06:20 Test wordcount:kinglear completed
2018/09/11 12:06:20 Job still running ...
2018/09/11 12:06:50 Job succeeded!
2018/09/11 12:06:50 Test cogbk:cogbk completed
2018/09/11 12:06:50 Job succeeded!
2018/09/11 12:06:50 Test flatten:flatten completed
2018/09/11 12:06:50 Job succeeded!
2018/09/11 12:06:50 Test pardo:multioutput completed
2018/09/11 12:06:50 Result: all tests passed!

# TODO(herohde) 5/9/2018: run other runner tests here to reuse the container image?

# Delete the container locally and remotely
docker rmi $CONTAINER:$TAG || echo "Failed to remove container"
Untagged: us.gcr.io/apache-beam-testing/jenkins/go:20180911-120212
Untagged: us.gcr.io/apache-beam-testing/jenkins/go@sha256:34cb280d1ebe84d13340d7fb22b3e60df045fa9eeac35dd6646d6ba740e2182a
Deleted: sha256:cfb4d5a834d1344718b9e096eb4176871fca12be2613055d21b03c78060471c6
Deleted: sha256:5857af6cfc00b0307df776b8c6e494877c6eb20c26cb10c7f77343ba1a887480
Deleted: sha256:14ee33bdc199dcd6f50c42671e1824166002e514058bad643b0d4a227a0b08fc
Deleted: sha256:75948e7235ee5a3fbac6de7f532dffb7b565b249300bc5fb11a7e43fce49f639
Deleted: sha256:da8e61ab7cdc1f82680e2fc6490911efdf8acbc275ed788991ff81fff6be4021
Deleted: sha256:581a38c732487b645ccade16f175644de0353fd4073b352db3f1bb8da185dd86
gcloud --quiet container images delete $CONTAINER:$TAG || echo "Failed to delete container"
Digests:
- us.gcr.io/apache-beam-testing/jenkins/go@sha256:34cb280d1ebe84d13340d7fb22b3e60df045fa9eeac35dd6646d6ba740e2182a
  Associated tags:
 - 20180911-120212
Tags:
- us.gcr.io/apache-beam-testing/jenkins/go:20180911-120212
Deleted [us.gcr.io/apache-beam-testing/jenkins/go:20180911-120212].
Deleted [us.gcr.io/apache-beam-testing/jenkins/go@sha256:34cb280d1ebe84d13340d7fb22b3e60df045fa9eeac35dd6646d6ba740e2182a].

# Clean up tempdir
rm -rf $TMPDIR

echo ">>> SUCCESS"
>>> SUCCESS
:goIntegrationTests (Thread[Task worker for ':' Thread 3,5,main]) completed. Took 4 mins 41.974
secs.

FAILURE: Build failed with an exception.

* What went wrong:
Execution failed for task ':beam-sdks-go:test'.
> There are 1 failed tests. Please see <https://builds.apache.org/job/beam_PostCommit_Go_GradleBuild/ws/src/sdks/go/.gogradle/reports/test/index.html>
for more details.

* Try:
Run with --stacktrace option to get the stack trace. Run with --debug option to get more log
output. Run with --scan to get full insights.

* Get more help at https://help.gradle.org

Deprecated Gradle features were used in this build, making it incompatible with Gradle 5.0.
See https://docs.gradle.org/4.8/userguide/command_line_interface.html#sec:command_line_warnings

BUILD FAILED in 6m 41s
44 actionable tasks: 44 executed

Publishing build scan...
https://gradle.com/s/m3xzdhvzzmr7q

Build step 'Invoke Gradle script' changed build result to FAILURE
Build step 'Invoke Gradle script' marked build as failure

Mime
View raw message