beam-commits mailing list archives

Site index · List index
Message view « Date » · « Thread »
Top « Date » · « Thread »
From Apache Jenkins Server <jenk...@builds.apache.org>
Subject Build failed in Jenkins: beam_PostCommit_Python_PortableValidatesRunner_Flink_Gradle #87
Date Wed, 12 Sep 2018 18:03:10 GMT
See <https://builds.apache.org/job/beam_PostCommit_Python_PortableValidatesRunner_Flink_Gradle/87/display/redirect>

------------------------------------------
[...truncated 142.81 KB...]
Skip updating github.com/golang/snappy#553a641470496b2327abcac10b36396bd98e45c9 in /home/jenkins/.gradle/go/repo/github.com/golang/snappy/96c568bbd0eca3e3f6a41e15a438261a.
Skip updating github.com/coreos/etcd#11214aa33bf5a47d3d9d8dafe0f6b97237dfe921 in /home/jenkins/.gradle/go/repo/github.com/coreos/etcd/e07ad470c42c48737a8fdaa60abf6316.
Skip updating github.com/google/go-cmp#3af367b6b30c263d47e8895973edcca9a49cf029 in /home/jenkins/.gradle/go/repo/github.com/google/go-cmp/0e30ce638fec37a4c0a4040d380290b4.
Skip updating github.com/google/pprof#a8f279b7952b27edbcb72e5a6c69ee9be4c8ad93 in /home/jenkins/.gradle/go/repo/github.com/google/pprof/580224cd7b76319263fe32ca011a0650.
Skip updating github.com/googleapis/gax-go#317e0006254c44a0ac427cc52a0e083ff0b9622f in /home/jenkins/.gradle/go/repo/github.com/googleapis/gax-go/cfbdb0eaeda3f1ea6b48e4ebedd6b7ac.
Skip updating github.com/coreos/etcd#11214aa33bf5a47d3d9d8dafe0f6b97237dfe921 in /home/jenkins/.gradle/go/repo/github.com/coreos/etcd/e07ad470c42c48737a8fdaa60abf6316.
Skip updating github.com/coreos/etcd#11214aa33bf5a47d3d9d8dafe0f6b97237dfe921 in /home/jenkins/.gradle/go/repo/github.com/coreos/etcd/e07ad470c42c48737a8fdaa60abf6316.
Skip updating github.com/coreos/etcd#11214aa33bf5a47d3d9d8dafe0f6b97237dfe921 in /home/jenkins/.gradle/go/repo/github.com/coreos/etcd/e07ad470c42c48737a8fdaa60abf6316.
Skip updating github.com/hashicorp/hcl#23c074d0eceb2b8a5bfdbb271ab780cde70f05a8 in /home/jenkins/.gradle/go/repo/github.com/hashicorp/hcl/37e0bb8b36d14da77f9f8c5babf91e48.
Skip updating github.com/ianlancetaylor/demangle#4883227f66371e02c4948937d3e2be1664d9be38
in /home/jenkins/.gradle/go/repo/github.com/ianlancetaylor/demangle/da9250878eadca7fe1a997f2c1e465b3.
Skip updating github.com/coreos/etcd#11214aa33bf5a47d3d9d8dafe0f6b97237dfe921 in /home/jenkins/.gradle/go/repo/github.com/coreos/etcd/e07ad470c42c48737a8fdaa60abf6316.
Skip updating github.com/coreos/etcd#11214aa33bf5a47d3d9d8dafe0f6b97237dfe921 in /home/jenkins/.gradle/go/repo/github.com/coreos/etcd/e07ad470c42c48737a8fdaa60abf6316.
Skip updating github.com/kr/fs#2788f0dbd16903de03cb8186e5c7d97b69ad387b in /home/jenkins/.gradle/go/repo/github.com/kr/fs/ef69c46d4366e9d326896066a4b027d4.
Skip updating github.com/coreos/etcd#11214aa33bf5a47d3d9d8dafe0f6b97237dfe921 in /home/jenkins/.gradle/go/repo/github.com/coreos/etcd/e07ad470c42c48737a8fdaa60abf6316.
Skip updating github.com/magiconair/properties#49d762b9817ba1c2e9d0c69183c2b4a8b8f1d934 in
/home/jenkins/.gradle/go/repo/github.com/magiconair/properties/34883f6c3f37cca1c4582d137f9fc020.
Skip updating github.com/coreos/etcd#11214aa33bf5a47d3d9d8dafe0f6b97237dfe921 in /home/jenkins/.gradle/go/repo/github.com/coreos/etcd/e07ad470c42c48737a8fdaa60abf6316.
Skip updating github.com/coreos/etcd#11214aa33bf5a47d3d9d8dafe0f6b97237dfe921 in /home/jenkins/.gradle/go/repo/github.com/coreos/etcd/e07ad470c42c48737a8fdaa60abf6316.
Skip updating github.com/mitchellh/go-homedir#b8bc1bf767474819792c23f32d8286a45736f1c6 in
/home/jenkins/.gradle/go/repo/github.com/mitchellh/go-homedir/11e21d791561444efcbd8f83f3617926.
Skip updating github.com/mitchellh/mapstructure#a4e142e9c047c904fa2f1e144d9a84e6133024bc in
/home/jenkins/.gradle/go/repo/github.com/mitchellh/mapstructure/8f497225aea52894fde79ad66bc0eb05.
Skip updating github.com/coreos/etcd#11214aa33bf5a47d3d9d8dafe0f6b97237dfe921 in /home/jenkins/.gradle/go/repo/github.com/coreos/etcd/e07ad470c42c48737a8fdaa60abf6316.
Skip updating github.com/openzipkin/zipkin-go#3741243b287094fda649c7f0fa74bd51f37dc122 in
/home/jenkins/.gradle/go/repo/github.com/openzipkin/zipkin-go/e53ea28b1632f7d2624f50816a45fa4e.
Skip updating github.com/pelletier/go-toml#acdc4509485b587f5e675510c4f2c63e90ff68a8 in /home/jenkins/.gradle/go/repo/github.com/pelletier/go-toml/fcb4bcb69fca9eab0a7b3cb341106167.
Skip updating github.com/coreos/etcd#11214aa33bf5a47d3d9d8dafe0f6b97237dfe921 in /home/jenkins/.gradle/go/repo/github.com/coreos/etcd/e07ad470c42c48737a8fdaa60abf6316.
Skip updating github.com/pierrec/lz4#ed8d4cc3b461464e69798080a0092bd028910298 in /home/jenkins/.gradle/go/repo/github.com/pierrec/lz4/83deb6b4d9e1d60342f2e0141ef3372c.
Skip updating github.com/pierrec/xxHash#a0006b13c722f7f12368c00a3d3c2ae8a999a0c6 in /home/jenkins/.gradle/go/repo/github.com/pierrec/xxHash/0aff276981c744f632693880472ff35f.
Skip updating github.com/pkg/errors#30136e27e2ac8d167177e8a583aa4c3fea5be833 in /home/jenkins/.gradle/go/repo/github.com/pkg/errors/2e4e7e2f9086007efa2e7bd2b4aac96d.
Skip updating github.com/pkg/sftp#22e9c1ccc02fc1b9fa3264572e49109b68a86947 in /home/jenkins/.gradle/go/repo/github.com/pkg/sftp/a97d32b473b1b771dd73590d425c6efa.
Skip updating github.com/prometheus/client_golang#9bb6ab929dcbe1c8393cd9ef70387cb69811bd1c
in /home/jenkins/.gradle/go/repo/github.com/prometheus/client_golang/e47e9fc2682ee532aab4f916e0ba7067.
Skip updating github.com/coreos/etcd#11214aa33bf5a47d3d9d8dafe0f6b97237dfe921 in /home/jenkins/.gradle/go/repo/github.com/coreos/etcd/e07ad470c42c48737a8fdaa60abf6316.
Skip updating github.com/coreos/etcd#11214aa33bf5a47d3d9d8dafe0f6b97237dfe921 in /home/jenkins/.gradle/go/repo/github.com/coreos/etcd/e07ad470c42c48737a8fdaa60abf6316.
Skip updating github.com/prometheus/procfs#cb4147076ac75738c9a7d279075a253c0cc5acbd in /home/jenkins/.gradle/go/repo/github.com/prometheus/procfs/520728c921fed5d680688350f35d5741.
Skip updating github.com/rcrowley/go-metrics#8732c616f52954686704c8645fe1a9d59e9df7c1 in /home/jenkins/.gradle/go/repo/github.com/rcrowley/go-metrics/f0d8dabece2ef254f6ec08366c62d08e.
Skip updating github.com/cpuguy83/go-md2man#dc9f53734905c233adfc09fd4f063dce63ce3daf in /home/jenkins/.gradle/go/repo/github.com/cpuguy83/go-md2man/12e5b04f5fe32bdd05573f005036f2c6.
Skip updating github.com/cpuguy83/go-md2man#dc9f53734905c233adfc09fd4f063dce63ce3daf in /home/jenkins/.gradle/go/repo/github.com/cpuguy83/go-md2man/12e5b04f5fe32bdd05573f005036f2c6.
Skip updating github.com/coreos/etcd#11214aa33bf5a47d3d9d8dafe0f6b97237dfe921 in /home/jenkins/.gradle/go/repo/github.com/coreos/etcd/e07ad470c42c48737a8fdaa60abf6316.
Skip updating github.com/coreos/etcd#11214aa33bf5a47d3d9d8dafe0f6b97237dfe921 in /home/jenkins/.gradle/go/repo/github.com/coreos/etcd/e07ad470c42c48737a8fdaa60abf6316.
Skip updating github.com/spf13/afero#bb8f1927f2a9d3ab41c9340aa034f6b803f4359c in /home/jenkins/.gradle/go/repo/github.com/spf13/afero/0d5b43f5d5a0d64c660c5f7f85c69eba.
Skip updating github.com/spf13/cast#acbeb36b902d72a7a4c18e8f3241075e7ab763e4 in /home/jenkins/.gradle/go/repo/github.com/spf13/cast/517542251c45d58331ec1dd452bb121b.
Skip updating github.com/spf13/cobra#93959269ad99e80983c9ba742a7e01203a4c0e4f in /home/jenkins/.gradle/go/repo/github.com/spf13/cobra/e71e66962e88c28e97f1d24435dc7be4.
Skip updating github.com/spf13/jwalterweatherman#7c0cea34c8ece3fbeb2b27ab9b59511d360fb394
in /home/jenkins/.gradle/go/repo/github.com/spf13/jwalterweatherman/330c1f6608327a4a7166e17f6e499144.
Skip updating github.com/coreos/etcd#11214aa33bf5a47d3d9d8dafe0f6b97237dfe921 in /home/jenkins/.gradle/go/repo/github.com/coreos/etcd/e07ad470c42c48737a8fdaa60abf6316.
Skip updating github.com/spf13/viper#aafc9e6bc7b7bb53ddaa75a5ef49a17d6e654be5 in /home/jenkins/.gradle/go/repo/github.com/spf13/viper/0646b428d96e964862ed970f8f3b1b0d.
Skip updating github.com/stathat/go#74669b9f388d9d788c97399a0824adbfee78400e in /home/jenkins/.gradle/go/repo/github.com/stathat/go/50bfc833dbb8ee4dc51ab0c7cc9cdadc.
Skip updating github.com/coreos/etcd#11214aa33bf5a47d3d9d8dafe0f6b97237dfe921 in /home/jenkins/.gradle/go/repo/github.com/coreos/etcd/e07ad470c42c48737a8fdaa60abf6316.
Skip updating github.com/coreos/etcd#11214aa33bf5a47d3d9d8dafe0f6b97237dfe921 in /home/jenkins/.gradle/go/repo/github.com/coreos/etcd/e07ad470c42c48737a8fdaa60abf6316.
Skip updating github.com/coreos/etcd#11214aa33bf5a47d3d9d8dafe0f6b97237dfe921 in /home/jenkins/.gradle/go/repo/github.com/coreos/etcd/e07ad470c42c48737a8fdaa60abf6316.
Skip updating github.com/coreos/etcd#11214aa33bf5a47d3d9d8dafe0f6b97237dfe921 in /home/jenkins/.gradle/go/repo/github.com/coreos/etcd/e07ad470c42c48737a8fdaa60abf6316.
Skip updating github.com/xordataexchange/crypt#b2862e3d0a775f18c7cfe02273500ae307b61218 in
/home/jenkins/.gradle/go/repo/github.com/xordataexchange/crypt/8e109341273400bea10f5f0413dcdd9f.
Skip updating go.opencensus.io#aa2b39d1618ef56ba156f27cfcdae9042f68f0bc in /home/jenkins/.gradle/go/repo/go.opencensus.io/fec515add58c7d1c6457c89d887bb2cd.
Skip updating golang.org/x/crypto#d9133f5469342136e669e85192a26056b587f503 in /home/jenkins/.gradle/go/repo/golang.org/x/crypto/2aba65426fb5ce67509b4db7a8dec732.
Skip updating golang.org/x/debug#95515998a8a4bd7448134b2cb5971dbeb12e0b77 in /home/jenkins/.gradle/go/repo/golang.org/x/debug/9043712fb350d6971269000e35dcbfbe.
Skip updating golang.org/x/net#2fb46b16b8dda405028c50f7c7f0f9dd1fa6bfb1 in /home/jenkins/.gradle/go/repo/golang.org/x/net/f47324d5ea8156d76c2bbb6ec5ebfdb6.
Skip updating golang.org/x/oauth2#a032972e28060ca4f5644acffae3dfc268cc09db in /home/jenkins/.gradle/go/repo/golang.org/x/oauth2/b0090736c2a63258c64df39f8d8a4b28.
Skip updating golang.org/x/sync#fd80eb99c8f653c847d294a001bdf2a3a6f768f5 in /home/jenkins/.gradle/go/repo/golang.org/x/sync/bb244395f28c52df3e99060750ebb26d.
Skip updating golang.org/x/sys#37707fdb30a5b38865cfb95e5aab41707daec7fd in /home/jenkins/.gradle/go/repo/golang.org/x/sys/c019fea3f060e6ac3a7ba229face9b20.
Skip updating github.com/coreos/etcd#11214aa33bf5a47d3d9d8dafe0f6b97237dfe921 in /home/jenkins/.gradle/go/repo/github.com/coreos/etcd/e07ad470c42c48737a8fdaa60abf6316.
Skip updating github.com/coreos/etcd#11214aa33bf5a47d3d9d8dafe0f6b97237dfe921 in /home/jenkins/.gradle/go/repo/github.com/coreos/etcd/e07ad470c42c48737a8fdaa60abf6316.

> Task :beam-sdks-java-harness:shadowJar
*******************
GRADLE SHADOW STATS

Total Jars: 43 (includes project)
Total Time: 36.129s [36129ms]
Average Time/Jar: 0.8402093023256s [840.2093023256ms]
*******************
:beam-sdks-java-harness:shadowJar (Thread[Task worker for ':' Thread 2,5,main]) completed.
Took 36.564 secs.
:beam-runners-java-fn-execution:compileJava (Thread[Task worker for ':' Thread 2,5,main])
started.

> Task :beam-runners-java-fn-execution:compileJava
Build cache key for task ':beam-runners-java-fn-execution:compileJava' is 95cf62904052d4c3a10e362d5bee4bc4
Task ':beam-runners-java-fn-execution:compileJava' is not up-to-date because:
  No history is available.
Custom actions are attached to task ':beam-runners-java-fn-execution:compileJava'.
All input files are considered out-of-date for incremental task ':beam-runners-java-fn-execution:compileJava'.
Compiling with error-prone compiler
Note: <https://builds.apache.org/job/beam_PostCommit_Python_PortableValidatesRunner_Flink_Gradle/ws/src/runners/java-fn-execution/src/main/java/org/apache/beam/runners/fnexecution/ServerFactory.java>
uses or overrides a deprecated API.
Note: Recompile with -Xlint:deprecation for details.
Note: Some input files use unchecked or unsafe operations.
Note: Recompile with -Xlint:unchecked for details.
Packing task ':beam-runners-java-fn-execution:compileJava'
:beam-runners-java-fn-execution:compileJava (Thread[Task worker for ':' Thread 2,5,main])
completed. Took 10.413 secs.
:beam-runners-java-fn-execution:classes (Thread[Task worker for ':' Thread 2,5,main]) started.

> Task :beam-runners-java-fn-execution:classes
Skipping task ':beam-runners-java-fn-execution:classes' as it has no actions.
:beam-runners-java-fn-execution:classes (Thread[Task worker for ':' Thread 2,5,main]) completed.
Took 0.0 secs.
:beam-runners-java-fn-execution:shadowJar (Thread[Task worker for ':' Thread 2,5,main]) started.

> Task :beam-runners-java-fn-execution:shadowJar
Build cache key for task ':beam-runners-java-fn-execution:shadowJar' is c528a0b2d45f7940e231bb2a96ace0a7
Caching disabled for task ':beam-runners-java-fn-execution:shadowJar': Caching has not been
enabled for the task
Task ':beam-runners-java-fn-execution:shadowJar' is not up-to-date because:
  No history is available.
*******************
GRADLE SHADOW STATS

Total Jars: 2 (includes project)
Total Time: 2.19s [2190ms]
Average Time/Jar: 1.095s [1095.0ms]
*******************
:beam-runners-java-fn-execution:shadowJar (Thread[Task worker for ':' Thread 2,5,main]) completed.
Took 2.377 secs.
:beam-runners-flink_2.11:compileJava (Thread[Task worker for ':' Thread 2,5,main]) started.

> Task :beam-runners-flink_2.11:compileJava
Build cache key for task ':beam-runners-flink_2.11:compileJava' is 5b848c5a01cf2a3e70306529e2789a53
Task ':beam-runners-flink_2.11:compileJava' is not up-to-date because:
  No history is available.
Custom actions are attached to task ':beam-runners-flink_2.11:compileJava'.
All input files are considered out-of-date for incremental task ':beam-runners-flink_2.11:compileJava'.
Compiling with error-prone compiler
Note: Some input files use or override a deprecated API.
Note: Recompile with -Xlint:deprecation for details.
Note: Some input files use unchecked or unsafe operations.
Note: Recompile with -Xlint:unchecked for details.
Packing task ':beam-runners-flink_2.11:compileJava'
:beam-runners-flink_2.11:compileJava (Thread[Task worker for ':' Thread 2,5,main]) completed.
Took 12.173 secs.
:beam-runners-flink_2.11:classes (Thread[Task worker for ':' Thread 2,5,main]) started.

> Task :beam-runners-flink_2.11:classes
Skipping task ':beam-runners-flink_2.11:classes' as it has no actions.
:beam-runners-flink_2.11:classes (Thread[Task worker for ':' Thread 2,5,main]) completed.
Took 0.0 secs.
:beam-runners-flink_2.11:shadowJar (Thread[Task worker for ':' Thread 2,5,main]) started.

> Task :beam-runners-flink_2.11:shadowJar
Build cache key for task ':beam-runners-flink_2.11:shadowJar' is a1b1c6391aa7fcbd2917b3f03e3e1a49
Caching disabled for task ':beam-runners-flink_2.11:shadowJar': Caching has not been enabled
for the task
Task ':beam-runners-flink_2.11:shadowJar' is not up-to-date because:
  No history is available.
*******************
GRADLE SHADOW STATS

Total Jars: 2 (includes project)
Total Time: 2.121s [2121ms]
Average Time/Jar: 1.0605s [1060.5ms]
*******************
:beam-runners-flink_2.11:shadowJar (Thread[Task worker for ':' Thread 2,5,main]) completed.
Took 2.46 secs.
:beam-runners-flink_2.11-job-server:compileJava (Thread[Task worker for ':' Thread 2,5,main])
started.

> Task :beam-runners-flink_2.11-job-server:compileJava NO-SOURCE
file or directory '<https://builds.apache.org/job/beam_PostCommit_Python_PortableValidatesRunner_Flink_Gradle/ws/src/runners/flink/job-server/src/main/java',>
not found
Skipping task ':beam-runners-flink_2.11-job-server:compileJava' as it has no source files
and no previous output files.
:beam-runners-flink_2.11-job-server:compileJava (Thread[Task worker for ':' Thread 2,5,main])
completed. Took 0.001 secs.
:beam-runners-flink_2.11-job-server:classes (Thread[Task worker for ':' Thread 2,5,main])
started.

> Task :beam-runners-flink_2.11-job-server:classes UP-TO-DATE
Skipping task ':beam-runners-flink_2.11-job-server:classes' as it has no actions.
:beam-runners-flink_2.11-job-server:classes (Thread[Task worker for ':' Thread 2,5,main])
completed. Took 0.0 secs.
:beam-runners-flink_2.11-job-server:shadowJar (Thread[Task worker for ':' Thread 2,5,main])
started.

> Task :beam-runners-flink_2.11-job-server:shadowJar
Build cache key for task ':beam-runners-flink_2.11-job-server:shadowJar' is 4dd56d19e95531250930ff518d3c63fa
Caching disabled for task ':beam-runners-flink_2.11-job-server:shadowJar': Caching has not
been enabled for the task
Task ':beam-runners-flink_2.11-job-server:shadowJar' is not up-to-date because:
  No history is available.

> Task :beam-sdks-go:installDependencies
Skip updating google.golang.org/api#386d4e5f4f92f86e6aec85985761bba4b938a2d5 in /home/jenkins/.gradle/go/repo/google.golang.org/api/e28049fb85a1109eef37826e4bbdd908.

> Task :beam-runners-flink_2.11-job-server:shadowJar
*******************
GRADLE SHADOW STATS

Total Jars: 85 (includes project)
Total Time: 15.802s [15802ms]
Average Time/Jar: 0.18590588235289998s [185.9058823529ms]
*******************
:beam-runners-flink_2.11-job-server:shadowJar (Thread[Task worker for ':' Thread 2,5,main])
completed. Took 16.987 secs.

> Task :beam-sdks-go:installDependencies
Skip updating google.golang.org/genproto#2b5a72b8730b0b16380010cfe5286c42108d88e7 in /home/jenkins/.gradle/go/repo/google.golang.org/genproto/d671e773e8f05b7375b87bbe0b61b2ce.
Skip updating google.golang.org/grpc#7646b5360d049a7ca31e9133315db43456f39e2e in /home/jenkins/.gradle/go/repo/google.golang.org/grpc/f8a4497e5e07f775c7d9e343b98b7521.
Skip updating github.com/coreos/etcd#11214aa33bf5a47d3d9d8dafe0f6b97237dfe921 in /home/jenkins/.gradle/go/repo/github.com/coreos/etcd/e07ad470c42c48737a8fdaa60abf6316.
Skip updating github.com/coreos/etcd#11214aa33bf5a47d3d9d8dafe0f6b97237dfe921 in /home/jenkins/.gradle/go/repo/github.com/coreos/etcd/e07ad470c42c48737a8fdaa60abf6316.
:beam-sdks-go:installDependencies (Thread[Task worker for ':' Thread 10,5,main]) completed.
Took 1 mins 2.692 secs.
:beam-sdks-go:buildLinuxAmd64 (Thread[Task worker for ':' Thread 10,5,main]) started.

> Task :beam-sdks-go:buildLinuxAmd64
Caching disabled for task ':beam-sdks-go:buildLinuxAmd64': Caching has not been enabled for
the task
Task ':beam-sdks-go:buildLinuxAmd64' is not up-to-date because:
  Task has not declared any outputs despite executing actions.
:beam-sdks-go:buildLinuxAmd64 (Thread[Task worker for ':' Thread 10,5,main]) completed. Took
3.807 secs.
:beam-sdks-go:build (Thread[Task worker for ':' Thread 10,5,main]) started.

> Task :beam-sdks-go:build
Caching disabled for task ':beam-sdks-go:build': Caching has not been enabled for the task
Task ':beam-sdks-go:build' is not up-to-date because:
  Task has not declared any outputs despite executing actions.
:beam-sdks-go:build (Thread[Task worker for ':' Thread 10,5,main]) completed. Took 0.0 secs.
:beam-sdks-python-container:resolveBuildDependencies (Thread[Task worker for ':' Thread 10,5,main])
started.

> Task :beam-sdks-python-container:resolveBuildDependencies
Build cache key for task ':beam-sdks-python-container:resolveBuildDependencies' is 630aae5ac3ab9c1983c86134066a698c
Caching disabled for task ':beam-sdks-python-container:resolveBuildDependencies': Caching
has not been enabled for the task
Task ':beam-sdks-python-container:resolveBuildDependencies' is not up-to-date because:
  No history is available.
Cache <https://builds.apache.org/job/beam_PostCommit_Python_PortableValidatesRunner_Flink_Gradle/ws/src/sdks/python/container/.gogradle/cache/PersistenceNotationToResolvedCache-0.10.bin>
not found, skip.
Cache <https://builds.apache.org/job/beam_PostCommit_Python_PortableValidatesRunner_Flink_Gradle/ws/src/sdks/python/container/.gogradle/cache/PersistenceResolvedToDependenciesCache-0.10.bin>
not found, skip.
Resolving ./github.com/apache/beam/sdks/go@<https://builds.apache.org/job/beam_PostCommit_Python_PortableValidatesRunner_Flink_Gradle/ws/src/sdks/go>
:beam-sdks-python-container:resolveBuildDependencies (Thread[Task worker for ':' Thread 10,5,main])
completed. Took 1.208 secs.
:beam-sdks-python-container:installDependencies (Thread[Task worker for ':' Thread 10,5,main])
started.

> Task :beam-sdks-python-container:installDependencies
Caching disabled for task ':beam-sdks-python-container:installDependencies': Caching has not
been enabled for the task
Task ':beam-sdks-python-container:installDependencies' is not up-to-date because:
  Task has not declared any outputs despite executing actions.
Cache <https://builds.apache.org/job/beam_PostCommit_Python_PortableValidatesRunner_Flink_Gradle/ws/src/sdks/python/container/.gogradle/cache/VendorSnapshot-0.10.bin>
not found, skip.
:beam-sdks-python-container:installDependencies (Thread[Task worker for ':' Thread 10,5,main])
completed. Took 0.551 secs.
:beam-sdks-python-container:buildLinuxAmd64 (Thread[Task worker for ':' Thread 10,5,main])
started.

> Task :beam-sdks-python-container:buildLinuxAmd64
Build cache key for task ':beam-sdks-python-container:buildLinuxAmd64' is 2237dd3b9964fb7b707f3156106fe57d
Caching disabled for task ':beam-sdks-python-container:buildLinuxAmd64': Caching has not been
enabled for the task
Task ':beam-sdks-python-container:buildLinuxAmd64' is not up-to-date because:
  No history is available.
:beam-sdks-python-container:buildLinuxAmd64 (Thread[Task worker for ':' Thread 10,5,main])
completed. Took 2.865 secs.
:beam-sdks-python-container:build (Thread[Task worker for ':' Thread 10,5,main]) started.

> Task :beam-sdks-python-container:build
Caching disabled for task ':beam-sdks-python-container:build': Caching has not been enabled
for the task
Task ':beam-sdks-python-container:build' is not up-to-date because:
  Task has not declared any outputs despite executing actions.
:beam-sdks-python-container:build (Thread[Task worker for ':' Thread 10,5,main]) completed.
Took 0.0 secs.

FAILURE: Build failed with an exception.

* Where:
Build file '<https://builds.apache.org/job/beam_PostCommit_Python_PortableValidatesRunner_Flink_Gradle/ws/src/sdks/python/build.gradle'>
line: 36

* What went wrong:
Execution failed for task ':beam-sdks-python:setupVirtualenv'.
> Process 'command 'sh'' finished with non-zero exit value 1

* Try:
Run with --stacktrace option to get the stack trace. Run with --debug option to get more log
output. Run with --scan to get full insights.

* Get more help at https://help.gradle.org

Deprecated Gradle features were used in this build, making it incompatible with Gradle 5.0.
See https://docs.gradle.org/4.8/userguide/command_line_interface.html#sec:command_line_warnings

BUILD FAILED in 3m 0s
53 actionable tasks: 48 executed, 4 from cache, 1 up-to-date

Publishing build scan...
https://gradle.com/s/x47at5q4q7lhq

Build step 'Invoke Gradle script' changed build result to FAILURE
Build step 'Invoke Gradle script' marked build as failure

Mime
View raw message