beam-commits mailing list archives: September 2018

Site index · List index
Message list« Previous · 1 · 2 · 3 · 4 · 5 · 6 · 7 · 8 · 9 · 10 · 11 · 12 · 13 · 14 · 15 · 16 · 17 · 18 · 19 · 20 · 21 · 22 · 23 · 24 · Next »Thread · Author · Date
[jira] [Created] (BEAM-5320) Finish Python 3 porting for testing module
Robbe (JIRA)   [jira] [Created] (BEAM-5320) Finish Python 3 porting for testing module Wed, 05 Sep, 15:48
Valentyn Tymofieiev (JIRA)   [jira] [Assigned] (BEAM-5320) Finish Python 3 porting for testing module Wed, 05 Sep, 16:58
Matthias Feys (JIRA)   [jira] [Assigned] (BEAM-5320) Finish Python 3 porting for testing module Mon, 17 Sep, 16:30
Matthias Feys (JIRA)   [jira] [Assigned] (BEAM-5320) Finish Python 3 porting for testing module Mon, 17 Sep, 16:30
Matthias Feys (JIRA)   [jira] [Assigned] (BEAM-5320) Finish Python 3 porting for testing module Mon, 17 Sep, 16:31
Matthias Feys (JIRA)   [jira] [Assigned] (BEAM-5320) Finish Python 3 porting for testing module Mon, 17 Sep, 16:31
Matthias Feys (JIRA)   [jira] [Assigned] (BEAM-5320) Finish Python 3 porting for testing module Tue, 18 Sep, 08:28
Matthias Feys (JIRA)   [jira] [Commented] (BEAM-5320) Finish Python 3 porting for testing module Tue, 18 Sep, 08:31
Ahmet Altay (JIRA)   [jira] [Assigned] (BEAM-5320) Finish Python 3 porting for testing module Tue, 18 Sep, 17:11
Ahmet Altay (JIRA)   [jira] [Commented] (BEAM-5320) Finish Python 3 porting for testing module Tue, 18 Sep, 17:12
[jira] [Created] (BEAM-5322) Finish Python 3 porting for typehints module
Robbe (JIRA)   [jira] [Created] (BEAM-5322) Finish Python 3 porting for typehints module Wed, 05 Sep, 15:49
Robbe (JIRA)   [jira] [Assigned] (BEAM-5322) Finish Python 3 porting for typehints module Wed, 05 Sep, 15:50
Robbe (JIRA)   [jira] [Assigned] (BEAM-5322) Finish Python 3 porting for typehints module Wed, 05 Sep, 15:58
[jira] [Created] (BEAM-5324) Finish Python 3 porting for unpackaged files
Robbe (JIRA)   [jira] [Created] (BEAM-5324) Finish Python 3 porting for unpackaged files Wed, 05 Sep, 15:49
Valentyn Tymofieiev (JIRA)   [jira] [Assigned] (BEAM-5324) Finish Python 3 porting for unpackaged files Wed, 05 Sep, 16:57
Robbe (JIRA)   [jira] [Assigned] (BEAM-5324) Finish Python 3 porting for unpackaged files Tue, 18 Sep, 12:29
ASF GitHub Bot (JIRA)   [jira] [Work logged] (BEAM-5324) Finish Python 3 porting for unpackaged files Tue, 18 Sep, 12:41
ASF GitHub Bot (JIRA)   [jira] [Work logged] (BEAM-5324) Finish Python 3 porting for unpackaged files Tue, 18 Sep, 18:13
ASF GitHub Bot (JIRA)   [jira] [Work logged] (BEAM-5324) Finish Python 3 porting for unpackaged files Tue, 18 Sep, 18:13
ASF GitHub Bot (JIRA)   [jira] [Work logged] (BEAM-5324) Finish Python 3 porting for unpackaged files Tue, 18 Sep, 22:44
ASF GitHub Bot (JIRA)   [jira] [Work logged] (BEAM-5324) Finish Python 3 porting for unpackaged files Wed, 19 Sep, 02:40
ASF GitHub Bot (JIRA)   [jira] [Work logged] (BEAM-5324) Finish Python 3 porting for unpackaged files Wed, 19 Sep, 05:06
ASF GitHub Bot (JIRA)   [jira] [Work logged] (BEAM-5324) Finish Python 3 porting for unpackaged files Wed, 19 Sep, 05:23
ASF GitHub Bot (JIRA)   [jira] [Work logged] (BEAM-5324) Finish Python 3 porting for unpackaged files Wed, 19 Sep, 13:56
ASF GitHub Bot (JIRA)   [jira] [Work logged] (BEAM-5324) Finish Python 3 porting for unpackaged files Wed, 19 Sep, 23:55
ASF GitHub Bot (JIRA)   [jira] [Work logged] (BEAM-5324) Finish Python 3 porting for unpackaged files Thu, 20 Sep, 00:19
ASF GitHub Bot (JIRA)   [jira] [Work logged] (BEAM-5324) Finish Python 3 porting for unpackaged files Thu, 20 Sep, 00:19
ASF GitHub Bot (JIRA)   [jira] [Work logged] (BEAM-5324) Finish Python 3 porting for unpackaged files Thu, 20 Sep, 00:19
ASF GitHub Bot (JIRA)   [jira] [Work logged] (BEAM-5324) Finish Python 3 porting for unpackaged files Thu, 20 Sep, 00:21
ASF GitHub Bot (JIRA)   [jira] [Work logged] (BEAM-5324) Finish Python 3 porting for unpackaged files Thu, 20 Sep, 00:27
ASF GitHub Bot (JIRA)   [jira] [Work logged] (BEAM-5324) Finish Python 3 porting for unpackaged files Thu, 20 Sep, 00:48
ASF GitHub Bot (JIRA)   [jira] [Work logged] (BEAM-5324) Finish Python 3 porting for unpackaged files Thu, 20 Sep, 07:40
ASF GitHub Bot (JIRA)   [jira] [Work logged] (BEAM-5324) Finish Python 3 porting for unpackaged files Thu, 20 Sep, 07:41
ASF GitHub Bot (JIRA)   [jira] [Work logged] (BEAM-5324) Finish Python 3 porting for unpackaged files Thu, 20 Sep, 19:12
ASF GitHub Bot (JIRA)   [jira] [Work logged] (BEAM-5324) Finish Python 3 porting for unpackaged files Fri, 21 Sep, 16:10
ASF GitHub Bot (JIRA)   [jira] [Work logged] (BEAM-5324) Finish Python 3 porting for unpackaged files Fri, 21 Sep, 16:36
ASF GitHub Bot (JIRA)   [jira] [Work logged] (BEAM-5324) Finish Python 3 porting for unpackaged files Fri, 21 Sep, 17:06
ASF GitHub Bot (JIRA)   [jira] [Work logged] (BEAM-5324) Finish Python 3 porting for unpackaged files Fri, 21 Sep, 17:07
ASF GitHub Bot (JIRA)   [jira] [Work logged] (BEAM-5324) Finish Python 3 porting for unpackaged files Fri, 21 Sep, 17:49
ASF GitHub Bot (JIRA)   [jira] [Work logged] (BEAM-5324) Finish Python 3 porting for unpackaged files Fri, 21 Sep, 17:51
ASF GitHub Bot (JIRA)   [jira] [Work logged] (BEAM-5324) Finish Python 3 porting for unpackaged files Fri, 21 Sep, 17:52
ASF GitHub Bot (JIRA)   [jira] [Work logged] (BEAM-5324) Finish Python 3 porting for unpackaged files Fri, 21 Sep, 17:52
ASF GitHub Bot (JIRA)   [jira] [Work logged] (BEAM-5324) Finish Python 3 porting for unpackaged files Fri, 21 Sep, 17:54
[jira] [Created] (BEAM-5323) Finish Python 3 porting for utils module
Robbe (JIRA)   [jira] [Created] (BEAM-5323) Finish Python 3 porting for utils module Wed, 05 Sep, 15:49
Valentyn Tymofieiev (JIRA)   [jira] [Assigned] (BEAM-5323) Finish Python 3 porting for utils module Wed, 05 Sep, 16:59
Robbe (JIRA)   [jira] [Assigned] (BEAM-5323) Finish Python 3 porting for utils module Mon, 10 Sep, 20:40
ASF GitHub Bot (JIRA)   [jira] [Work logged] (BEAM-5323) Finish Python 3 porting for utils module Mon, 10 Sep, 21:01
ASF GitHub Bot (JIRA)   [jira] [Work logged] (BEAM-5323) Finish Python 3 porting for utils module Mon, 10 Sep, 21:07
ASF GitHub Bot (JIRA)   [jira] [Work logged] (BEAM-5323) Finish Python 3 porting for utils module Mon, 10 Sep, 21:09
ASF GitHub Bot (JIRA)   [jira] [Work logged] (BEAM-5323) Finish Python 3 porting for utils module Mon, 10 Sep, 23:44
ASF GitHub Bot (JIRA)   [jira] [Work logged] (BEAM-5323) Finish Python 3 porting for utils module Wed, 12 Sep, 22:25
ASF GitHub Bot (JIRA)   [jira] [Work logged] (BEAM-5323) Finish Python 3 porting for utils module Wed, 12 Sep, 22:59
Valentyn Tymofieiev (JIRA)   [jira] [Commented] (BEAM-5323) Finish Python 3 porting for utils module Fri, 14 Sep, 16:44
Robbe (JIRA)   [jira] [Resolved] (BEAM-5323) Finish Python 3 porting for utils module Fri, 14 Sep, 19:10
Robbe (JIRA)   [jira] [Commented] (BEAM-5323) Finish Python 3 porting for utils module Fri, 14 Sep, 19:10
[jira] [Created] (BEAM-5325) Convert gen_protos to tox task.
Valentyn Tymofieiev (JIRA)   [jira] [Created] (BEAM-5325) Convert gen_protos to tox task. Wed, 05 Sep, 15:50
Valentyn Tymofieiev (JIRA)   [jira] [Updated] (BEAM-5325) Convert gen_protos to tox task. Wed, 05 Sep, 15:51
an...@apache.org [beam] branch master updated (51851b1 -> 96df192) Wed, 05 Sep, 16:11
an...@apache.org   [beam] 01/01: Merge pull request #6290 from amaliujia/rui_wang-correct_test_case_of_complex_type Wed, 05 Sep, 16:11
[jira] [Work logged] (BEAM-5252) Fix the failing complex type test due to misusing reversed keyword of Calcite
ASF GitHub Bot (JIRA)   [jira] [Work logged] (BEAM-5252) Fix the failing complex type test due to misusing reversed keyword of Calcite Wed, 05 Sep, 16:12
[jira] [Created] (BEAM-5326) Support for custom dataflow worker jar
Henning Rohde (JIRA)   [jira] [Created] (BEAM-5326) Support for custom dataflow worker jar Wed, 05 Sep, 16:31
Henning Rohde (JIRA)   [jira] [Updated] (BEAM-5326) Support for custom dataflow worker jar Wed, 05 Sep, 16:53
[jira] [Created] (BEAM-5327) Go support for custom dataflow worker jar
Henning Rohde (JIRA)   [jira] [Created] (BEAM-5327) Go support for custom dataflow worker jar Wed, 05 Sep, 16:32
ASF GitHub Bot (JIRA)   [jira] [Work logged] (BEAM-5327) Go support for custom dataflow worker jar Wed, 05 Sep, 16:35
ASF GitHub Bot (JIRA)   [jira] [Work logged] (BEAM-5327) Go support for custom dataflow worker jar Wed, 05 Sep, 16:35
ASF GitHub Bot (JIRA)   [jira] [Work logged] (BEAM-5327) Go support for custom dataflow worker jar Wed, 05 Sep, 16:40
ASF GitHub Bot (JIRA)   [jira] [Work logged] (BEAM-5327) Go support for custom dataflow worker jar Thu, 06 Sep, 19:15
Henning Rohde (JIRA)   [jira] [Resolved] (BEAM-5327) Go support for custom dataflow worker jar Thu, 06 Sep, 19:16
[jira] [Work logged] (BEAM-5279) Metadata is lost in CalciteUtils schema conversion
ASF GitHub Bot (JIRA)   [jira] [Work logged] (BEAM-5279) Metadata is lost in CalciteUtils schema conversion Wed, 05 Sep, 16:56
ASF GitHub Bot (JIRA)   [jira] [Work logged] (BEAM-5279) Metadata is lost in CalciteUtils schema conversion Thu, 06 Sep, 18:29
ASF GitHub Bot (JIRA)   [jira] [Work logged] (BEAM-5279) Metadata is lost in CalciteUtils schema conversion Thu, 06 Sep, 18:29
ASF GitHub Bot (JIRA)   [jira] [Work logged] (BEAM-5279) Metadata is lost in CalciteUtils schema conversion Thu, 06 Sep, 18:29
ASF GitHub Bot (JIRA)   [jira] [Work logged] (BEAM-5279) Metadata is lost in CalciteUtils schema conversion Thu, 06 Sep, 18:29
ASF GitHub Bot (JIRA)   [jira] [Work logged] (BEAM-5279) Metadata is lost in CalciteUtils schema conversion Thu, 06 Sep, 20:31
ASF GitHub Bot (JIRA)   [jira] [Work logged] (BEAM-5279) Metadata is lost in CalciteUtils schema conversion Fri, 07 Sep, 16:49
ASF GitHub Bot (JIRA)   [jira] [Work logged] (BEAM-5279) Metadata is lost in CalciteUtils schema conversion Fri, 07 Sep, 21:35
ASF GitHub Bot (JIRA)   [jira] [Work logged] (BEAM-5279) Metadata is lost in CalciteUtils schema conversion Fri, 07 Sep, 21:37
ASF GitHub Bot (JIRA)   [jira] [Work logged] (BEAM-5279) Metadata is lost in CalciteUtils schema conversion Fri, 07 Sep, 21:40
Andrew Pilloud (JIRA)   [jira] [Closed] (BEAM-5279) Metadata is lost in CalciteUtils schema conversion Fri, 07 Sep, 21:40
[jira] [Assigned] (BEAM-5089) Add an SDK harness container with Python 3 interpreter for portable pipelines.
Valentyn Tymofieiev (JIRA)   [jira] [Assigned] (BEAM-5089) Add an SDK harness container with Python 3 interpreter for portable pipelines. Wed, 05 Sep, 16:56
[jira] [Updated] (BEAM-5044) Project beam_PostCommit_Python_Verify: FnApiRunnerTestWithGrpc: BeamAssertException: Failed assert: ['a'] == ['a', 'b'] [while running 'assert_that/Match']
Mikhail Gryzykhin (JIRA)   [jira] [Updated] (BEAM-5044) Project beam_PostCommit_Python_Verify: FnApiRunnerTestWithGrpc: BeamAssertException: Failed assert: ['a'] == ['a', 'b'] [while running 'assert_that/Match'] Wed, 05 Sep, 17:13
Mikhail Gryzykhin (JIRA)   [jira] [Commented] (BEAM-5044) Project beam_PostCommit_Python_Verify: FnApiRunnerTestWithGrpc: BeamAssertException: Failed assert: ['a'] == ['a', 'b'] [while running 'assert_that/Match'] Wed, 05 Sep, 17:14
Mikhail Gryzykhin (JIRA)   [jira] [Assigned] (BEAM-5044) Project beam_PostCommit_Python_Verify: FnApiRunnerTestWithGrpc: BeamAssertException: Failed assert: ['a'] == ['a', 'b'] [while running 'assert_that/Match'] Wed, 05 Sep, 17:14
Pablo Estrada (JIRA)   [jira] [Commented] (BEAM-5044) Project beam_PostCommit_Python_Verify: FnApiRunnerTestWithGrpc: BeamAssertException: Failed assert: ['a'] == ['a', 'b'] [while running 'assert_that/Match'] Fri, 07 Sep, 17:52
Pablo Estrada (JIRA)   [jira] [Commented] (BEAM-5044) Project beam_PostCommit_Python_Verify: FnApiRunnerTestWithGrpc: BeamAssertException: Failed assert: ['a'] == ['a', 'b'] [while running 'assert_that/Match'] Fri, 07 Sep, 18:34
Pablo Estrada (JIRA)   [jira] [Closed] (BEAM-5044) Project beam_PostCommit_Python_Verify: FnApiRunnerTestWithGrpc: BeamAssertException: Failed assert: ['a'] == ['a', 'b'] [while running 'assert_that/Match'] Fri, 07 Sep, 18:36
Apache Jenkins Server Build failed in Jenkins: beam_PerformanceTests_AvroIOIT_HDFS #622 Wed, 05 Sep, 18:06
Apache Jenkins Server   Build failed in Jenkins: beam_PerformanceTests_AvroIOIT_HDFS #623 Thu, 06 Sep, 00:06
Apache Jenkins Server     Build failed in Jenkins: beam_PerformanceTests_AvroIOIT_HDFS #624 Thu, 06 Sep, 06:06
Apache Jenkins Server       Build failed in Jenkins: beam_PerformanceTests_AvroIOIT_HDFS #625 Thu, 06 Sep, 12:06
Apache Jenkins Server         Build failed in Jenkins: beam_PerformanceTests_AvroIOIT_HDFS #626 Thu, 06 Sep, 18:06
Apache Jenkins Server           Build failed in Jenkins: beam_PerformanceTests_AvroIOIT_HDFS #627 Fri, 07 Sep, 00:06
Apache Jenkins Server             Build failed in Jenkins: beam_PerformanceTests_AvroIOIT_HDFS #628 Fri, 07 Sep, 06:06
Apache Jenkins Server               Build failed in Jenkins: beam_PerformanceTests_AvroIOIT_HDFS #629 Fri, 07 Sep, 12:06
Apache Jenkins Server                 Build failed in Jenkins: beam_PerformanceTests_AvroIOIT_HDFS #630 Fri, 07 Sep, 18:06
Apache Jenkins Server                   Build failed in Jenkins: beam_PerformanceTests_AvroIOIT_HDFS #631 Sat, 08 Sep, 00:06
Apache Jenkins Server                     Build failed in Jenkins: beam_PerformanceTests_AvroIOIT_HDFS #632 Sat, 08 Sep, 06:06
Apache Jenkins Server                       Build failed in Jenkins: beam_PerformanceTests_AvroIOIT_HDFS #633 Sat, 08 Sep, 12:06
Apache Jenkins Server                         Build failed in Jenkins: beam_PerformanceTests_AvroIOIT_HDFS #634 Sat, 08 Sep, 18:06
Apache Jenkins Server                           Build failed in Jenkins: beam_PerformanceTests_AvroIOIT_HDFS #635 Sun, 09 Sep, 00:06
Apache Jenkins Server                             Build failed in Jenkins: beam_PerformanceTests_AvroIOIT_HDFS #636 Sun, 09 Sep, 06:06
Apache Jenkins Server                               Build failed in Jenkins: beam_PerformanceTests_AvroIOIT_HDFS #637 Sun, 09 Sep, 12:06
Apache Jenkins Server                                 Build failed in Jenkins: beam_PerformanceTests_AvroIOIT_HDFS #638 Sun, 09 Sep, 18:06
Apache Jenkins Server                                   Build failed in Jenkins: beam_PerformanceTests_AvroIOIT_HDFS #639 Mon, 10 Sep, 04:28
Apache Jenkins Server                                     Build failed in Jenkins: beam_PerformanceTests_AvroIOIT_HDFS #640 Mon, 10 Sep, 06:06
Apache Jenkins Server                                       Build failed in Jenkins: beam_PerformanceTests_AvroIOIT_HDFS #641 Mon, 10 Sep, 12:06
Apache Jenkins Server                                         Build failed in Jenkins: beam_PerformanceTests_AvroIOIT_HDFS #642 Mon, 10 Sep, 18:06
Apache Jenkins Server                                           Build failed in Jenkins: beam_PerformanceTests_AvroIOIT_HDFS #643 Tue, 11 Sep, 00:06
Apache Jenkins Server                                             Build failed in Jenkins: beam_PerformanceTests_AvroIOIT_HDFS #644 Tue, 11 Sep, 06:06
Apache Jenkins Server                                               Jenkins build is back to normal : beam_PerformanceTests_AvroIOIT_HDFS #645 Tue, 11 Sep, 12:19
Apache Jenkins Server Build failed in Jenkins: beam_PerformanceTests_Spark #2161 Wed, 05 Sep, 18:14
Apache Jenkins Server   Build failed in Jenkins: beam_PerformanceTests_Spark #2162 Thu, 06 Sep, 00:40
Apache Jenkins Server     Build failed in Jenkins: beam_PerformanceTests_Spark #2163 Thu, 06 Sep, 06:14
Apache Jenkins Server       Build failed in Jenkins: beam_PerformanceTests_Spark #2164 Thu, 06 Sep, 12:14
Apache Jenkins Server         Build failed in Jenkins: beam_PerformanceTests_Spark #2165 Thu, 06 Sep, 18:14
Apache Jenkins Server           Build failed in Jenkins: beam_PerformanceTests_Spark #2166 Fri, 07 Sep, 00:14
Apache Jenkins Server             Build failed in Jenkins: beam_PerformanceTests_Spark #2167 Fri, 07 Sep, 06:14
Apache Jenkins Server               Build failed in Jenkins: beam_PerformanceTests_Spark #2168 Fri, 07 Sep, 12:14
Apache Jenkins Server                 Build failed in Jenkins: beam_PerformanceTests_Spark #2169 Fri, 07 Sep, 18:14
Apache Jenkins Server                   Build failed in Jenkins: beam_PerformanceTests_Spark #2170 Sat, 08 Sep, 00:40
Apache Jenkins Server                     Build failed in Jenkins: beam_PerformanceTests_Spark #2171 Sat, 08 Sep, 06:14
Apache Jenkins Server                       Build failed in Jenkins: beam_PerformanceTests_Spark #2172 Sat, 08 Sep, 12:14
Apache Jenkins Server                         Build failed in Jenkins: beam_PerformanceTests_Spark #2173 Sat, 08 Sep, 18:14
Apache Jenkins Server                           Build failed in Jenkins: beam_PerformanceTests_Spark #2174 Sun, 09 Sep, 01:40
Apache Jenkins Server                             Build failed in Jenkins: beam_PerformanceTests_Spark #2175 Sun, 09 Sep, 06:14
Apache Jenkins Server                               Build failed in Jenkins: beam_PerformanceTests_Spark #2176 Sun, 09 Sep, 12:14
Apache Jenkins Server                                 Build failed in Jenkins: beam_PerformanceTests_Spark #2177 Sun, 09 Sep, 18:14
Apache Jenkins Server                                   Build failed in Jenkins: beam_PerformanceTests_Spark #2178 Mon, 10 Sep, 04:28
Apache Jenkins Server                                     Build failed in Jenkins: beam_PerformanceTests_Spark #2179 Mon, 10 Sep, 06:14
Apache Jenkins Server                                       Build failed in Jenkins: beam_PerformanceTests_Spark #2180 Mon, 10 Sep, 12:14
Apache Jenkins Server                                         Build failed in Jenkins: beam_PerformanceTests_Spark #2181 Mon, 10 Sep, 18:14
Apache Jenkins Server                                           Build failed in Jenkins: beam_PerformanceTests_Spark #2182 Tue, 11 Sep, 00:14
Apache Jenkins Server                                             Build failed in Jenkins: beam_PerformanceTests_Spark #2183 Tue, 11 Sep, 06:15
Apache Jenkins Server                                               Jenkins build is back to normal : beam_PerformanceTests_Spark #2184 Tue, 11 Sep, 12:19
Apache Jenkins Server Build failed in Jenkins: beam_PerformanceTests_HadoopInputFormat #723 Wed, 05 Sep, 18:16
Apache Jenkins Server   Build failed in Jenkins: beam_PerformanceTests_HadoopInputFormat #724 Thu, 06 Sep, 00:40
Apache Jenkins Server     Build failed in Jenkins: beam_PerformanceTests_HadoopInputFormat #725 Thu, 06 Sep, 06:16
Apache Jenkins Server       Build failed in Jenkins: beam_PerformanceTests_HadoopInputFormat #726 Thu, 06 Sep, 12:16
Apache Jenkins Server         Build failed in Jenkins: beam_PerformanceTests_HadoopInputFormat #727 Thu, 06 Sep, 18:16
Apache Jenkins Server           Build failed in Jenkins: beam_PerformanceTests_HadoopInputFormat #728 Fri, 07 Sep, 00:16
Apache Jenkins Server             Build failed in Jenkins: beam_PerformanceTests_HadoopInputFormat #729 Fri, 07 Sep, 06:16
Apache Jenkins Server               Build failed in Jenkins: beam_PerformanceTests_HadoopInputFormat #730 Fri, 07 Sep, 12:16
Apache Jenkins Server                 Build failed in Jenkins: beam_PerformanceTests_HadoopInputFormat #731 Fri, 07 Sep, 18:16
Apache Jenkins Server                   Build failed in Jenkins: beam_PerformanceTests_HadoopInputFormat #732 Sat, 08 Sep, 00:40
Apache Jenkins Server                     Build failed in Jenkins: beam_PerformanceTests_HadoopInputFormat #733 Sat, 08 Sep, 06:16
Apache Jenkins Server                       Build failed in Jenkins: beam_PerformanceTests_HadoopInputFormat #734 Sat, 08 Sep, 12:16
Apache Jenkins Server                         Build failed in Jenkins: beam_PerformanceTests_HadoopInputFormat #735 Sat, 08 Sep, 18:16
Apache Jenkins Server                           Build failed in Jenkins: beam_PerformanceTests_HadoopInputFormat #736 Sun, 09 Sep, 01:40
Apache Jenkins Server                             Build failed in Jenkins: beam_PerformanceTests_HadoopInputFormat #737 Sun, 09 Sep, 06:16
Apache Jenkins Server                               Build failed in Jenkins: beam_PerformanceTests_HadoopInputFormat #738 Sun, 09 Sep, 12:16
Apache Jenkins Server                                 Build failed in Jenkins: beam_PerformanceTests_HadoopInputFormat #739 Sun, 09 Sep, 18:16
Apache Jenkins Server                                   Build failed in Jenkins: beam_PerformanceTests_HadoopInputFormat #740 Mon, 10 Sep, 04:28
Apache Jenkins Server                                     Build failed in Jenkins: beam_PerformanceTests_HadoopInputFormat #741 Mon, 10 Sep, 06:16
Apache Jenkins Server                                       Build failed in Jenkins: beam_PerformanceTests_HadoopInputFormat #742 Mon, 10 Sep, 12:16
Apache Jenkins Server                                         Build failed in Jenkins: beam_PerformanceTests_HadoopInputFormat #743 Mon, 10 Sep, 18:16
Apache Jenkins Server                                           Build failed in Jenkins: beam_PerformanceTests_HadoopInputFormat #744 Tue, 11 Sep, 00:16
Apache Jenkins Server                                             Build failed in Jenkins: beam_PerformanceTests_HadoopInputFormat #745 Tue, 11 Sep, 06:16
Apache Jenkins Server                                               Jenkins build is back to normal : beam_PerformanceTests_HadoopInputFormat #746 Tue, 11 Sep, 12:30
Apache Jenkins Server Build failed in Jenkins: beam_PerformanceTests_TextIOIT_HDFS #633 Wed, 05 Sep, 18:18
Apache Jenkins Server   Build failed in Jenkins: beam_PerformanceTests_TextIOIT_HDFS #634 Thu, 06 Sep, 00:41
Apache Jenkins Server     Build failed in Jenkins: beam_PerformanceTests_TextIOIT_HDFS #635 Thu, 06 Sep, 06:18
Apache Jenkins Server       Build failed in Jenkins: beam_PerformanceTests_TextIOIT_HDFS #636 Thu, 06 Sep, 12:18
Apache Jenkins Server         Build failed in Jenkins: beam_PerformanceTests_TextIOIT_HDFS #637 Thu, 06 Sep, 18:18
Apache Jenkins Server           Build failed in Jenkins: beam_PerformanceTests_TextIOIT_HDFS #638 Fri, 07 Sep, 00:18
Apache Jenkins Server             Build failed in Jenkins: beam_PerformanceTests_TextIOIT_HDFS #639 Fri, 07 Sep, 06:18
Apache Jenkins Server               Build failed in Jenkins: beam_PerformanceTests_TextIOIT_HDFS #640 Fri, 07 Sep, 12:18
Apache Jenkins Server                 Build failed in Jenkins: beam_PerformanceTests_TextIOIT_HDFS #641 Fri, 07 Sep, 18:18
Apache Jenkins Server                   Build failed in Jenkins: beam_PerformanceTests_TextIOIT_HDFS #642 Sat, 08 Sep, 00:41
Apache Jenkins Server                     Build failed in Jenkins: beam_PerformanceTests_TextIOIT_HDFS #643 Sat, 08 Sep, 06:18
Apache Jenkins Server                       Build failed in Jenkins: beam_PerformanceTests_TextIOIT_HDFS #644 Sat, 08 Sep, 12:18
Apache Jenkins Server                         Build failed in Jenkins: beam_PerformanceTests_TextIOIT_HDFS #645 Sat, 08 Sep, 18:18
Apache Jenkins Server                           Build failed in Jenkins: beam_PerformanceTests_TextIOIT_HDFS #646 Sun, 09 Sep, 01:41
Apache Jenkins Server                             Build failed in Jenkins: beam_PerformanceTests_TextIOIT_HDFS #647 Sun, 09 Sep, 06:18
Apache Jenkins Server                               Build failed in Jenkins: beam_PerformanceTests_TextIOIT_HDFS #648 Sun, 09 Sep, 12:18
Apache Jenkins Server                                 Build failed in Jenkins: beam_PerformanceTests_TextIOIT_HDFS #649 Sun, 09 Sep, 18:18
Apache Jenkins Server                                   Build failed in Jenkins: beam_PerformanceTests_TextIOIT_HDFS #650 Mon, 10 Sep, 04:28
Apache Jenkins Server                                     Build failed in Jenkins: beam_PerformanceTests_TextIOIT_HDFS #651 Mon, 10 Sep, 06:18
Apache Jenkins Server                                       Build failed in Jenkins: beam_PerformanceTests_TextIOIT_HDFS #652 Mon, 10 Sep, 12:18
Apache Jenkins Server                                         Build failed in Jenkins: beam_PerformanceTests_TextIOIT_HDFS #653 Mon, 10 Sep, 18:18
Apache Jenkins Server                                           Build failed in Jenkins: beam_PerformanceTests_TextIOIT_HDFS #654 Tue, 11 Sep, 00:48
Apache Jenkins Server                                             Build failed in Jenkins: beam_PerformanceTests_TextIOIT_HDFS #655 Tue, 11 Sep, 06:18
Apache Jenkins Server                                               Jenkins build is back to normal : beam_PerformanceTests_TextIOIT_HDFS #656 Tue, 11 Sep, 12:30
Apache Jenkins Server Build failed in Jenkins: beam_PerformanceTests_TFRecordIOIT #946 Wed, 05 Sep, 18:21
Apache Jenkins Server   Build failed in Jenkins: beam_PerformanceTests_TFRecordIOIT #947 Thu, 06 Sep, 00:41
Apache Jenkins Server     Build failed in Jenkins: beam_PerformanceTests_TFRecordIOIT #948 Thu, 06 Sep, 06:21
Apache Jenkins Server       Build failed in Jenkins: beam_PerformanceTests_TFRecordIOIT #949 Thu, 06 Sep, 12:21
Apache Jenkins Server         Build failed in Jenkins: beam_PerformanceTests_TFRecordIOIT #950 Thu, 06 Sep, 18:21
Apache Jenkins Server           Build failed in Jenkins: beam_PerformanceTests_TFRecordIOIT #951 Fri, 07 Sep, 00:21
Apache Jenkins Server             Build failed in Jenkins: beam_PerformanceTests_TFRecordIOIT #952 Fri, 07 Sep, 06:21
Apache Jenkins Server               Build failed in Jenkins: beam_PerformanceTests_TFRecordIOIT #953 Fri, 07 Sep, 12:21
Apache Jenkins Server                 Build failed in Jenkins: beam_PerformanceTests_TFRecordIOIT #954 Fri, 07 Sep, 18:21
Apache Jenkins Server                   Build failed in Jenkins: beam_PerformanceTests_TFRecordIOIT #955 Sat, 08 Sep, 00:41
Apache Jenkins Server                     Build failed in Jenkins: beam_PerformanceTests_TFRecordIOIT #956 Sat, 08 Sep, 06:21
Apache Jenkins Server                       Build failed in Jenkins: beam_PerformanceTests_TFRecordIOIT #957 Sat, 08 Sep, 12:21
Apache Jenkins Server                         Build failed in Jenkins: beam_PerformanceTests_TFRecordIOIT #958 Sat, 08 Sep, 18:21
Apache Jenkins Server                           Build failed in Jenkins: beam_PerformanceTests_TFRecordIOIT #959 Sun, 09 Sep, 01:41
Apache Jenkins Server                             Build failed in Jenkins: beam_PerformanceTests_TFRecordIOIT #960 Sun, 09 Sep, 06:21
Apache Jenkins Server                               Build failed in Jenkins: beam_PerformanceTests_TFRecordIOIT #961 Sun, 09 Sep, 12:21
Apache Jenkins Server                                 Build failed in Jenkins: beam_PerformanceTests_TFRecordIOIT #962 Sun, 09 Sep, 18:21
Apache Jenkins Server                                   Build failed in Jenkins: beam_PerformanceTests_TFRecordIOIT #963 Mon, 10 Sep, 04:28
Apache Jenkins Server                                     Build failed in Jenkins: beam_PerformanceTests_TFRecordIOIT #964 Mon, 10 Sep, 06:21
Apache Jenkins Server                                       Build failed in Jenkins: beam_PerformanceTests_TFRecordIOIT #965 Mon, 10 Sep, 12:21
Apache Jenkins Server                                         Build failed in Jenkins: beam_PerformanceTests_TFRecordIOIT #966 Mon, 10 Sep, 18:21
Apache Jenkins Server                                           Build failed in Jenkins: beam_PerformanceTests_TFRecordIOIT #967 Tue, 11 Sep, 00:48
Apache Jenkins Server                                             Build failed in Jenkins: beam_PerformanceTests_TFRecordIOIT #968 Tue, 11 Sep, 06:21
Apache Jenkins Server                                               Jenkins build is back to normal : beam_PerformanceTests_TFRecordIOIT #969 Tue, 11 Sep, 12:33
Apache Jenkins Server Build failed in Jenkins: beam_PerformanceTests_ParquetIOIT_HDFS #340 Wed, 05 Sep, 18:22
Apache Jenkins Server   Build failed in Jenkins: beam_PerformanceTests_ParquetIOIT_HDFS #341 Thu, 06 Sep, 00:41
Apache Jenkins Server     Build failed in Jenkins: beam_PerformanceTests_ParquetIOIT_HDFS #342 Thu, 06 Sep, 06:22
Apache Jenkins Server       Build failed in Jenkins: beam_PerformanceTests_ParquetIOIT_HDFS #343 Thu, 06 Sep, 12:22
Apache Jenkins Server         Build failed in Jenkins: beam_PerformanceTests_ParquetIOIT_HDFS #344 Thu, 06 Sep, 18:22
Apache Jenkins Server           Build failed in Jenkins: beam_PerformanceTests_ParquetIOIT_HDFS #345 Fri, 07 Sep, 00:22
Apache Jenkins Server             Build failed in Jenkins: beam_PerformanceTests_ParquetIOIT_HDFS #346 Fri, 07 Sep, 06:22
Apache Jenkins Server               Build failed in Jenkins: beam_PerformanceTests_ParquetIOIT_HDFS #347 Fri, 07 Sep, 12:22
Apache Jenkins Server                 Build failed in Jenkins: beam_PerformanceTests_ParquetIOIT_HDFS #348 Fri, 07 Sep, 18:22
Apache Jenkins Server                   Build failed in Jenkins: beam_PerformanceTests_ParquetIOIT_HDFS #349 Sat, 08 Sep, 00:42
Apache Jenkins Server                     Build failed in Jenkins: beam_PerformanceTests_ParquetIOIT_HDFS #350 Sat, 08 Sep, 06:22
Apache Jenkins Server                       Build failed in Jenkins: beam_PerformanceTests_ParquetIOIT_HDFS #351 Sat, 08 Sep, 12:22
Apache Jenkins Server                         Build failed in Jenkins: beam_PerformanceTests_ParquetIOIT_HDFS #352 Sat, 08 Sep, 18:22
Apache Jenkins Server                           Build failed in Jenkins: beam_PerformanceTests_ParquetIOIT_HDFS #353 Sun, 09 Sep, 01:41
Apache Jenkins Server                             Build failed in Jenkins: beam_PerformanceTests_ParquetIOIT_HDFS #354 Sun, 09 Sep, 06:22
Apache Jenkins Server                               Build failed in Jenkins: beam_PerformanceTests_ParquetIOIT_HDFS #355 Sun, 09 Sep, 12:22
Apache Jenkins Server                                 Build failed in Jenkins: beam_PerformanceTests_ParquetIOIT_HDFS #356 Sun, 09 Sep, 18:22
Apache Jenkins Server                                   Build failed in Jenkins: beam_PerformanceTests_ParquetIOIT_HDFS #357 Mon, 10 Sep, 04:28
Apache Jenkins Server                                     Build failed in Jenkins: beam_PerformanceTests_ParquetIOIT_HDFS #358 Mon, 10 Sep, 06:22
Apache Jenkins Server                                       Build failed in Jenkins: beam_PerformanceTests_ParquetIOIT_HDFS #359 Mon, 10 Sep, 12:22
Apache Jenkins Server                                         Build failed in Jenkins: beam_PerformanceTests_ParquetIOIT_HDFS #360 Mon, 10 Sep, 18:22
Apache Jenkins Server                                           Build failed in Jenkins: beam_PerformanceTests_ParquetIOIT_HDFS #361 Tue, 11 Sep, 00:49
Apache Jenkins Server                                             Build failed in Jenkins: beam_PerformanceTests_ParquetIOIT_HDFS #362 Tue, 11 Sep, 06:22
Apache Jenkins Server                                               Jenkins build is back to normal : beam_PerformanceTests_ParquetIOIT_HDFS #363 Tue, 11 Sep, 12:34
Apache Jenkins Server Build failed in Jenkins: beam_PerformanceTests_ParquetIOIT #446 Wed, 05 Sep, 18:23
Apache Jenkins Server   Build failed in Jenkins: beam_PerformanceTests_ParquetIOIT #447 Thu, 06 Sep, 00:41
Apache Jenkins Server     Build failed in Jenkins: beam_PerformanceTests_ParquetIOIT #448 Thu, 06 Sep, 06:23
Apache Jenkins Server       Build failed in Jenkins: beam_PerformanceTests_ParquetIOIT #449 Thu, 06 Sep, 12:23
Apache Jenkins Server         Build failed in Jenkins: beam_PerformanceTests_ParquetIOIT #450 Thu, 06 Sep, 18:23
Apache Jenkins Server           Build failed in Jenkins: beam_PerformanceTests_ParquetIOIT #451 Fri, 07 Sep, 00:23
Apache Jenkins Server             Build failed in Jenkins: beam_PerformanceTests_ParquetIOIT #452 Fri, 07 Sep, 06:23
Apache Jenkins Server               Build failed in Jenkins: beam_PerformanceTests_ParquetIOIT #453 Fri, 07 Sep, 12:23
Apache Jenkins Server                 Build failed in Jenkins: beam_PerformanceTests_ParquetIOIT #454 Fri, 07 Sep, 18:23
Apache Jenkins Server                   Build failed in Jenkins: beam_PerformanceTests_ParquetIOIT #455 Sat, 08 Sep, 00:42
Apache Jenkins Server                     Build failed in Jenkins: beam_PerformanceTests_ParquetIOIT #456 Sat, 08 Sep, 06:23
Apache Jenkins Server                       Build failed in Jenkins: beam_PerformanceTests_ParquetIOIT #457 Sat, 08 Sep, 12:23
Apache Jenkins Server                         Build failed in Jenkins: beam_PerformanceTests_ParquetIOIT #458 Sat, 08 Sep, 18:23
Apache Jenkins Server                           Build failed in Jenkins: beam_PerformanceTests_ParquetIOIT #459 Sun, 09 Sep, 01:41
Apache Jenkins Server                             Build failed in Jenkins: beam_PerformanceTests_ParquetIOIT #460 Sun, 09 Sep, 06:23
Apache Jenkins Server                               Build failed in Jenkins: beam_PerformanceTests_ParquetIOIT #461 Sun, 09 Sep, 12:23
Apache Jenkins Server                                 Build failed in Jenkins: beam_PerformanceTests_ParquetIOIT #462 Sun, 09 Sep, 18:23
Apache Jenkins Server                                   Build failed in Jenkins: beam_PerformanceTests_ParquetIOIT #463 Mon, 10 Sep, 04:28
Apache Jenkins Server                                     Build failed in Jenkins: beam_PerformanceTests_ParquetIOIT #464 Mon, 10 Sep, 06:23
Apache Jenkins Server                                       Build failed in Jenkins: beam_PerformanceTests_ParquetIOIT #465 Mon, 10 Sep, 12:23
Apache Jenkins Server                                         Build failed in Jenkins: beam_PerformanceTests_ParquetIOIT #466 Mon, 10 Sep, 18:23
Apache Jenkins Server                                           Build failed in Jenkins: beam_PerformanceTests_ParquetIOIT #467 Tue, 11 Sep, 00:49
Apache Jenkins Server                                             Build failed in Jenkins: beam_PerformanceTests_ParquetIOIT #468 Tue, 11 Sep, 06:23
Apache Jenkins Server                                               Jenkins build is back to normal : beam_PerformanceTests_ParquetIOIT #469 Tue, 11 Sep, 09:03
Apache Jenkins Server Build failed in Jenkins: beam_PerformanceTests_AvroIOIT #953 Wed, 05 Sep, 18:34
Apache Jenkins Server   Build failed in Jenkins: beam_PerformanceTests_AvroIOIT #954 Thu, 06 Sep, 00:45
Apache Jenkins Server     Build failed in Jenkins: beam_PerformanceTests_AvroIOIT #955 Thu, 06 Sep, 06:34
Apache Jenkins Server       Build failed in Jenkins: beam_PerformanceTests_AvroIOIT #956 Thu, 06 Sep, 12:34
Apache Jenkins Server         Build failed in Jenkins: beam_PerformanceTests_AvroIOIT #957 Thu, 06 Sep, 18:34
Apache Jenkins Server           Build failed in Jenkins: beam_PerformanceTests_AvroIOIT #958 Fri, 07 Sep, 00:34
Apache Jenkins Server             Build failed in Jenkins: beam_PerformanceTests_AvroIOIT #959 Fri, 07 Sep, 06:34
Apache Jenkins Server               Build failed in Jenkins: beam_PerformanceTests_AvroIOIT #960 Fri, 07 Sep, 12:34
Apache Jenkins Server                 Build failed in Jenkins: beam_PerformanceTests_AvroIOIT #961 Fri, 07 Sep, 18:34
Apache Jenkins Server                   Build failed in Jenkins: beam_PerformanceTests_AvroIOIT #962 Sat, 08 Sep, 00:45
Apache Jenkins Server                     Build failed in Jenkins: beam_PerformanceTests_AvroIOIT #963 Sat, 08 Sep, 06:34
Apache Jenkins Server                       Build failed in Jenkins: beam_PerformanceTests_AvroIOIT #964 Sat, 08 Sep, 12:34
Apache Jenkins Server                         Build failed in Jenkins: beam_PerformanceTests_AvroIOIT #965 Sat, 08 Sep, 18:34
Apache Jenkins Server                           Build failed in Jenkins: beam_PerformanceTests_AvroIOIT #966 Sun, 09 Sep, 01:45
Apache Jenkins Server                             Build failed in Jenkins: beam_PerformanceTests_AvroIOIT #967 Sun, 09 Sep, 06:34
Apache Jenkins Server                               Build failed in Jenkins: beam_PerformanceTests_AvroIOIT #968 Sun, 09 Sep, 12:34
Apache Jenkins Server                                 Build failed in Jenkins: beam_PerformanceTests_AvroIOIT #969 Sun, 09 Sep, 18:34
Apache Jenkins Server                                   Build failed in Jenkins: beam_PerformanceTests_AvroIOIT #970 Mon, 10 Sep, 04:28
Apache Jenkins Server                                     Build failed in Jenkins: beam_PerformanceTests_AvroIOIT #971 Mon, 10 Sep, 06:34
Apache Jenkins Server                                       Build failed in Jenkins: beam_PerformanceTests_AvroIOIT #972 Mon, 10 Sep, 12:34
Apache Jenkins Server                                         Build failed in Jenkins: beam_PerformanceTests_AvroIOIT #973 Mon, 10 Sep, 18:34
Apache Jenkins Server                                           Build failed in Jenkins: beam_PerformanceTests_AvroIOIT #974 Tue, 11 Sep, 00:52
Apache Jenkins Server                                             Build failed in Jenkins: beam_PerformanceTests_AvroIOIT #975 Tue, 11 Sep, 06:34
Apache Jenkins Server                                               Jenkins build is back to normal : beam_PerformanceTests_AvroIOIT #976 Tue, 11 Sep, 12:43
[jira] [Work logged] (BEAM-5149) Add support to the Java SDK harness to merge windows
ASF GitHub Bot (JIRA)   [jira] [Work logged] (BEAM-5149) Add support to the Java SDK harness to merge windows Wed, 05 Sep, 19:06
ASF GitHub Bot (JIRA)   [jira] [Work logged] (BEAM-5149) Add support to the Java SDK harness to merge windows Wed, 05 Sep, 19:06
ASF GitHub Bot (JIRA)   [jira] [Work logged] (BEAM-5149) Add support to the Java SDK harness to merge windows Wed, 05 Sep, 19:06
ASF GitHub Bot (JIRA)   [jira] [Work logged] (BEAM-5149) Add support to the Java SDK harness to merge windows Wed, 05 Sep, 19:06
ASF GitHub Bot (JIRA)   [jira] [Work logged] (BEAM-5149) Add support to the Java SDK harness to merge windows Wed, 05 Sep, 20:15
ASF GitHub Bot (JIRA)   [jira] [Work logged] (BEAM-5149) Add support to the Java SDK harness to merge windows Wed, 05 Sep, 20:16
ASF GitHub Bot (JIRA)   [jira] [Work logged] (BEAM-5149) Add support to the Java SDK harness to merge windows Wed, 05 Sep, 20:17
ASF GitHub Bot (JIRA)   [jira] [Work logged] (BEAM-5149) Add support to the Java SDK harness to merge windows Wed, 05 Sep, 20:18
ASF GitHub Bot (JIRA)   [jira] [Work logged] (BEAM-5149) Add support to the Java SDK harness to merge windows Wed, 05 Sep, 20:26
ASF GitHub Bot (JIRA)   [jira] [Work logged] (BEAM-5149) Add support to the Java SDK harness to merge windows Mon, 10 Sep, 18:24
[jira] [Work logged] (BEAM-4374) Update existing metrics in the FN API to use new Metric Schema
ASF GitHub Bot (JIRA)   [jira] [Work logged] (BEAM-4374) Update existing metrics in the FN API to use new Metric Schema Wed, 05 Sep, 19:39
ASF GitHub Bot (JIRA)   [jira] [Work logged] (BEAM-4374) Update existing metrics in the FN API to use new Metric Schema Wed, 05 Sep, 20:21
ASF GitHub Bot (JIRA)   [jira] [Work logged] (BEAM-4374) Update existing metrics in the FN API to use new Metric Schema Thu, 06 Sep, 09:53
ASF GitHub Bot (JIRA)   [jira] [Work logged] (BEAM-4374) Update existing metrics in the FN API to use new Metric Schema Mon, 10 Sep, 09:01
ASF GitHub Bot (JIRA)   [jira] [Work logged] (BEAM-4374) Update existing metrics in the FN API to use new Metric Schema Mon, 24 Sep, 23:40
ASF GitHub Bot (JIRA)   [jira] [Work logged] (BEAM-4374) Update existing metrics in the FN API to use new Metric Schema Mon, 24 Sep, 23:42
ASF GitHub Bot (JIRA)   [jira] [Work logged] (BEAM-4374) Update existing metrics in the FN API to use new Metric Schema Tue, 25 Sep, 20:34
ASF GitHub Bot (JIRA)   [jira] [Work logged] (BEAM-4374) Update existing metrics in the FN API to use new Metric Schema Fri, 28 Sep, 16:19
[jira] [Closed] (BEAM-4606) Upper bound for pytz dependency
Udi Meiri (JIRA)   [jira] [Closed] (BEAM-4606) Upper bound for pytz dependency Wed, 05 Sep, 20:24
[jira] [Closed] (BEAM-4696) Execute Jenkins website tests in a Docker container
Udi Meiri (JIRA)   [jira] [Closed] (BEAM-4696) Execute Jenkins website tests in a Docker container Wed, 05 Sep, 20:26
[jira] [Work logged] (BEAM-4790) Make it easier to select code reviewers for PRs
ASF GitHub Bot (JIRA)   [jira] [Work logged] (BEAM-4790) Make it easier to select code reviewers for PRs Wed, 05 Sep, 20:27
ASF GitHub Bot (JIRA)   [jira] [Work logged] (BEAM-4790) Make it easier to select code reviewers for PRs Wed, 05 Sep, 20:34
ASF GitHub Bot (JIRA)   [jira] [Work logged] (BEAM-4790) Make it easier to select code reviewers for PRs Wed, 05 Sep, 20:45
ASF GitHub Bot (JIRA)   [jira] [Work logged] (BEAM-4790) Make it easier to select code reviewers for PRs Wed, 05 Sep, 20:56
ASF GitHub Bot (JIRA)   [jira] [Work logged] (BEAM-4790) Make it easier to select code reviewers for PRs Thu, 20 Sep, 18:30
ASF GitHub Bot (JIRA)   [jira] [Work logged] (BEAM-4790) Make it easier to select code reviewers for PRs Thu, 20 Sep, 18:43
ASF GitHub Bot (JIRA)   [jira] [Work logged] (BEAM-4790) Make it easier to select code reviewers for PRs Thu, 20 Sep, 20:17
mergebot-r...@apache.org [beam-site] branch mergebot updated (d8070cb -> 6932df9) Wed, 05 Sep, 20:41
mergebot-r...@apache.org   [beam-site] 01/02: Update intellij.md Wed, 05 Sep, 20:41
mergebot-r...@apache.org   [beam-site] 02/02: This closes #546 Wed, 05 Sep, 20:42
mergebot-r...@apache.org [beam-site] branch asf-site updated (423f9e8 -> 27eac2e) Wed, 05 Sep, 20:44
mergebot-r...@apache.org   [beam-site] 01/01: Prepare repository for deployment. Wed, 05 Sep, 20:44
[jira] [Commented] (BEAM-5258) Investigate if we can disable Row type flattening in Calcite
Rui Wang (JIRA)   [jira] [Commented] (BEAM-5258) Investigate if we can disable Row type flattening in Calcite Wed, 05 Sep, 20:45
Rui Wang (JIRA)   [jira] [Closed] (BEAM-5258) Investigate if we can disable Row type flattening in Calcite Mon, 17 Sep, 22:07
mergebot-r...@apache.org [beam-site] branch mergebot updated (6932df9 -> 91d5227) Wed, 05 Sep, 20:45
mergebot-r...@apache.org   [beam-site] 01/02: Update Portable Flink cluster run instructions Wed, 05 Sep, 20:45
mergebot-r...@apache.org   [beam-site] 02/02: This closes #544 Wed, 05 Sep, 20:45
mergebot-r...@apache.org [beam-site] branch asf-site updated (27eac2e -> 7a75616) Wed, 05 Sep, 20:48
mergebot-r...@apache.org   [beam-site] 01/01: Prepare repository for deployment. Wed, 05 Sep, 20:48
mergebot-r...@apache.org [beam-site] branch mergebot updated (91d5227 -> d065f1e) Wed, 05 Sep, 20:49
mergebot-r...@apache.org   [beam-site] 01/02: Update eclipse.md Wed, 05 Sep, 20:49
mergebot-r...@apache.org   [beam-site] 02/02: This closes #547 Wed, 05 Sep, 20:49
mergebot-r...@apache.org [beam-site] branch asf-site updated (7a75616 -> 2aca6fa) Wed, 05 Sep, 20:52
mergebot-r...@apache.org   [beam-site] 01/01: Prepare repository for deployment. Wed, 05 Sep, 20:52
mergebot-r...@apache.org [beam-site] branch mergebot updated (d065f1e -> 49563e7) Wed, 05 Sep, 20:53
mergebot-r...@apache.org   [beam-site] 01/02: Contribute: document how to find and add reviewers Wed, 05 Sep, 20:53
mergebot-r...@apache.org   [beam-site] 02/02: This closes #545 Wed, 05 Sep, 20:53
mergebot-r...@apache.org [beam-site] branch asf-site updated (2aca6fa -> 5a00fd9) Wed, 05 Sep, 20:55
mergebot-r...@apache.org   [beam-site] 01/01: Prepare repository for deployment. Wed, 05 Sep, 20:55
mergebot-r...@apache.org [beam-site] branch mergebot updated (49563e7 -> aa437b2) Wed, 05 Sep, 20:57
mergebot-r...@apache.org   [beam-site] 01/02: Remove the [PROPOSAL] label of the @RequiresStableInput design doc Wed, 05 Sep, 20:57
mergebot-r...@apache.org   [beam-site] 02/02: This closes #543 Wed, 05 Sep, 20:57
mergebot-r...@apache.org [beam-site] branch asf-site updated (5a00fd9 -> 3adb0c6) Wed, 05 Sep, 20:59
mergebot-r...@apache.org   [beam-site] 01/01: Prepare repository for deployment. Wed, 05 Sep, 20:59
[jira] [Work logged] (BEAM-5262) JobState support for Reference Runner
ASF GitHub Bot (JIRA)   [jira] [Work logged] (BEAM-5262) JobState support for Reference Runner Wed, 05 Sep, 21:39
ASF GitHub Bot (JIRA)   [jira] [Work logged] (BEAM-5262) JobState support for Reference Runner Tue, 11 Sep, 00:12
ASF GitHub Bot (JIRA)   [jira] [Work logged] (BEAM-5262) JobState support for Reference Runner Tue, 11 Sep, 02:20
ASF GitHub Bot (JIRA)   [jira] [Work logged] (BEAM-5262) JobState support for Reference Runner Tue, 11 Sep, 17:32
ASF GitHub Bot (JIRA)   [jira] [Work logged] (BEAM-5262) JobState support for Reference Runner Thu, 13 Sep, 07:47
ASF GitHub Bot (JIRA)   [jira] [Work logged] (BEAM-5262) JobState support for Reference Runner Thu, 13 Sep, 08:37
Ankur Goenka (JIRA)   [jira] [Resolved] (BEAM-5262) JobState support for Reference Runner Tue, 18 Sep, 00:41
t..@apache.org [beam] branch master updated (96df192 -> 0749dc5) Wed, 05 Sep, 22:14
t..@apache.org   [beam] 01/01: Merge pull request #6335: [BEAM-5308] Correct/cleanup DockerOnMac code in DockerJobBundleFactory Wed, 05 Sep, 22:14
[jira] [Created] (BEAM-5328) Java starter archetype does not contain dependency versions
Luke Cwik (JIRA)   [jira] [Created] (BEAM-5328) Java starter archetype does not contain dependency versions Wed, 05 Sep, 22:16
Luke Cwik (JIRA)   [jira] [Updated] (BEAM-5328) Java starter archetype does not contain dependency versions Wed, 05 Sep, 22:18
Luke Cwik (JIRA)   [jira] [Commented] (BEAM-5328) Java starter archetype does not contain dependency versions Wed, 05 Sep, 22:20
Alan Myrvold (JIRA)   [jira] [Commented] (BEAM-5328) Java starter archetype does not contain dependency versions Thu, 06 Sep, 04:08
[jira] [Created] (BEAM-5329) Increase test coverage of Perfkit benchmark for Python case
Mark Liu (JIRA)   [jira] [Created] (BEAM-5329) Increase test coverage of Perfkit benchmark for Python case Wed, 05 Sep, 22:42
Message list« Previous · 1 · 2 · 3 · 4 · 5 · 6 · 7 · 8 · 9 · 10 · 11 · 12 · 13 · 14 · 15 · 16 · 17 · 18 · 19 · 20 · 21 · 22 · 23 · 24 · Next »Thread · Author · Date
Box list
Sep 2019179
Aug 2019351
Jul 2019387
Jun 2019332
May 2019464
Apr 2019336
Mar 2019259
Feb 2019367
Jan 2019518
Dec 2018368
Nov 2018448
Oct 20184197
Sep 20184689
Aug 20184453
Jul 20184320
Jun 20186163
May 20185547
Apr 20185962
Mar 20184479
Feb 20181955
Jan 20182670
Dec 20171428
Nov 20172364
Oct 20171972
Sep 20172095
Aug 20172291
Jul 20172998
Jun 20172879
May 20175577
Apr 20175171
Mar 20174068
Feb 20172908
Jan 20171848
Dec 20163374
Nov 20162900
Oct 20162712
Sep 20161298
Aug 20161500
Jul 20161550
Jun 20161725
May 20161092
Apr 20161731
Mar 20161158
Feb 2016294