buildr-dev mailing list archives

Site index · List index
Message view « Date » · « Thread »
Top « Date » · « Thread »
From Antoine Toulme <anto...@lunar-ocean.com>
Subject Re: 7 tests failed on the trunk
Date Tue, 18 May 2010 14:47:32 GMT
Try with rubygems 1.3.6.
I guess you also need Scala.

On Tue, May 18, 2010 at 07:19, Pepijn Van Eeckhoudt <
pepijn.vaneeckhoudt@luciad.com> wrote:

> On 18/5/2010 16:03, Jean-Philippe Caruana wrote:
>
>> failed tests are :
>> Buildr::Application gems
>> - should return one entry for each gem specified in buildr.yaml (FAILED
>> - 1)
>> - should return a Gem::Specification for each installed gem (FAILED - 2)
>> - should parse Gem name correctly (FAILED - 3)
>> - should find installed version of Gem (FAILED - 4)
>>
> The gems stuff is probably related to
> https://issues.apache.org/jira/browse/BUILDR-403.
>
> Pepijn
>

Mime
  • Unnamed multipart/alternative (inline, None, 0 bytes)
View raw message