calcite-dev mailing list archives

Site index · List index
Message view « Date » · « Thread »
Top « Date » · « Thread »
From Apache Jenkins Server <jenk...@builds.apache.org>
Subject Build failed in Jenkins: Calcite-Snapshots #188
Date Sat, 09 May 2020 13:26:12 GMT
See <https://builds.apache.org/job/Calcite-Snapshots/188/display/redirect?page=changes>

Changes:

[rubenql] [CALCITE-3926] CannotPlanException when an empty LogicalValues requires

[ForwardXu] Site: Add Ant Financial logo in powered-by image (Wang Yanlin)

[wellfengzhu] [CALCITE-3866] "numeric field overflow" when running the generated SQL

[wellfengzhu] [CALCITE-3737] HOP Table Function (Rui Wang)

[wellfengzhu] [CALCITE-3780] SESSION Table function (Rui Wang)


------------------------------------------
[...truncated 249.74 KB...]
<https://builds.apache.org/job/Calcite-Snapshots/ws/ws/linq4j/src/main/java/org/apache/calcite/linq4j/tree/Expressions.java>:193:
warning: no @return
  public static BinaryExpression andAlso(Expression left, Expression right,
                                 ^
<https://builds.apache.org/job/Calcite-Snapshots/ws/ws/linq4j/src/main/java/org/apache/calcite/linq4j/tree/Expressions.java>:202:
warning: no @param for left
  public static BinaryExpression andAssign(Expression left, Expression right) {
                                 ^
<https://builds.apache.org/job/Calcite-Snapshots/ws/ws/linq4j/src/main/java/org/apache/calcite/linq4j/tree/Expressions.java>:202:
warning: no @param for right
  public static BinaryExpression andAssign(Expression left, Expression right) {
                                 ^
<https://builds.apache.org/job/Calcite-Snapshots/ws/ws/linq4j/src/main/java/org/apache/calcite/linq4j/tree/Expressions.java>:202:
warning: no @return
  public static BinaryExpression andAssign(Expression left, Expression right) {
                                 ^
<https://builds.apache.org/job/Calcite-Snapshots/ws/ws/linq4j/src/main/java/org/apache/calcite/linq4j/tree/Expressions.java>:210:
warning: no @param for left
  public static BinaryExpression andAssign(Expression left, Expression right,
                                 ^
<https://builds.apache.org/job/Calcite-Snapshots/ws/ws/linq4j/src/main/java/org/apache/calcite/linq4j/tree/Expressions.java>:210:
warning: no @param for right
  public static BinaryExpression andAssign(Expression left, Expression right,
                                 ^
<https://builds.apache.org/job/Calcite-Snapshots/ws/ws/linq4j/src/main/java/org/apache/calcite/linq4j/tree/Expressions.java>:210:
warning: no @param for method
  public static BinaryExpression andAssign(Expression left, Expression right,
                                 ^
<https://builds.apache.org/job/Calcite-Snapshots/ws/ws/linq4j/src/main/java/org/apache/calcite/linq4j/tree/Expressions.java>:210:
warning: no @return
  public static BinaryExpression andAssign(Expression left, Expression right,
                                 ^
<https://builds.apache.org/job/Calcite-Snapshots/ws/ws/linq4j/src/main/java/org/apache/calcite/linq4j/tree/Expressions.java>:219:
warning: no @param for left
  public static BinaryExpression andAssign(Expression left, Expression right,
                                 ^
<https://builds.apache.org/job/Calcite-Snapshots/ws/ws/linq4j/src/main/java/org/apache/calcite/linq4j/tree/Expressions.java>:219:
warning: no @param for right
  public static BinaryExpression andAssign(Expression left, Expression right,
                                 ^
<https://builds.apache.org/job/Calcite-Snapshots/ws/ws/linq4j/src/main/java/org/apache/calcite/linq4j/tree/Expressions.java>:219:
warning: no @param for method
  public static BinaryExpression andAssign(Expression left, Expression right,
                                 ^
<https://builds.apache.org/job/Calcite-Snapshots/ws/ws/linq4j/src/main/java/org/apache/calcite/linq4j/tree/Expressions.java>:219:
warning: no @param for lambdaExpression
  public static BinaryExpression andAssign(Expression left, Expression right,
                                 ^
<https://builds.apache.org/job/Calcite-Snapshots/ws/ws/linq4j/src/main/java/org/apache/calcite/linq4j/tree/Expressions.java>:219:
warning: no @return
  public static BinaryExpression andAssign(Expression left, Expression right,
                                 ^
<https://builds.apache.org/job/Calcite-Snapshots/ws/ws/linq4j/src/main/java/org/apache/calcite/linq4j/tree/Expressions.java>:228:
warning: no @param for array
  public static IndexExpression arrayIndex(Expression array,
                                ^
<https://builds.apache.org/job/Calcite-Snapshots/ws/ws/linq4j/src/main/java/org/apache/calcite/linq4j/tree/Expressions.java>:228:
warning: no @param for indexExpression
  public static IndexExpression arrayIndex(Expression array,
                                ^
<https://builds.apache.org/job/Calcite-Snapshots/ws/ws/linq4j/src/main/java/org/apache/calcite/linq4j/tree/Expressions.java>:228:
warning: no @return
  public static IndexExpression arrayIndex(Expression array,
                                ^
100 warnings
:linq4j:javadoc (Thread[Execution worker for ':' Thread 22,5,main]) completed. Took 17.9 secs.
:linq4j:javadocJar (Thread[Execution worker for ':' Thread 22,5,main]) started.

> Task :core:compileJava
Caching disabled for task ':core:compileJava' because:
  Build cache is disabled
Task ':core:compileJava' is not up-to-date because:
  No history is available.
The input changes require a full rebuild for incremental task ':core:compileJava'.
Full recompilation is required because no incremental change information is available. This
is usually caused by clean builds or changing compiler arguments.
Compiling with JDK Java compiler API.

> Task :linq4j:javadocJar
Caching disabled for task ':linq4j:javadocJar' because:
  Build cache is disabled
Task ':linq4j:javadocJar' is not up-to-date because:
  No history is available.
:linq4j:javadocJar (Thread[Execution worker for ':' Thread 22,5,main]) completed. Took 0.44
secs.
:linq4j:sourcesJar (Thread[Execution worker for ':' Thread 22,5,main]) started.

> Task :linq4j:sourcesJar
Caching disabled for task ':linq4j:sourcesJar' because:
  Build cache is disabled
Task ':linq4j:sourcesJar' is not up-to-date because:
  No history is available.
:linq4j:sourcesJar (Thread[Execution worker for ':' Thread 22,5,main]) completed. Took 0.105
secs.
:linq4j:publishLinq4jPublicationToNexusRepository (Thread[Execution worker for ':' Thread
22,5,main]) started.

> Task :linq4j:publishLinq4jPublicationToNexusRepository FAILED
Caching disabled for task ':linq4j:publishLinq4jPublicationToNexusRepository' because:
  Build cache is disabled
Task ':linq4j:publishLinq4jPublicationToNexusRepository' is not up-to-date because:
  Task has not declared any outputs despite executing actions.
Uploading to https://repository.apache.org/content/repositories/snapshots/
Publishing to repository 'nexus' (https://repository.apache.org/content/repositories/snapshots/)
Failed to get resource: GET. [HTTP HTTP/1.1 503 Service Unavailable: https://repository.apache.org/content/repositories/snapshots/org/apache/calcite/calcite-linq4j/1.23.0-SNAPSHOT/maven-metadata.xml)]
:linq4j:publishLinq4jPublicationToNexusRepository (Thread[Execution worker for ':' Thread
22,5,main]) completed. Took 1.374 secs.

> Task :core:compileJava
Note: Some input files use or override a deprecated API.
Note: Recompile with -Xlint:deprecation for details.
Note: Some input files use unchecked or unsafe operations.
Note: Recompile with -Xlint:unchecked for details.
Created classpath snapshot for incremental compilation in 0.247 secs. 1 duplicate classes
found in classpath (see all with --debug).
:core:compileJava (Thread[Execution worker for ':' Thread 3,5,main]) completed. Took 21.789
secs.
Closing Git repo: <https://builds.apache.org/job/Calcite-Snapshots/ws/ws/.git>

FAILURE: Build failed with an exception.

* What went wrong:
Execution failed for task ':linq4j:publishLinq4jPublicationToNexusRepository'.
> Failed to publish publication 'linq4j' to repository 'nexus'
   > Could not GET 'https://repository.apache.org/content/repositories/snapshots/org/apache/calcite/calcite-linq4j/1.23.0-SNAPSHOT/maven-metadata.xml'.
Received status code 503 from server: Service Unavailable

* Try:
Run with --debug option to get more log output. Run with --scan to get full insights.

* Exception is:
org.gradle.api.tasks.TaskExecutionException: Execution failed for task ':linq4j:publishLinq4jPublicationToNexusRepository'.
	at org.gradle.api.internal.tasks.execution.ExecuteActionsTaskExecuter.lambda$executeIfValid$1(ExecuteActionsTaskExecuter.java:205)
	at org.gradle.internal.Try$Failure.ifSuccessfulOrElse(Try.java:263)
	at org.gradle.api.internal.tasks.execution.ExecuteActionsTaskExecuter.executeIfValid(ExecuteActionsTaskExecuter.java:203)
	at org.gradle.api.internal.tasks.execution.ExecuteActionsTaskExecuter.execute(ExecuteActionsTaskExecuter.java:184)
	at org.gradle.api.internal.tasks.execution.CleanupStaleOutputsExecuter.execute(CleanupStaleOutputsExecuter.java:114)
	at org.gradle.api.internal.tasks.execution.FinalizePropertiesTaskExecuter.execute(FinalizePropertiesTaskExecuter.java:46)
	at org.gradle.api.internal.tasks.execution.ResolveTaskExecutionModeExecuter.execute(ResolveTaskExecutionModeExecuter.java:62)
	at org.gradle.api.internal.tasks.execution.SkipTaskWithNoActionsExecuter.execute(SkipTaskWithNoActionsExecuter.java:57)
	at org.gradle.api.internal.tasks.execution.SkipOnlyIfTaskExecuter.execute(SkipOnlyIfTaskExecuter.java:56)
	at org.gradle.api.internal.tasks.execution.CatchExceptionTaskExecuter.execute(CatchExceptionTaskExecuter.java:36)
	at org.gradle.api.internal.tasks.execution.EventFiringTaskExecuter$1.executeTask(EventFiringTaskExecuter.java:77)
	at org.gradle.api.internal.tasks.execution.EventFiringTaskExecuter$1.call(EventFiringTaskExecuter.java:55)
	at org.gradle.api.internal.tasks.execution.EventFiringTaskExecuter$1.call(EventFiringTaskExecuter.java:52)
	at org.gradle.internal.operations.DefaultBuildOperationExecutor$CallableBuildOperationWorker.execute(DefaultBuildOperationExecutor.java:416)
	at org.gradle.internal.operations.DefaultBuildOperationExecutor$CallableBuildOperationWorker.execute(DefaultBuildOperationExecutor.java:406)
	at org.gradle.internal.operations.DefaultBuildOperationExecutor$1.execute(DefaultBuildOperationExecutor.java:165)
	at org.gradle.internal.operations.DefaultBuildOperationExecutor.execute(DefaultBuildOperationExecutor.java:250)
	at org.gradle.internal.operations.DefaultBuildOperationExecutor.execute(DefaultBuildOperationExecutor.java:158)
	at org.gradle.internal.operations.DefaultBuildOperationExecutor.call(DefaultBuildOperationExecutor.java:102)
	at org.gradle.internal.operations.DelegatingBuildOperationExecutor.call(DelegatingBuildOperationExecutor.java:36)
	at org.gradle.api.internal.tasks.execution.EventFiringTaskExecuter.execute(EventFiringTaskExecuter.java:52)
	at org.gradle.execution.plan.LocalTaskNodeExecutor.execute(LocalTaskNodeExecutor.java:41)
	at org.gradle.execution.taskgraph.DefaultTaskExecutionGraph$InvokeNodeExecutorsAction.execute(DefaultTaskExecutionGraph.java:372)
	at org.gradle.execution.taskgraph.DefaultTaskExecutionGraph$InvokeNodeExecutorsAction.execute(DefaultTaskExecutionGraph.java:359)
	at org.gradle.execution.taskgraph.DefaultTaskExecutionGraph$BuildOperationAwareExecutionAction.execute(DefaultTaskExecutionGraph.java:352)
	at org.gradle.execution.taskgraph.DefaultTaskExecutionGraph$BuildOperationAwareExecutionAction.execute(DefaultTaskExecutionGraph.java:338)
	at org.gradle.execution.plan.DefaultPlanExecutor$ExecutorWorker.lambda$run$0(DefaultPlanExecutor.java:127)
	at org.gradle.execution.plan.DefaultPlanExecutor$ExecutorWorker.execute(DefaultPlanExecutor.java:191)
	at org.gradle.execution.plan.DefaultPlanExecutor$ExecutorWorker.executeNextNode(DefaultPlanExecutor.java:182)
	at org.gradle.execution.plan.DefaultPlanExecutor$ExecutorWorker.run(DefaultPlanExecutor.java:124)
	at org.gradle.internal.concurrent.ExecutorPolicy$CatchAndRecordFailures.onExecute(ExecutorPolicy.java:64)
	at org.gradle.internal.concurrent.ManagedExecutorImpl$1.run(ManagedExecutorImpl.java:48)
	at org.gradle.internal.concurrent.ThreadFactoryImpl$ManagedThreadRunnable.run(ThreadFactoryImpl.java:56)
Caused by: org.gradle.api.artifacts.PublishException: Failed to publish publication 'linq4j'
to repository 'nexus'
	at org.gradle.api.publish.internal.PublishOperation.run(PublishOperation.java:39)
	at org.gradle.api.publish.maven.tasks.PublishToMavenRepository.doPublish(PublishToMavenRepository.java:79)
	at org.gradle.api.publish.maven.tasks.PublishToMavenRepository.publish(PublishToMavenRepository.java:68)
	at org.gradle.internal.reflect.JavaMethod.invoke(JavaMethod.java:104)
	at org.gradle.api.internal.project.taskfactory.StandardTaskAction.doExecute(StandardTaskAction.java:49)
	at org.gradle.api.internal.project.taskfactory.StandardTaskAction.execute(StandardTaskAction.java:42)
	at org.gradle.api.internal.project.taskfactory.StandardTaskAction.execute(StandardTaskAction.java:28)
	at org.gradle.api.internal.AbstractTask$TaskActionWrapper.execute(AbstractTask.java:727)
	at org.gradle.api.internal.AbstractTask$TaskActionWrapper.execute(AbstractTask.java:694)
	at org.gradle.api.internal.tasks.execution.ExecuteActionsTaskExecuter$3.run(ExecuteActionsTaskExecuter.java:568)
	at org.gradle.internal.operations.DefaultBuildOperationExecutor$RunnableBuildOperationWorker.execute(DefaultBuildOperationExecutor.java:402)
	at org.gradle.internal.operations.DefaultBuildOperationExecutor$RunnableBuildOperationWorker.execute(DefaultBuildOperationExecutor.java:394)
	at org.gradle.internal.operations.DefaultBuildOperationExecutor$1.execute(DefaultBuildOperationExecutor.java:165)
	at org.gradle.internal.operations.DefaultBuildOperationExecutor.execute(DefaultBuildOperationExecutor.java:250)
	at org.gradle.internal.operations.DefaultBuildOperationExecutor.execute(DefaultBuildOperationExecutor.java:158)
	at org.gradle.internal.operations.DefaultBuildOperationExecutor.run(DefaultBuildOperationExecutor.java:92)
	at org.gradle.internal.operations.DelegatingBuildOperationExecutor.run(DelegatingBuildOperationExecutor.java:31)
	at org.gradle.api.internal.tasks.execution.ExecuteActionsTaskExecuter.executeAction(ExecuteActionsTaskExecuter.java:553)
	at org.gradle.api.internal.tasks.execution.ExecuteActionsTaskExecuter.executeActions(ExecuteActionsTaskExecuter.java:536)
	at org.gradle.api.internal.tasks.execution.ExecuteActionsTaskExecuter.access$300(ExecuteActionsTaskExecuter.java:109)
	at org.gradle.api.internal.tasks.execution.ExecuteActionsTaskExecuter$TaskExecution.executeWithPreviousOutputFiles(ExecuteActionsTaskExecuter.java:276)
	at org.gradle.api.internal.tasks.execution.ExecuteActionsTaskExecuter$TaskExecution.execute(ExecuteActionsTaskExecuter.java:265)
	at org.gradle.internal.execution.steps.ExecuteStep.lambda$execute$1(ExecuteStep.java:33)
	at org.gradle.internal.execution.steps.ExecuteStep.execute(ExecuteStep.java:33)
	at org.gradle.internal.execution.steps.ExecuteStep.execute(ExecuteStep.java:26)
	at org.gradle.internal.execution.steps.CleanupOutputsStep.execute(CleanupOutputsStep.java:67)
	at org.gradle.internal.execution.steps.CleanupOutputsStep.execute(CleanupOutputsStep.java:36)
	at org.gradle.internal.execution.steps.ResolveInputChangesStep.execute(ResolveInputChangesStep.java:49)
	at org.gradle.internal.execution.steps.ResolveInputChangesStep.execute(ResolveInputChangesStep.java:34)
	at org.gradle.internal.execution.steps.CancelExecutionStep.execute(CancelExecutionStep.java:43)
	at org.gradle.internal.execution.steps.TimeoutStep.executeWithoutTimeout(TimeoutStep.java:73)
	at org.gradle.internal.execution.steps.TimeoutStep.execute(TimeoutStep.java:54)
	at org.gradle.internal.execution.steps.CatchExceptionStep.execute(CatchExceptionStep.java:34)
	at org.gradle.internal.execution.steps.CreateOutputsStep.execute(CreateOutputsStep.java:44)
	at org.gradle.internal.execution.steps.SnapshotOutputsStep.execute(SnapshotOutputsStep.java:54)
	at org.gradle.internal.execution.steps.SnapshotOutputsStep.execute(SnapshotOutputsStep.java:38)
	at org.gradle.internal.execution.steps.BroadcastChangingOutputsStep.execute(BroadcastChangingOutputsStep.java:49)
	at org.gradle.internal.execution.steps.CacheStep.executeWithoutCache(CacheStep.java:159)
	at org.gradle.internal.execution.steps.CacheStep.execute(CacheStep.java:72)
	at org.gradle.internal.execution.steps.CacheStep.execute(CacheStep.java:43)
	at org.gradle.internal.execution.steps.StoreExecutionStateStep.execute(StoreExecutionStateStep.java:44)
	at org.gradle.internal.execution.steps.StoreExecutionStateStep.execute(StoreExecutionStateStep.java:33)
	at org.gradle.internal.execution.steps.RecordOutputsStep.execute(RecordOutputsStep.java:38)
	at org.gradle.internal.execution.steps.RecordOutputsStep.execute(RecordOutputsStep.java:24)
	at org.gradle.internal.execution.steps.SkipUpToDateStep.executeBecause(SkipUpToDateStep.java:92)
	at org.gradle.internal.execution.steps.SkipUpToDateStep.lambda$execute$0(SkipUpToDateStep.java:85)
	at org.gradle.internal.execution.steps.SkipUpToDateStep.execute(SkipUpToDateStep.java:55)
	at org.gradle.internal.execution.steps.SkipUpToDateStep.execute(SkipUpToDateStep.java:39)
	at org.gradle.internal.execution.steps.ResolveChangesStep.execute(ResolveChangesStep.java:76)
	at org.gradle.internal.execution.steps.ResolveChangesStep.execute(ResolveChangesStep.java:37)
	at org.gradle.internal.execution.steps.legacy.MarkSnapshottingInputsFinishedStep.execute(MarkSnapshottingInputsFinishedStep.java:36)
	at org.gradle.internal.execution.steps.legacy.MarkSnapshottingInputsFinishedStep.execute(MarkSnapshottingInputsFinishedStep.java:26)
	at org.gradle.internal.execution.steps.ResolveCachingStateStep.execute(ResolveCachingStateStep.java:94)
	at org.gradle.internal.execution.steps.ResolveCachingStateStep.execute(ResolveCachingStateStep.java:49)
	at org.gradle.internal.execution.steps.CaptureStateBeforeExecutionStep.execute(CaptureStateBeforeExecutionStep.java:79)
	at org.gradle.internal.execution.steps.CaptureStateBeforeExecutionStep.execute(CaptureStateBeforeExecutionStep.java:53)
	at org.gradle.internal.execution.steps.ValidateStep.execute(ValidateStep.java:74)
	at org.gradle.internal.execution.steps.SkipEmptyWorkStep.lambda$execute$2(SkipEmptyWorkStep.java:78)
	at org.gradle.internal.execution.steps.SkipEmptyWorkStep.execute(SkipEmptyWorkStep.java:78)
	at org.gradle.internal.execution.steps.SkipEmptyWorkStep.execute(SkipEmptyWorkStep.java:34)
	at org.gradle.internal.execution.steps.legacy.MarkSnapshottingInputsStartedStep.execute(MarkSnapshottingInputsStartedStep.java:39)
	at org.gradle.internal.execution.steps.LoadExecutionStateStep.execute(LoadExecutionStateStep.java:40)
	at org.gradle.internal.execution.steps.LoadExecutionStateStep.execute(LoadExecutionStateStep.java:28)
	at org.gradle.internal.execution.impl.DefaultWorkExecutor.execute(DefaultWorkExecutor.java:33)
	at org.gradle.api.internal.tasks.execution.ExecuteActionsTaskExecuter.executeIfValid(ExecuteActionsTaskExecuter.java:192)
	... 30 more
Caused by: org.gradle.internal.resource.transport.http.HttpErrorStatusCodeException: Could
not GET 'https://repository.apache.org/content/repositories/snapshots/org/apache/calcite/calcite-linq4j/1.23.0-SNAPSHOT/maven-metadata.xml'.
Received status code 503 from server: Service Unavailable
	at org.gradle.internal.resource.transport.http.HttpClientHelper.processResponse(HttpClientHelper.java:186)
	at org.gradle.internal.resource.transport.http.HttpClientHelper.performGet(HttpClientHelper.java:88)
	at org.gradle.internal.resource.transport.http.HttpResourceAccessor.openResource(HttpResourceAccessor.java:43)
	at org.gradle.internal.resource.transport.http.HttpResourceAccessor.openResource(HttpResourceAccessor.java:28)
	at org.gradle.internal.resource.transfer.DefaultExternalResourceConnector.openResource(DefaultExternalResourceConnector.java:56)
	at org.gradle.internal.resource.transfer.AccessorBackedExternalResource.withContentIfPresent(AccessorBackedExternalResource.java:106)
	at org.gradle.internal.resource.BuildOperationFiringExternalResourceDecorator$10.call(BuildOperationFiringExternalResourceDecorator.java:221)
	at org.gradle.internal.resource.BuildOperationFiringExternalResourceDecorator$10.call(BuildOperationFiringExternalResourceDecorator.java:213)
	at org.gradle.internal.operations.DefaultBuildOperationExecutor$CallableBuildOperationWorker.execute(DefaultBuildOperationExecutor.java:416)
	at org.gradle.internal.operations.DefaultBuildOperationExecutor$CallableBuildOperationWorker.execute(DefaultBuildOperationExecutor.java:406)
	at org.gradle.internal.operations.DefaultBuildOperationExecutor$1.execute(DefaultBuildOperationExecutor.java:165)
	at org.gradle.internal.operations.DefaultBuildOperationExecutor.execute(DefaultBuildOperationExecutor.java:250)
	at org.gradle.internal.operations.DefaultBuildOperationExecutor.execute(DefaultBuildOperationExecutor.java:158)
	at org.gradle.internal.operations.DefaultBuildOperationExecutor.call(DefaultBuildOperationExecutor.java:102)
	at org.gradle.internal.operations.DelegatingBuildOperationExecutor.call(DelegatingBuildOperationExecutor.java:36)
	at org.gradle.internal.resource.BuildOperationFiringExternalResourceDecorator.withContentIfPresent(BuildOperationFiringExternalResourceDecorator.java:213)
	at org.gradle.api.publish.maven.internal.publisher.AbstractMavenPublisher.readExistingMetadata(AbstractMavenPublisher.java:135)
	at org.gradle.api.publish.maven.internal.publisher.MavenRemotePublisher.getNextBuildNumber(MavenRemotePublisher.java:107)
	at org.gradle.api.publish.maven.internal.publisher.MavenRemotePublisher.createSnapshotMetadata(MavenRemotePublisher.java:76)
	at org.gradle.api.publish.maven.internal.publisher.AbstractMavenPublisher.publish(AbstractMavenPublisher.java:68)
	at org.gradle.api.publish.maven.internal.publisher.MavenRemotePublisher.publish(MavenRemotePublisher.java:62)
	at org.gradle.api.publish.maven.internal.publisher.ValidatingMavenPublisher.publish(ValidatingMavenPublisher.java:50)
	at org.gradle.api.publish.maven.tasks.PublishToMavenRepository$1.publish(PublishToMavenRepository.java:77)
	at org.gradle.api.publish.internal.PublishOperation.run(PublishOperation.java:37)
	... 94 more


* Get more help at https://help.gradle.org

Deprecated Gradle features were used in this build, making it incompatible with Gradle 7.0.
Use '--warning-mode all' to show the individual deprecation warnings.
See https://docs.gradle.org/6.3/userguide/command_line_interface.html#sec:command_line_warnings

BUILD FAILED in 1m 23s
60 actionable tasks: 60 executed

See the profiling report at: file://<https://builds.apache.org/job/Calcite-Snapshots/ws/ws/build/reports/profile/profile-2020-05-09-13-24-51.html>
A fine-grained performance profile is available: use the --scan option.
Build step 'Invoke Gradle script' changed build result to FAILURE
Build step 'Invoke Gradle script' marked build as failure

Mime
View raw message