carbondata-commits mailing list archives

Site index · List index
Message view « Date » · « Thread »
Top « Date » · « Thread »
From Apache Jenkins Server <jenk...@builds.apache.org>
Subject Build failed in Jenkins: CarbonData-master #2
Date Tue, 12 Jul 2016 19:26:10 GMT
See <https://builds.apache.org/job/CarbonData-master/2/changes>

Changes:

[chenliang613] Added DatasourceRegister to make format name simple and clean up some

[chenliang613] Added spark sql cli in carbon.

------------------------------------------
Started by an SCM change
[EnvInject] - Loading node environment variables.
Building remotely on ubuntu-2 (docker Ubuntu ubuntu yahoo-not-h2) in workspace <https://builds.apache.org/job/CarbonData-master/ws/>
Cloning the remote Git repository
Cloning repository https://git-wip-us.apache.org/repos/asf/incubator-carbondata.git
 > git init <https://builds.apache.org/job/CarbonData-master/ws/> # timeout=10
Fetching upstream changes from https://git-wip-us.apache.org/repos/asf/incubator-carbondata.git
 > git --version # timeout=10
 > git -c core.askpass=true fetch --tags --progress https://git-wip-us.apache.org/repos/asf/incubator-carbondata.git
+refs/heads/*:refs/remotes/origin/*
 > git config remote.origin.url https://git-wip-us.apache.org/repos/asf/incubator-carbondata.git
# timeout=10
 > git config --add remote.origin.fetch +refs/heads/*:refs/remotes/origin/* # timeout=10
 > git config remote.origin.url https://git-wip-us.apache.org/repos/asf/incubator-carbondata.git
# timeout=10
Fetching upstream changes from https://git-wip-us.apache.org/repos/asf/incubator-carbondata.git
 > git -c core.askpass=true fetch --tags --progress https://git-wip-us.apache.org/repos/asf/incubator-carbondata.git
+refs/heads/*:refs/remotes/origin/*
 > git rev-parse refs/remotes/origin/master^{commit} # timeout=10
 > git rev-parse refs/remotes/origin/origin/master^{commit} # timeout=10
Checking out Revision 3f56dfb2c4d95929c8c33d3ad2dd5d8c6f11df9f (refs/remotes/origin/master)
 > git config core.sparsecheckout # timeout=10
 > git checkout -f 3f56dfb2c4d95929c8c33d3ad2dd5d8c6f11df9f
 > git rev-list 367b9b2d26922de3ce48d8bef86f3825e217e871 # timeout=10
Parsing POMs
Established TCP socket on 58657
maven32-agent.jar already up to date
maven32-interceptor.jar already up to date
maven3-interceptor-commons.jar already up to date
[CarbonData-master] $ /home/jenkins/jenkins-slave/tools/hudson.model.JDK/jdk1.8.0_66/bin/java
-Xmx2g -Xms256m -XX:MaxPermSize=512m -cp /home/jenkins/jenkins-slave/maven32-agent.jar:/home/jenkins/jenkins-slave/tools/hudson.tasks.Maven_MavenInstallation/maven-3.3.3/boot/plexus-classworlds-2.5.2.jar:/home/jenkins/jenkins-slave/tools/hudson.tasks.Maven_MavenInstallation/maven-3.3.3/conf/logging
jenkins.maven3.agent.Maven32Main /home/jenkins/jenkins-slave/tools/hudson.tasks.Maven_MavenInstallation/maven-3.3.3
/home/jenkins/jenkins-slave/slave.jar /home/jenkins/jenkins-slave/maven32-interceptor.jar
/home/jenkins/jenkins-slave/maven3-interceptor-commons.jar 58657
Java HotSpot(TM) 64-Bit Server VM warning: ignoring option MaxPermSize=512m; support was removed
in 8.0
<===[JENKINS REMOTING CAPACITY]===>   channel started
Executing Maven:  -B -f <https://builds.apache.org/job/CarbonData-master/ws/pom.xml>
-Dmaven.repo.local=/home/jenkins/jenkins-slave/maven-repositories/1 -B -e clean deploy
[INFO] Error stacktraces are turned on.
[INFO] Scanning for projects...
[WARNING] 
[WARNING] Some problems were encountered while building the effective model for org.carbondata:carbon-common:jar:0.1.0-SNAPSHOT
[WARNING] 'build.plugins.plugin.version' for org.apache.maven.plugins:maven-compiler-plugin
is missing. @ line 69, column 15
[WARNING] 
[WARNING] Some problems were encountered while building the effective model for org.carbondata:carbon-core:jar:0.1.0-SNAPSHOT
[WARNING] 'build.plugins.plugin.version' for org.apache.maven.plugins:maven-compiler-plugin
is missing. @ line 163, column 15
[WARNING] 
[WARNING] Some problems were encountered while building the effective model for org.carbondata:carbon-processing:jar:0.1.0-SNAPSHOT
[WARNING] 'build.plugins.plugin.version' for org.apache.maven.plugins:maven-compiler-plugin
is missing. @ line 151, column 15
[WARNING] 
[WARNING] Some problems were encountered while building the effective model for org.carbondata:carbon-hadoop:jar:0.1.0-SNAPSHOT
[WARNING] 'build.plugins.plugin.version' for org.apache.maven.plugins:maven-compiler-plugin
is missing. @ line 108, column 15
[WARNING] 
[WARNING] Some problems were encountered while building the effective model for org.carbondata:carbon-spark:jar:0.1.0-SNAPSHOT
[WARNING] 'build.plugins.plugin.version' for org.apache.maven.plugins:maven-compiler-plugin
is missing. @ line 172, column 15
[WARNING] 
[WARNING] Some problems were encountered while building the effective model for com.huawei.datasight:carbon-assembly:pom:0.1.0-SNAPSHOT
[WARNING] 'build.plugins.plugin.version' for org.apache.maven.plugins:maven-shade-plugin is
missing. @ line 76, column 15
[WARNING] 'build.plugins.plugin.version' for org.apache.maven.plugins:maven-install-plugin
is missing. @ line 69, column 15
[WARNING] 'build.plugins.plugin.version' for org.apache.maven.plugins:maven-deploy-plugin
is missing. @ line 62, column 15
[WARNING] 
[WARNING] Some problems were encountered while building the effective model for org.carbondata:carbon-examples:jar:0.1.0-SNAPSHOT
[WARNING] 'build.plugins.plugin.version' for org.apache.maven.plugins:maven-compiler-plugin
is missing. @ line 151, column 15
[WARNING] 
[WARNING] It is highly recommended to fix these problems because they threaten the stability
of your build.
[WARNING] 
[WARNING] For this reason, future Maven versions might no longer support building such malformed
projects.
[WARNING] 
[INFO] ------------------------------------------------------------------------
[INFO] Reactor Build Order:
[INFO] 
[INFO] carbondata
[INFO] carbon-common
[INFO] carbon-format
[INFO] carbon-core
[INFO] carbon-processing
[INFO] carbon-hadoop
[INFO] carbon-spark
[INFO] carbon-assembly
[INFO] carbon-examples
[INFO]                                                                         
[INFO] ------------------------------------------------------------------------
[INFO] Building carbondata 0.1.0-SNAPSHOT
[INFO] ------------------------------------------------------------------------
[INFO] Downloading: https://repo.maven.apache.org/maven2/org/scalastyle/scalastyle-maven-plugin/0.8.0/scalastyle-maven-plugin-0.8.0.pom
[INFO] Downloaded: https://repo.maven.apache.org/maven2/org/scalastyle/scalastyle-maven-plugin/0.8.0/scalastyle-maven-plugin-0.8.0.pom
(9 KB at 10.0 KB/sec)
[INFO] Downloading: https://repo.maven.apache.org/maven2/org/scalastyle/scalastyle-maven-plugin/0.8.0/scalastyle-maven-plugin-0.8.0.jar
[INFO] Downloaded: https://repo.maven.apache.org/maven2/org/scalastyle/scalastyle-maven-plugin/0.8.0/scalastyle-maven-plugin-0.8.0.jar
(19 KB at 241.3 KB/sec)
[INFO] 
[INFO] --- maven-clean-plugin:2.5:clean (default-clean) @ carbondata-parent ---
[INFO] 
[INFO] --- maven-checkstyle-plugin:2.17:check (default) @ carbondata-parent ---
[INFO] Starting audit...
Audit done.
[INFO] 
[INFO] --- scalastyle-maven-plugin:0.8.0:check (default) @ carbondata-parent ---
[INFO] Downloading: https://repo.maven.apache.org/maven2/org/scalastyle/scalastyle_2.11/0.8.0/scalastyle_2.11-0.8.0.pom
[INFO] Downloaded: https://repo.maven.apache.org/maven2/org/scalastyle/scalastyle_2.11/0.8.0/scalastyle_2.11-0.8.0.pom
(3 KB at 32.7 KB/sec)
[INFO] Downloading: https://repo.maven.apache.org/maven2/org/scalariform/scalariform_2.11/0.1.7/scalariform_2.11-0.1.7.pom
[INFO] Downloaded: https://repo.maven.apache.org/maven2/org/scalariform/scalariform_2.11/0.1.7/scalariform_2.11-0.1.7.pom
(3 KB at 29.1 KB/sec)
[INFO] Downloading: https://repo.maven.apache.org/maven2/com/typesafe/config/1.2.0/config-1.2.0.pom
[INFO] Downloaded: https://repo.maven.apache.org/maven2/com/typesafe/config/1.2.0/config-1.2.0.pom
(2 KB at 22.8 KB/sec)
[INFO] Downloading: https://repo.maven.apache.org/maven2/org/scalastyle/scalastyle_2.11/0.8.0/scalastyle_2.11-0.8.0.jar
[INFO] Downloading: https://repo.maven.apache.org/maven2/org/scalariform/scalariform_2.11/0.1.7/scalariform_2.11-0.1.7.jar
[INFO] Downloading: https://repo.maven.apache.org/maven2/com/typesafe/config/1.2.0/config-1.2.0.jar
[INFO] Downloading: https://repo.maven.apache.org/maven2/org/codehaus/plexus/plexus-component-annotations/1.5.4/plexus-component-annotations-1.5.4.jar
[INFO] Downloaded: https://repo.maven.apache.org/maven2/org/codehaus/plexus/plexus-component-annotations/1.5.4/plexus-component-annotations-1.5.4.jar
(5 KB at 26.0 KB/sec)
[INFO] Downloaded: https://repo.maven.apache.org/maven2/com/typesafe/config/1.2.0/config-1.2.0.jar
(213 KB at 768.2 KB/sec)
[INFO] Downloaded: https://repo.maven.apache.org/maven2/org/scalariform/scalariform_2.11/0.1.7/scalariform_2.11-0.1.7.jar
(1889 KB at 5758.7 KB/sec)
[INFO] Downloaded: https://repo.maven.apache.org/maven2/org/scalastyle/scalastyle_2.11/0.8.0/scalastyle_2.11-0.8.0.jar
(874 KB at 2427.4 KB/sec)
[WARNING] sourceDirectory is not specified or does not exist value=<https://builds.apache.org/job/CarbonData-master/ws/src/main/scala>
Saving to outputFile=<https://builds.apache.org/job/CarbonData-master/ws/target/scalastyle-output.xml>
Processed 0 file(s)
Found 0 errors
Found 0 warnings
Found 0 infos
Finished in 124 ms
[INFO] 
[INFO] --- maven-install-plugin:2.4:install (default-install) @ carbondata-parent ---
[INFO] Installing <https://builds.apache.org/job/CarbonData-master/ws/pom.xml> to /home/jenkins/jenkins-slave/maven-repositories/1/org/carbondata/carbondata-parent/0.1.0-SNAPSHOT/carbondata-parent-0.1.0-SNAPSHOT.pom
[INFO] 
[INFO] --- maven-deploy-plugin:2.7:deploy (default-deploy) @ carbondata-parent ---
[INFO] ------------------------------------------------------------------------
[INFO] Reactor Summary:
[INFO] 
[INFO] carbondata ......................................... FAILURE [ 15.237 s]
[INFO] carbon-common ...................................... SKIPPED
[INFO] carbon-format ...................................... SKIPPED
[INFO] carbon-core ........................................ SKIPPED
[INFO] carbon-processing .................................. SKIPPED
[INFO] carbon-hadoop ...................................... SKIPPED
[INFO] carbon-spark ....................................... SKIPPED
[INFO] carbon-assembly .................................... SKIPPED
[INFO] carbon-examples .................................... SKIPPED
[INFO] ------------------------------------------------------------------------
[INFO] BUILD FAILURE
[INFO] ------------------------------------------------------------------------
[INFO] Total time: 23.384 s
[INFO] Finished at: 2016-07-12T19:19:44+00:00
[INFO] Final Memory: 20M/388M
[INFO] ------------------------------------------------------------------------
[ERROR] Failed to execute goal org.apache.maven.plugins:maven-deploy-plugin:2.7:deploy (default-deploy)
on project carbondata-parent: Deployment failed: repository element was not specified in the
POM inside distributionManagement element or in -DaltDeploymentRepository=id::layout::url
parameter -> [Help 1]
org.apache.maven.lifecycle.LifecycleExecutionException: Failed to execute goal org.apache.maven.plugins:maven-deploy-plugin:2.7:deploy
(default-deploy) on project carbondata-parent: Deployment failed: repository element was not
specified in the POM inside distributionManagement element or in -DaltDeploymentRepository=id::layout::url
parameter
	at org.apache.maven.lifecycle.internal.MojoExecutor.execute(MojoExecutor.java:216)
	at org.apache.maven.lifecycle.internal.MojoExecutor.execute(MojoExecutor.java:153)
	at org.apache.maven.lifecycle.internal.MojoExecutor.execute(MojoExecutor.java:145)
	at org.apache.maven.lifecycle.internal.LifecycleModuleBuilder.buildProject(LifecycleModuleBuilder.java:116)
	at org.apache.maven.lifecycle.internal.LifecycleModuleBuilder.buildProject(LifecycleModuleBuilder.java:80)
	at org.apache.maven.lifecycle.internal.builder.singlethreaded.SingleThreadedBuilder.build(SingleThreadedBuilder.java:51)
	at org.apache.maven.lifecycle.internal.LifecycleStarter.execute(LifecycleStarter.java:128)
	at org.apache.maven.DefaultMaven.doExecute(DefaultMaven.java:307)
	at org.apache.maven.DefaultMaven.doExecute(DefaultMaven.java:193)
	at org.apache.maven.DefaultMaven.execute(DefaultMaven.java:106)
	at org.jvnet.hudson.maven3.launcher.Maven32Launcher.main(Maven32Launcher.java:132)
	at sun.reflect.NativeMethodAccessorImpl.invoke0(Native Method)
	at sun.reflect.NativeMethodAccessorImpl.invoke(NativeMethodAccessorImpl.java:62)
	at sun.reflect.DelegatingMethodAccessorImpl.invoke(DelegatingMethodAccessorImpl.java:43)
	at java.lang.reflect.Method.invoke(Method.java:497)
	at org.codehaus.plexus.classworlds.launcher.Launcher.launchStandard(Launcher.java:330)
	at org.codehaus.plexus.classworlds.launcher.Launcher.launch(Launcher.java:238)
	at jenkins.maven3.agent.Maven32Main.launch(Maven32Main.java:186)
	at sun.reflect.NativeMethodAccessorImpl.invoke0(Native Method)
	at sun.reflect.NativeMethodAccessorImpl.invoke(NativeMethodAccessorImpl.java:62)
	at sun.reflect.DelegatingMethodAccessorImpl.invoke(DelegatingMethodAccessorImpl.java:43)
	at java.lang.reflect.Method.invoke(Method.java:497)
	at hudson.maven.Maven3Builder.call(Maven3Builder.java:136)
	at hudson.maven.Maven3Builder.call(Maven3Builder.java:71)
	at hudson.remoting.UserRequest.perform(UserRequest.java:120)
	at hudson.remoting.UserRequest.perform(UserRequest.java:48)
	at hudson.remoting.Request$2.run(Request.java:326)
	at hudson.remoting.InterceptingExecutorService$1.call(InterceptingExecutorService.java:68)
	at java.util.concurrent.FutureTask.run(FutureTask.java:266)
	at java.util.concurrent.ThreadPoolExecutor.runWorker(ThreadPoolExecutor.java:1142)
	at java.util.concurrent.ThreadPoolExecutor$Worker.run(ThreadPoolExecutor.java:617)
	at java.lang.Thread.run(Thread.java:745)
Caused by: org.apache.maven.plugin.MojoExecutionException: Deployment failed: repository element
was not specified in the POM inside distributionManagement element or in -DaltDeploymentRepository=id::layout::url
parameter
	at org.apache.maven.plugin.deploy.DeployMojo.getDeploymentRepository(DeployMojo.java:235)
	at org.apache.maven.plugin.deploy.DeployMojo.execute(DeployMojo.java:118)
	at org.apache.maven.plugin.DefaultBuildPluginManager.executeMojo(DefaultBuildPluginManager.java:134)
	at org.apache.maven.lifecycle.internal.MojoExecutor.execute(MojoExecutor.java:208)
	... 31 more
[ERROR] 
[ERROR] Re-run Maven using the -X switch to enable full debug logging.
[ERROR] 
[ERROR] For more information about the errors and possible solutions, please read the following
articles:
[ERROR] [Help 1] http://cwiki.apache.org/confluence/display/MAVEN/MojoExecutionException
[JENKINS] Archiving <https://builds.apache.org/job/CarbonData-master/ws/common/pom.xml>
to org.carbondata/carbon-common/0.1.0-SNAPSHOT/carbon-common-0.1.0-SNAPSHOT.pom
No prior successful build to compare, so performing full copy of artifacts
[JENKINS] Archiving <https://builds.apache.org/job/CarbonData-master/ws/examples/pom.xml>
to org.carbondata/carbon-examples/0.1.0-SNAPSHOT/carbon-examples-0.1.0-SNAPSHOT.pom
No prior successful build to compare, so performing full copy of artifacts
[JENKINS] Archiving <https://builds.apache.org/job/CarbonData-master/ws/processing/pom.xml>
to org.carbondata/carbon-processing/0.1.0-SNAPSHOT/carbon-processing-0.1.0-SNAPSHOT.pom
No prior successful build to compare, so performing full copy of artifacts
[JENKINS] Archiving <https://builds.apache.org/job/CarbonData-master/ws/integration/spark/pom.xml>
to org.carbondata/carbon-spark/0.1.0-SNAPSHOT/carbon-spark-0.1.0-SNAPSHOT.pom
No prior successful build to compare, so performing full copy of artifacts
[JENKINS] Archiving <https://builds.apache.org/job/CarbonData-master/ws/assembly/pom.xml>
to com.huawei.datasight/carbon-assembly/0.1.0-SNAPSHOT/carbon-assembly-0.1.0-SNAPSHOT.pom
No prior successful build to compare, so performing full copy of artifacts
[JENKINS] Archiving <https://builds.apache.org/job/CarbonData-master/ws/pom.xml> to
org.carbondata/carbondata-parent/0.1.0-SNAPSHOT/carbondata-parent-0.1.0-SNAPSHOT.pom
No prior successful build to compare, so performing full copy of artifacts
[JENKINS] Archiving <https://builds.apache.org/job/CarbonData-master/ws/core/pom.xml>
to org.carbondata/carbon-core/0.1.0-SNAPSHOT/carbon-core-0.1.0-SNAPSHOT.pom
No prior successful build to compare, so performing full copy of artifacts
[JENKINS] Archiving <https://builds.apache.org/job/CarbonData-master/ws/hadoop/pom.xml>
to org.carbondata/carbon-hadoop/0.1.0-SNAPSHOT/carbon-hadoop-0.1.0-SNAPSHOT.pom
No prior successful build to compare, so performing full copy of artifacts
[JENKINS] Archiving <https://builds.apache.org/job/CarbonData-master/ws/format/pom.xml>
to org.carbondata/carbon-format/0.1.0-SNAPSHOT/carbon-format-0.1.0-SNAPSHOT.pom
No prior successful build to compare, so performing full copy of artifacts
Sending e-mails to: commits@carbondata.incubator.apache.org chenliang613@apache.org
channel stopped

Mime
View raw message