carbondata-commits mailing list archives

Site index · List index
Message view « Date » · « Thread »
Top « Date » · « Thread »
From Apache Jenkins Server <jenk...@builds.apache.org>
Subject Build failed in Jenkins: CarbonData-master #352
Date Sun, 26 Feb 2017 15:12:44 GMT
See <https://builds.apache.org/job/CarbonData-master/352/display/redirect?page=changes>

Changes:

[jackylk] Added V3 Format Writer and Reader Code

------------------------------------------
[...truncated 21.58 KB...]
  symbol:   class DataChunk3
  location: package org.apache.carbondata.format
[ERROR] <https://builds.apache.org/job/CarbonData-master/ws/core/src/main/java/org/apache/carbondata/core/util/DataFileFooterConverterV3.java>:[69,38]
cannot find symbol
  symbol:   class BlockletInfo3
  location: package org.apache.carbondata.format
[ERROR] <https://builds.apache.org/job/CarbonData-master/ws/core/src/main/java/org/apache/carbondata/core/util/DataFileFooterConverterV3.java>:[70,15]
cannot find symbol
  symbol:   method getBlocklet_info_list3()
  location: variable footer of type org.apache.carbondata.format.FileFooter
[ERROR] <https://builds.apache.org/job/CarbonData-master/ws/core/src/main/java/org/apache/carbondata/core/datastore/chunk/reader/dimension/v3/CompressedDimensionChunkFileBasedReaderV3.java>:[96,5]
cannot find symbol
  symbol:   class DataChunk3
  location: class org.apache.carbondata.core.datastore.chunk.reader.dimension.v3.CompressedDimensionChunkFileBasedReaderV3
[ERROR] <https://builds.apache.org/job/CarbonData-master/ws/core/src/main/java/org/apache/carbondata/core/datastore/chunk/reader/dimension/v3/CompressedDimensionChunkFileBasedReaderV3.java>:[165,7]
cannot find symbol
  symbol:   class DataChunk3
  location: class org.apache.carbondata.core.datastore.chunk.reader.dimension.v3.CompressedDimensionChunkFileBasedReaderV3
[ERROR] <https://builds.apache.org/job/CarbonData-master/ws/core/src/main/java/org/apache/carbondata/core/datastore/chunk/reader/dimension/v3/CompressedDimensionChunkFileBasedReaderV3.java>:[210,5]
cannot find symbol
  symbol:   class DataChunk3
  location: class org.apache.carbondata.core.datastore.chunk.reader.dimension.v3.CompressedDimensionChunkFileBasedReaderV3
[ERROR] <https://builds.apache.org/job/CarbonData-master/ws/core/src/main/java/org/apache/carbondata/core/util/CarbonUtil.java>:[1264,13]
cannot find symbol
  symbol:   class DataChunk3
  location: class org.apache.carbondata.core.util.CarbonUtil
[ERROR] <https://builds.apache.org/job/CarbonData-master/ws/core/src/main/java/org/apache/carbondata/core/util/CarbonUtil.java>:[1266,20]
cannot find symbol
  symbol: class DataChunk3
[ERROR] <https://builds.apache.org/job/CarbonData-master/ws/core/src/main/java/org/apache/carbondata/core/util/CarbonMetadataUtil.java>:[128,10]
cannot find symbol
  symbol:   class BlockletInfo3
  location: class org.apache.carbondata.core.util.CarbonMetadataUtil
[ERROR] <https://builds.apache.org/job/CarbonData-master/ws/core/src/main/java/org/apache/carbondata/core/util/CarbonMetadataUtil.java>:[222,10]
cannot find symbol
  symbol:   class BlockletInfo3
  location: class org.apache.carbondata.core.util.CarbonMetadataUtil
[ERROR] <https://builds.apache.org/job/CarbonData-master/ws/core/src/main/java/org/apache/carbondata/core/util/CarbonMetadataUtil.java>:[722,16]
cannot find symbol
  symbol:   variable min_max
  location: variable dataChunk of type org.apache.carbondata.format.DataChunk2
[ERROR] <https://builds.apache.org/job/CarbonData-master/ws/core/src/main/java/org/apache/carbondata/core/util/CarbonMetadataUtil.java>:[724,16]
cannot find symbol
  symbol:   method setNumberOfRowsInpage(int)
  location: variable dataChunk of type org.apache.carbondata.format.DataChunk2
[ERROR] <https://builds.apache.org/job/CarbonData-master/ws/core/src/main/java/org/apache/carbondata/core/util/CarbonMetadataUtil.java>:[749,18]
cannot find symbol
  symbol:   variable min_max
  location: variable dataChunk of type org.apache.carbondata.format.DataChunk2
[ERROR] <https://builds.apache.org/job/CarbonData-master/ws/core/src/main/java/org/apache/carbondata/core/util/CarbonMetadataUtil.java>:[750,18]
cannot find symbol
  symbol:   variable min_max
  location: variable dataChunk of type org.apache.carbondata.format.DataChunk2
[ERROR] <https://builds.apache.org/job/CarbonData-master/ws/core/src/main/java/org/apache/carbondata/core/util/CarbonMetadataUtil.java>:[773,18]
cannot find symbol
  symbol:   variable min_max
  location: variable dataChunk of type org.apache.carbondata.format.DataChunk2
[ERROR] <https://builds.apache.org/job/CarbonData-master/ws/core/src/main/java/org/apache/carbondata/core/util/CarbonMetadataUtil.java>:[775,18]
cannot find symbol
  symbol:   variable min_max
  location: variable dataChunk of type org.apache.carbondata.format.DataChunk2
[ERROR] <https://builds.apache.org/job/CarbonData-master/ws/core/src/main/java/org/apache/carbondata/core/util/CarbonMetadataUtil.java>:[790,5]
cannot find symbol
  symbol:   class DataChunk3
  location: class org.apache.carbondata.core.util.CarbonMetadataUtil
[ERROR] <https://builds.apache.org/job/CarbonData-master/ws/core/src/main/java/org/apache/carbondata/core/util/CarbonMetadataUtil.java>:[790,32]
cannot find symbol
  symbol:   class DataChunk3
  location: class org.apache.carbondata.core.util.CarbonMetadataUtil
[ERROR] <https://builds.apache.org/job/CarbonData-master/ws/core/src/main/java/org/apache/carbondata/core/datastore/chunk/reader/measure/v3/CompressedMeasureChunkFileBasedReaderV3.java>:[95,5]
cannot find symbol
  symbol:   class DataChunk3
  location: class org.apache.carbondata.core.datastore.chunk.reader.measure.v3.CompressedMeasureChunkFileBasedReaderV3
[ERROR] <https://builds.apache.org/job/CarbonData-master/ws/core/src/main/java/org/apache/carbondata/core/datastore/chunk/reader/measure/v3/CompressedMeasureChunkFileBasedReaderV3.java>:[166,7]
cannot find symbol
  symbol:   class DataChunk3
  location: class org.apache.carbondata.core.datastore.chunk.reader.measure.v3.CompressedMeasureChunkFileBasedReaderV3
[ERROR] <https://builds.apache.org/job/CarbonData-master/ws/core/src/main/java/org/apache/carbondata/core/datastore/chunk/reader/measure/v3/CompressedMeasureChunkFileBasedReaderV3.java>:[209,5]
cannot find symbol
  symbol:   class DataChunk3
  location: class org.apache.carbondata.core.datastore.chunk.reader.measure.v3.CompressedMeasureChunkFileBasedReaderV3
[INFO] 35 errors 
[INFO] -------------------------------------------------------------
[INFO] ------------------------------------------------------------------------
[INFO] Reactor Summary:
[INFO] 
[INFO] Apache CarbonData :: Parent ........................ SUCCESS [  4.364 s]
[INFO] Apache CarbonData :: Common ........................ SUCCESS [  5.786 s]
[INFO] Apache CarbonData :: Core .......................... FAILURE [  9.481 s]
[INFO] Apache CarbonData :: Processing .................... SKIPPED
[INFO] Apache CarbonData :: Hadoop ........................ SKIPPED
[INFO] Apache CarbonData :: Spark Common .................. SKIPPED
[INFO] Apache CarbonData :: Spark ......................... SKIPPED
[INFO] Apache CarbonData :: Spark Common Test ............. SKIPPED
[INFO] Apache CarbonData :: Assembly ...................... SKIPPED
[INFO] Apache CarbonData :: Spark Examples ................ SKIPPED
[INFO] ------------------------------------------------------------------------
[INFO] BUILD FAILURE
[INFO] ------------------------------------------------------------------------
[INFO] Total time: 33.039 s
[INFO] Finished at: 2017-02-26T15:12:34+00:00
[INFO] Final Memory: 55M/621M
[INFO] ------------------------------------------------------------------------
[ERROR] Failed to execute goal org.apache.maven.plugins:maven-compiler-plugin:3.2:compile
(default-compile) on project carbondata-core: Compilation failure: Compilation failure:
[ERROR] <https://builds.apache.org/job/CarbonData-master/ws/core/src/main/java/org/apache/carbondata/core/datastore/chunk/AbstractRawColumnChunk.java>:[21,36]
cannot find symbol
[ERROR] symbol:   class DataChunk3
[ERROR] location: package org.apache.carbondata.format
[ERROR] <https://builds.apache.org/job/CarbonData-master/ws/core/src/main/java/org/apache/carbondata/core/datastore/chunk/AbstractRawColumnChunk.java>:[48,13]
cannot find symbol
[ERROR] symbol:   class DataChunk3
[ERROR] location: class org.apache.carbondata.core.datastore.chunk.AbstractRawColumnChunk
[ERROR] <https://builds.apache.org/job/CarbonData-master/ws/core/src/main/java/org/apache/carbondata/core/datastore/chunk/AbstractRawColumnChunk.java>:[127,10]
cannot find symbol
[ERROR] symbol:   class DataChunk3
[ERROR] location: class org.apache.carbondata.core.datastore.chunk.AbstractRawColumnChunk
[ERROR] <https://builds.apache.org/job/CarbonData-master/ws/core/src/main/java/org/apache/carbondata/core/datastore/chunk/AbstractRawColumnChunk.java>:[131,30]
cannot find symbol
[ERROR] symbol:   class DataChunk3
[ERROR] location: class org.apache.carbondata.core.datastore.chunk.AbstractRawColumnChunk
[ERROR] <https://builds.apache.org/job/CarbonData-master/ws/core/src/main/java/org/apache/carbondata/core/util/DataFileFooterConverterV3.java>:[91,35]
cannot find symbol
[ERROR] symbol:   class BlockletInfo3
[ERROR] location: package org.apache.carbondata.format
[ERROR] <https://builds.apache.org/job/CarbonData-master/ws/core/src/main/java/org/apache/carbondata/core/datastore/chunk/reader/dimension/v3/CompressedDimensionChunkFileBasedReaderV3.java>:[33,36]
cannot find symbol
[ERROR] symbol:   class DataChunk3
[ERROR] location: package org.apache.carbondata.format
[ERROR] <https://builds.apache.org/job/CarbonData-master/ws/core/src/main/java/org/apache/carbondata/core/util/CarbonUtil.java>:[76,36]
cannot find symbol
[ERROR] symbol:   class DataChunk3
[ERROR] location: package org.apache.carbondata.format
[ERROR] <https://builds.apache.org/job/CarbonData-master/ws/core/src/main/java/org/apache/carbondata/core/util/CarbonUtil.java>:[1259,17]
cannot find symbol
[ERROR] symbol:   class DataChunk3
[ERROR] location: class org.apache.carbondata.core.util.CarbonUtil
[ERROR] <https://builds.apache.org/job/CarbonData-master/ws/core/src/main/java/org/apache/carbondata/core/util/CarbonMetadataUtil.java>:[47,36]
cannot find symbol
[ERROR] symbol:   class BlockletInfo3
[ERROR] location: package org.apache.carbondata.format
[ERROR] <https://builds.apache.org/job/CarbonData-master/ws/core/src/main/java/org/apache/carbondata/core/util/CarbonMetadataUtil.java>:[54,36]
cannot find symbol
[ERROR] symbol:   class DataChunk3
[ERROR] location: package org.apache.carbondata.format
[ERROR] <https://builds.apache.org/job/CarbonData-master/ws/core/src/main/java/org/apache/carbondata/core/util/CarbonMetadataUtil.java>:[124,52]
cannot find symbol
[ERROR] symbol:   class BlockletInfo3
[ERROR] location: class org.apache.carbondata.core.util.CarbonMetadataUtil
[ERROR] <https://builds.apache.org/job/CarbonData-master/ws/core/src/main/java/org/apache/carbondata/core/util/CarbonMetadataUtil.java>:[142,49]
cannot find symbol
[ERROR] symbol:   class BlockletInfo3
[ERROR] location: class org.apache.carbondata.core.util.CarbonMetadataUtil
[ERROR] <https://builds.apache.org/job/CarbonData-master/ws/core/src/main/java/org/apache/carbondata/core/util/CarbonMetadataUtil.java>:[220,52]
cannot find symbol
[ERROR] symbol:   class BlockletInfo3
[ERROR] location: class org.apache.carbondata.core.util.CarbonMetadataUtil
[ERROR] <https://builds.apache.org/job/CarbonData-master/ws/core/src/main/java/org/apache/carbondata/core/util/CarbonMetadataUtil.java>:[784,17]
cannot find symbol
[ERROR] symbol:   class DataChunk3
[ERROR] location: class org.apache.carbondata.core.util.CarbonMetadataUtil
[ERROR] <https://builds.apache.org/job/CarbonData-master/ws/core/src/main/java/org/apache/carbondata/core/datastore/chunk/reader/measure/v3/CompressedMeasureChunkFileBasedReaderV3.java>:[35,36]
cannot find symbol
[ERROR] symbol:   class DataChunk3
[ERROR] location: package org.apache.carbondata.format
[ERROR] <https://builds.apache.org/job/CarbonData-master/ws/core/src/main/java/org/apache/carbondata/core/util/DataFileFooterConverterV3.java>:[69,38]
cannot find symbol
[ERROR] symbol:   class BlockletInfo3
[ERROR] location: package org.apache.carbondata.format
[ERROR] <https://builds.apache.org/job/CarbonData-master/ws/core/src/main/java/org/apache/carbondata/core/util/DataFileFooterConverterV3.java>:[70,15]
cannot find symbol
[ERROR] symbol:   method getBlocklet_info_list3()
[ERROR] location: variable footer of type org.apache.carbondata.format.FileFooter
[ERROR] <https://builds.apache.org/job/CarbonData-master/ws/core/src/main/java/org/apache/carbondata/core/datastore/chunk/reader/dimension/v3/CompressedDimensionChunkFileBasedReaderV3.java>:[96,5]
cannot find symbol
[ERROR] symbol:   class DataChunk3
[ERROR] location: class org.apache.carbondata.core.datastore.chunk.reader.dimension.v3.CompressedDimensionChunkFileBasedReaderV3
[ERROR] <https://builds.apache.org/job/CarbonData-master/ws/core/src/main/java/org/apache/carbondata/core/datastore/chunk/reader/dimension/v3/CompressedDimensionChunkFileBasedReaderV3.java>:[165,7]
cannot find symbol
[ERROR] symbol:   class DataChunk3
[ERROR] location: class org.apache.carbondata.core.datastore.chunk.reader.dimension.v3.CompressedDimensionChunkFileBasedReaderV3
[ERROR] <https://builds.apache.org/job/CarbonData-master/ws/core/src/main/java/org/apache/carbondata/core/datastore/chunk/reader/dimension/v3/CompressedDimensionChunkFileBasedReaderV3.java>:[210,5]
cannot find symbol
[ERROR] symbol:   class DataChunk3
[ERROR] location: class org.apache.carbondata.core.datastore.chunk.reader.dimension.v3.CompressedDimensionChunkFileBasedReaderV3
[ERROR] <https://builds.apache.org/job/CarbonData-master/ws/core/src/main/java/org/apache/carbondata/core/util/CarbonUtil.java>:[1264,13]
cannot find symbol
[ERROR] symbol:   class DataChunk3
[ERROR] location: class org.apache.carbondata.core.util.CarbonUtil
[ERROR] <https://builds.apache.org/job/CarbonData-master/ws/core/src/main/java/org/apache/carbondata/core/util/CarbonUtil.java>:[1266,20]
cannot find symbol
[ERROR] symbol: class DataChunk3
[ERROR] <https://builds.apache.org/job/CarbonData-master/ws/core/src/main/java/org/apache/carbondata/core/util/CarbonMetadataUtil.java>:[128,10]
cannot find symbol
[ERROR] symbol:   class BlockletInfo3
[ERROR] location: class org.apache.carbondata.core.util.CarbonMetadataUtil
[ERROR] <https://builds.apache.org/job/CarbonData-master/ws/core/src/main/java/org/apache/carbondata/core/util/CarbonMetadataUtil.java>:[222,10]
cannot find symbol
[ERROR] symbol:   class BlockletInfo3
[ERROR] location: class org.apache.carbondata.core.util.CarbonMetadataUtil
[ERROR] <https://builds.apache.org/job/CarbonData-master/ws/core/src/main/java/org/apache/carbondata/core/util/CarbonMetadataUtil.java>:[722,16]
cannot find symbol
[ERROR] symbol:   variable min_max
[ERROR] location: variable dataChunk of type org.apache.carbondata.format.DataChunk2
[ERROR] <https://builds.apache.org/job/CarbonData-master/ws/core/src/main/java/org/apache/carbondata/core/util/CarbonMetadataUtil.java>:[724,16]
cannot find symbol
[ERROR] symbol:   method setNumberOfRowsInpage(int)
[ERROR] location: variable dataChunk of type org.apache.carbondata.format.DataChunk2
[ERROR] <https://builds.apache.org/job/CarbonData-master/ws/core/src/main/java/org/apache/carbondata/core/util/CarbonMetadataUtil.java>:[749,18]
cannot find symbol
[ERROR] symbol:   variable min_max
[ERROR] location: variable dataChunk of type org.apache.carbondata.format.DataChunk2
[ERROR] <https://builds.apache.org/job/CarbonData-master/ws/core/src/main/java/org/apache/carbondata/core/util/CarbonMetadataUtil.java>:[750,18]
cannot find symbol
[ERROR] symbol:   variable min_max
[ERROR] location: variable dataChunk of type org.apache.carbondata.format.DataChunk2
[ERROR] <https://builds.apache.org/job/CarbonData-master/ws/core/src/main/java/org/apache/carbondata/core/util/CarbonMetadataUtil.java>:[773,18]
cannot find symbol
[ERROR] symbol:   variable min_max
[ERROR] location: variable dataChunk of type org.apache.carbondata.format.DataChunk2
[ERROR] <https://builds.apache.org/job/CarbonData-master/ws/core/src/main/java/org/apache/carbondata/core/util/CarbonMetadataUtil.java>:[775,18]
cannot find symbol
[ERROR] symbol:   variable min_max
[ERROR] location: variable dataChunk of type org.apache.carbondata.format.DataChunk2
[ERROR] <https://builds.apache.org/job/CarbonData-master/ws/core/src/main/java/org/apache/carbondata/core/util/CarbonMetadataUtil.java>:[790,5]
cannot find symbol
[ERROR] symbol:   class DataChunk3
[ERROR] location: class org.apache.carbondata.core.util.CarbonMetadataUtil
[ERROR] <https://builds.apache.org/job/CarbonData-master/ws/core/src/main/java/org/apache/carbondata/core/util/CarbonMetadataUtil.java>:[790,32]
cannot find symbol
[ERROR] symbol:   class DataChunk3
[ERROR] location: class org.apache.carbondata.core.util.CarbonMetadataUtil
[ERROR] <https://builds.apache.org/job/CarbonData-master/ws/core/src/main/java/org/apache/carbondata/core/datastore/chunk/reader/measure/v3/CompressedMeasureChunkFileBasedReaderV3.java>:[95,5]
cannot find symbol
[ERROR] symbol:   class DataChunk3
[ERROR] location: class org.apache.carbondata.core.datastore.chunk.reader.measure.v3.CompressedMeasureChunkFileBasedReaderV3
[ERROR] <https://builds.apache.org/job/CarbonData-master/ws/core/src/main/java/org/apache/carbondata/core/datastore/chunk/reader/measure/v3/CompressedMeasureChunkFileBasedReaderV3.java>:[166,7]
cannot find symbol
[ERROR] symbol:   class DataChunk3
[ERROR] location: class org.apache.carbondata.core.datastore.chunk.reader.measure.v3.CompressedMeasureChunkFileBasedReaderV3
[ERROR] <https://builds.apache.org/job/CarbonData-master/ws/core/src/main/java/org/apache/carbondata/core/datastore/chunk/reader/measure/v3/CompressedMeasureChunkFileBasedReaderV3.java>:[209,5]
cannot find symbol
[ERROR] symbol:   class DataChunk3
[ERROR] location: class org.apache.carbondata.core.datastore.chunk.reader.measure.v3.CompressedMeasureChunkFileBasedReaderV3
[ERROR] -> [Help 1]
org.apache.maven.lifecycle.LifecycleExecutionException: Failed to execute goal org.apache.maven.plugins:maven-compiler-plugin:3.2:compile
(default-compile) on project carbondata-core: Compilation failure
	at org.apache.maven.lifecycle.internal.MojoExecutor.execute(MojoExecutor.java:212)
	at org.apache.maven.lifecycle.internal.MojoExecutor.execute(MojoExecutor.java:153)
	at org.apache.maven.lifecycle.internal.MojoExecutor.execute(MojoExecutor.java:145)
	at org.apache.maven.lifecycle.internal.LifecycleModuleBuilder.buildProject(LifecycleModuleBuilder.java:116)
	at org.apache.maven.lifecycle.internal.LifecycleModuleBuilder.buildProject(LifecycleModuleBuilder.java:80)
	at org.apache.maven.lifecycle.internal.builder.singlethreaded.SingleThreadedBuilder.build(SingleThreadedBuilder.java:51)
	at org.apache.maven.lifecycle.internal.LifecycleStarter.execute(LifecycleStarter.java:128)
	at org.apache.maven.DefaultMaven.doExecute(DefaultMaven.java:307)
	at org.apache.maven.DefaultMaven.doExecute(DefaultMaven.java:193)
	at org.apache.maven.DefaultMaven.execute(DefaultMaven.java:106)
	at org.jvnet.hudson.maven3.launcher.Maven33Launcher.main(Maven33Launcher.java:129)
	at sun.reflect.NativeMethodAccessorImpl.invoke0(Native Method)
	at sun.reflect.NativeMethodAccessorImpl.invoke(NativeMethodAccessorImpl.java:62)
	at sun.reflect.DelegatingMethodAccessorImpl.invoke(DelegatingMethodAccessorImpl.java:43)
	at java.lang.reflect.Method.invoke(Method.java:498)
	at org.codehaus.plexus.classworlds.launcher.Launcher.launchStandard(Launcher.java:330)
	at org.codehaus.plexus.classworlds.launcher.Launcher.launch(Launcher.java:238)
	at jenkins.maven3.agent.Maven33Main.launch(Maven33Main.java:176)
	at sun.reflect.NativeMethodAccessorImpl.invoke0(Native Method)
	at sun.reflect.NativeMethodAccessorImpl.invoke(NativeMethodAccessorImpl.java:62)
	at sun.reflect.DelegatingMethodAccessorImpl.invoke(DelegatingMethodAccessorImpl.java:43)
	at java.lang.reflect.Method.invoke(Method.java:498)
	at hudson.maven.Maven3Builder.call(Maven3Builder.java:139)
	at hudson.maven.Maven3Builder.call(Maven3Builder.java:70)
	at hudson.remoting.UserRequest.perform(UserRequest.java:153)
	at hudson.remoting.UserRequest.perform(UserRequest.java:50)
	at hudson.remoting.Request$2.run(Request.java:336)
	at hudson.remoting.InterceptingExecutorService$1.call(InterceptingExecutorService.java:68)
	at java.util.concurrent.FutureTask.run(FutureTask.java:266)
	at java.util.concurrent.ThreadPoolExecutor.runWorker(ThreadPoolExecutor.java:1142)
	at java.util.concurrent.ThreadPoolExecutor$Worker.run(ThreadPoolExecutor.java:617)
	at java.lang.Thread.run(Thread.java:745)
Caused by: org.apache.maven.plugin.compiler.CompilationFailureException: Compilation failure
	at org.apache.maven.plugin.compiler.AbstractCompilerMojo.execute(AbstractCompilerMojo.java:909)
	at org.apache.maven.plugin.compiler.CompilerMojo.execute(CompilerMojo.java:129)
	at org.apache.maven.plugin.DefaultBuildPluginManager.executeMojo(DefaultBuildPluginManager.java:134)
	at org.apache.maven.lifecycle.internal.MojoExecutor.execute(MojoExecutor.java:208)
	... 31 more
[ERROR] 
[ERROR] Re-run Maven using the -X switch to enable full debug logging.
[ERROR] 
[ERROR] For more information about the errors and possible solutions, please read the following
articles:
[ERROR] [Help 1] http://cwiki.apache.org/confluence/display/MAVEN/MojoFailureException
[ERROR] 
[ERROR] After correcting the problems, you can resume the build with the command
[ERROR]   mvn <goals> -rf :carbondata-core
[JENKINS] Archiving <https://builds.apache.org/job/CarbonData-master/ws/processing/pom.xml>
to org.apache.carbondata/carbondata-processing/1.1.0-incubating-SNAPSHOT/carbondata-processing-1.1.0-incubating-SNAPSHOT.pom
[JENKINS] Archiving <https://builds.apache.org/job/CarbonData-master/ws/assembly/pom.xml>
to org.apache.carbondata/carbondata-assembly/1.1.0-incubating-SNAPSHOT/carbondata-assembly-1.1.0-incubating-SNAPSHOT.pom
[JENKINS] Archiving <https://builds.apache.org/job/CarbonData-master/ws/integration/spark-common/pom.xml>
to org.apache.carbondata/carbondata-spark-common/1.1.0-incubating-SNAPSHOT/carbondata-spark-common-1.1.0-incubating-SNAPSHOT.pom
[JENKINS] Archiving <https://builds.apache.org/job/CarbonData-master/ws/pom.xml> to
org.apache.carbondata/carbondata-parent/1.1.0-incubating-SNAPSHOT/carbondata-parent-1.1.0-incubating-SNAPSHOT.pom
[JENKINS] Archiving <https://builds.apache.org/job/CarbonData-master/ws/core/pom.xml>
to org.apache.carbondata/carbondata-core/1.1.0-incubating-SNAPSHOT/carbondata-core-1.1.0-incubating-SNAPSHOT.pom
[JENKINS] Archiving <https://builds.apache.org/job/CarbonData-master/ws/hadoop/pom.xml>
to org.apache.carbondata/carbondata-hadoop/1.1.0-incubating-SNAPSHOT/carbondata-hadoop-1.1.0-incubating-SNAPSHOT.pom
[JENKINS] Archiving <https://builds.apache.org/job/CarbonData-master/ws/examples/spark/pom.xml>
to org.apache.carbondata/carbondata-examples-spark/1.1.0-incubating-SNAPSHOT/carbondata-examples-spark-1.1.0-incubating-SNAPSHOT.pom
[JENKINS] Archiving <https://builds.apache.org/job/CarbonData-master/ws/common/pom.xml>
to org.apache.carbondata/carbondata-common/1.1.0-incubating-SNAPSHOT/carbondata-common-1.1.0-incubating-SNAPSHOT.pom
[JENKINS] Archiving <https://builds.apache.org/job/CarbonData-master/ws/common/target/carbondata-common-1.1.0-incubating-SNAPSHOT.jar>
to org.apache.carbondata/carbondata-common/1.1.0-incubating-SNAPSHOT/carbondata-common-1.1.0-incubating-SNAPSHOT.jar
[JENKINS] Archiving <https://builds.apache.org/job/CarbonData-master/ws/integration/spark-common-test/pom.xml>
to org.apache.carbondata/carbondata-spark-common-test/1.1.0-incubating-SNAPSHOT/carbondata-spark-common-test-1.1.0-incubating-SNAPSHOT.pom
[JENKINS] Archiving <https://builds.apache.org/job/CarbonData-master/ws/integration/spark/pom.xml>
to org.apache.carbondata/carbondata-spark/1.1.0-incubating-SNAPSHOT/carbondata-spark-1.1.0-incubating-SNAPSHOT.pom
Sending e-mails to: commits@carbondata.incubator.apache.org
channel stopped

Mime
View raw message