carbondata-commits mailing list archives

Site index · List index
Message view « Date » · « Thread »
Top « Date » · « Thread »
From Apache Jenkins Server <jenk...@builds.apache.org>
Subject Build failed in Jenkins: CarbonData-master #371
Date Fri, 10 Mar 2017 13:13:07 GMT
See <https://builds.apache.org/job/CarbonData-master/371/display/redirect?page=changes>

Changes:

[jackylk] Adding Header And Making Footer Optional

[jackylk] fix style in pom.xml This closes #643

------------------------------------------
[...truncated 4.98 KB...]
[INFO] Using 'UTF-8' encoding to copy filtered resources.
[INFO] skip non existing resourceDirectory <https://builds.apache.org/job/CarbonData-master/ws/common/src/main/resources>
[INFO] Copying 3 resources
[INFO] 
[INFO] --- maven-compiler-plugin:3.2:compile (default-compile) @ carbondata-common ---
[INFO] Changes detected - recompiling the module!
[INFO] Compiling 9 source files to <https://builds.apache.org/job/CarbonData-master/ws/common/target/classes>
[INFO] 
[INFO] --- maven-resources-plugin:2.7:testResources (default-testResources) @ carbondata-common
---
[INFO] Using 'UTF-8' encoding to copy filtered resources.
[INFO] skip non existing resourceDirectory <https://builds.apache.org/job/CarbonData-master/ws/common/src/test/resources>
[INFO] Copying 3 resources
[INFO] 
[INFO] --- maven-compiler-plugin:3.2:testCompile (default-testCompile) @ carbondata-common
---
[INFO] Changes detected - recompiling the module!
[INFO] Compiling 7 source files to <https://builds.apache.org/job/CarbonData-master/ws/common/target/test-classes>
[INFO] 
[INFO] --- maven-surefire-plugin:2.18.1:test (default-test) @ carbondata-common ---
[JENKINS] Recording test results
[INFO] 
[INFO] --- maven-jar-plugin:2.5:jar (default-jar) @ carbondata-common ---
[INFO] Building jar: <https://builds.apache.org/job/CarbonData-master/ws/common/target/carbondata-common-1.1.0-incubating-SNAPSHOT.jar>
[INFO] 
[INFO] --- maven-site-plugin:3.4:attach-descriptor (attach-descriptor) @ carbondata-common
---
[INFO]                                                                         
[INFO] ------------------------------------------------------------------------
[INFO] Building Apache CarbonData :: Core 1.1.0-incubating-SNAPSHOT
[INFO] ------------------------------------------------------------------------
[INFO] Downloading: http://repository.apache.org/snapshots/org/apache/carbondata/carbondata-format/1.1.0-incubating-SNAPSHOT/maven-metadata.xml
[INFO] Downloading: http://repo1.maven.org/maven2/org/apache/carbondata/carbondata-format/1.1.0-incubating-SNAPSHOT/maven-metadata.xml
[INFO] Downloading: http://136.243.101.176:9091/repository/carbondata/org/apache/carbondata/carbondata-format/1.1.0-incubating-SNAPSHOT/maven-metadata.xml
[INFO] Downloading: http://repository.pentaho.org/artifactory/repo/org/apache/carbondata/carbondata-format/1.1.0-incubating-SNAPSHOT/maven-metadata.xml
[INFO] Downloaded: http://repository.apache.org/snapshots/org/apache/carbondata/carbondata-format/1.1.0-incubating-SNAPSHOT/maven-metadata.xml
(821 B at 1.7 KB/sec)
[INFO] 
[INFO] --- maven-clean-plugin:2.5:clean (default-clean) @ carbondata-core ---
[INFO] Deleting <https://builds.apache.org/job/CarbonData-master/ws/core/target>
[INFO] 
[INFO] --- maven-remote-resources-plugin:1.5:process (default) @ carbondata-core ---
[INFO] 
[INFO] --- maven-resources-plugin:2.7:resources (default-resources) @ carbondata-core ---
[INFO] Using 'UTF-8' encoding to copy filtered resources.
[INFO] Copying 1 resource
[INFO] Copying 3 resources
[INFO] 
[INFO] --- maven-compiler-plugin:3.2:compile (default-compile) @ carbondata-core ---
[INFO] Changes detected - recompiling the module!
[INFO] Compiling 434 source files to <https://builds.apache.org/job/CarbonData-master/ws/core/target/classes>
[INFO] <https://builds.apache.org/job/CarbonData-master/ws/core/src/main/java/org/apache/carbondata/core/datastore/impl/data/compressed/AbstractHeavyCompressedDoubleArrayDataStore.java>:
Some input files use unchecked or unsafe operations.
[INFO] <https://builds.apache.org/job/CarbonData-master/ws/core/src/main/java/org/apache/carbondata/core/datastore/impl/data/compressed/AbstractHeavyCompressedDoubleArrayDataStore.java>:
Recompile with -Xlint:unchecked for details.
[INFO] -------------------------------------------------------------
[WARNING] COMPILATION WARNING : 
[INFO] -------------------------------------------------------------
[WARNING] <https://builds.apache.org/job/CarbonData-master/ws/core/src/main/java/org/apache/carbondata/core/memory/CarbonUnsafe.java>:[22,16]
sun.misc.Unsafe is internal proprietary API and may be removed in a future release
[WARNING] <https://builds.apache.org/job/CarbonData-master/ws/core/src/main/java/org/apache/carbondata/core/util/ByteUtil.java>:[111,26]
sun.misc.Unsafe is internal proprietary API and may be removed in a future release
[WARNING] <https://builds.apache.org/job/CarbonData-master/ws/core/src/main/java/org/apache/carbondata/core/util/ByteUtil.java>:[120,28]
sun.misc.Unsafe is internal proprietary API and may be removed in a future release
[WARNING] <https://builds.apache.org/job/CarbonData-master/ws/core/src/main/java/org/apache/carbondata/core/util/ByteUtil.java>:[123,31]
sun.misc.Unsafe is internal proprietary API and may be removed in a future release
[WARNING] <https://builds.apache.org/job/CarbonData-master/ws/core/src/main/java/org/apache/carbondata/core/memory/CarbonUnsafe.java>:[37,17]
sun.misc.Unsafe is internal proprietary API and may be removed in a future release
[WARNING] <https://builds.apache.org/job/CarbonData-master/ws/core/src/main/java/org/apache/carbondata/core/memory/CarbonUnsafe.java>:[41,21]
sun.misc.Unsafe is internal proprietary API and may be removed in a future release
[WARNING] <https://builds.apache.org/job/CarbonData-master/ws/core/src/main/java/org/apache/carbondata/core/memory/CarbonUnsafe.java>:[43,17]
sun.misc.Unsafe is internal proprietary API and may be removed in a future release
[INFO] 7 warnings 
[INFO] -------------------------------------------------------------
[INFO] -------------------------------------------------------------
[ERROR] COMPILATION ERROR : 
[INFO] -------------------------------------------------------------
[ERROR] <https://builds.apache.org/job/CarbonData-master/ws/core/src/main/java/org/apache/carbondata/core/util/DataFileFooterConverterV3.java>:[31,36]
cannot find symbol
  symbol:   class FileFooter3
  location: package org.apache.carbondata.format
[ERROR] <https://builds.apache.org/job/CarbonData-master/ws/core/src/main/java/org/apache/carbondata/core/util/CarbonMetadataUtil.java>:[57,36]
cannot find symbol
  symbol:   class FileFooter3
  location: package org.apache.carbondata.format
[ERROR] <https://builds.apache.org/job/CarbonData-master/ws/core/src/main/java/org/apache/carbondata/core/util/CarbonMetadataUtil.java>:[126,17]
cannot find symbol
  symbol:   class FileFooter3
  location: class org.apache.carbondata.core.util.CarbonMetadataUtil
[ERROR] <https://builds.apache.org/job/CarbonData-master/ws/core/src/main/java/org/apache/carbondata/core/util/CarbonMetadataUtil.java>:[145,18]
cannot find symbol
  symbol:   class FileFooter3
  location: class org.apache.carbondata.core.util.CarbonMetadataUtil
[ERROR] <https://builds.apache.org/job/CarbonData-master/ws/core/src/main/java/org/apache/carbondata/core/reader/CarbonFooterReaderV3.java>:[22,36]
cannot find symbol
  symbol:   class FileFooter3
  location: package org.apache.carbondata.format
[ERROR] <https://builds.apache.org/job/CarbonData-master/ws/core/src/main/java/org/apache/carbondata/core/reader/CarbonFooterReaderV3.java>:[49,10]
cannot find symbol
  symbol:   class FileFooter3
  location: class org.apache.carbondata.core.reader.CarbonFooterReaderV3
[ERROR] <https://builds.apache.org/job/CarbonData-master/ws/core/src/main/java/org/apache/carbondata/core/util/DataFileFooterConverterV3.java>:[56,5]
cannot find symbol
  symbol:   class FileFooter3
  location: class org.apache.carbondata.core.util.DataFileFooterConverterV3
[ERROR] <https://builds.apache.org/job/CarbonData-master/ws/core/src/main/java/org/apache/carbondata/core/util/DataFileFooterConverterV3.java>:[61,79]
cannot find symbol
  symbol:   method getColumn_schema()
  location: variable fileHeader of type org.apache.carbondata.format.FileHeader
[ERROR] <https://builds.apache.org/job/CarbonData-master/ws/core/src/main/java/org/apache/carbondata/core/util/DataFileFooterConverterV3.java>:[114,53]
cannot find symbol
  symbol:   method getNumber_number_of_pages()
  location: variable blockletInfoThrift of type org.apache.carbondata.format.BlockletInfo3
[ERROR] <https://builds.apache.org/job/CarbonData-master/ws/core/src/main/java/org/apache/carbondata/core/util/CarbonMetadataUtil.java>:[129,5]
cannot find symbol
  symbol:   class FileFooter3
  location: class org.apache.carbondata.core.util.CarbonMetadataUtil
[ERROR] <https://builds.apache.org/job/CarbonData-master/ws/core/src/main/java/org/apache/carbondata/core/util/CarbonMetadataUtil.java>:[150,5]
cannot find symbol
  symbol:   class FileFooter3
  location: class org.apache.carbondata.core.util.CarbonMetadataUtil
[ERROR] <https://builds.apache.org/job/CarbonData-master/ws/core/src/main/java/org/apache/carbondata/core/util/CarbonMetadataUtil.java>:[150,30]
cannot find symbol
  symbol:   class FileFooter3
  location: class org.apache.carbondata.core.util.CarbonMetadataUtil
[ERROR] <https://builds.apache.org/job/CarbonData-master/ws/core/src/main/java/org/apache/carbondata/core/util/CarbonMetadataUtil.java>:[900,15]
cannot find symbol
  symbol:   method setIs_footer_present(boolean)
  location: variable fileHeader of type org.apache.carbondata.format.FileHeader
[ERROR] <https://builds.apache.org/job/CarbonData-master/ws/core/src/main/java/org/apache/carbondata/core/util/CarbonMetadataUtil.java>:[901,15]
cannot find symbol
  symbol:   method setColumn_schema(java.util.List<org.apache.carbondata.format.ColumnSchema>)
  location: variable fileHeader of type org.apache.carbondata.format.FileHeader
[ERROR] <https://builds.apache.org/job/CarbonData-master/ws/core/src/main/java/org/apache/carbondata/core/reader/CarbonFooterReaderV3.java>:[54,5]
cannot find symbol
  symbol:   class FileFooter3
  location: class org.apache.carbondata.core.reader.CarbonFooterReaderV3
[ERROR] <https://builds.apache.org/job/CarbonData-master/ws/core/src/main/java/org/apache/carbondata/core/reader/CarbonFooterReaderV3.java>:[54,27]
cannot find symbol
  symbol:   class FileFooter3
  location: class org.apache.carbondata.core.reader.CarbonFooterReaderV3
[ERROR] <https://builds.apache.org/job/CarbonData-master/ws/core/src/main/java/org/apache/carbondata/core/reader/CarbonFooterReaderV3.java>:[70,20]
cannot find symbol
  symbol: class FileFooter3
[INFO] 17 errors 
[INFO] -------------------------------------------------------------
[INFO] ------------------------------------------------------------------------
[INFO] Reactor Summary:
[INFO] 
[INFO] Apache CarbonData :: Parent ........................ SUCCESS [  4.948 s]
[INFO] Apache CarbonData :: Common ........................ SUCCESS [  6.453 s]
[INFO] Apache CarbonData :: Core .......................... FAILURE [ 10.824 s]
[INFO] Apache CarbonData :: Processing .................... SKIPPED
[INFO] Apache CarbonData :: Hadoop ........................ SKIPPED
[INFO] Apache CarbonData :: Spark Common .................. SKIPPED
[INFO] Apache CarbonData :: Spark ......................... SKIPPED
[INFO] Apache CarbonData :: Spark Common Test ............. SKIPPED
[INFO] Apache CarbonData :: Assembly ...................... SKIPPED
[INFO] Apache CarbonData :: Spark Examples ................ SKIPPED
[INFO] ------------------------------------------------------------------------
[INFO] BUILD FAILURE
[INFO] ------------------------------------------------------------------------
[INFO] Total time: 37.547 s
[INFO] Finished at: 2017-03-10T13:12:44+00:00
[INFO] Final Memory: 53M/563M
[INFO] ------------------------------------------------------------------------
Waiting for Jenkins to finish collecting data
[ERROR] Failed to execute goal org.apache.maven.plugins:maven-compiler-plugin:3.2:compile
(default-compile) on project carbondata-core: Compilation failure: Compilation failure:
[ERROR] <https://builds.apache.org/job/CarbonData-master/ws/core/src/main/java/org/apache/carbondata/core/util/DataFileFooterConverterV3.java>:[31,36]
cannot find symbol
[ERROR] symbol:   class FileFooter3
[ERROR] location: package org.apache.carbondata.format
[ERROR] <https://builds.apache.org/job/CarbonData-master/ws/core/src/main/java/org/apache/carbondata/core/util/CarbonMetadataUtil.java>:[57,36]
cannot find symbol
[ERROR] symbol:   class FileFooter3
[ERROR] location: package org.apache.carbondata.format
[ERROR] <https://builds.apache.org/job/CarbonData-master/ws/core/src/main/java/org/apache/carbondata/core/util/CarbonMetadataUtil.java>:[126,17]
cannot find symbol
[ERROR] symbol:   class FileFooter3
[ERROR] location: class org.apache.carbondata.core.util.CarbonMetadataUtil
[ERROR] <https://builds.apache.org/job/CarbonData-master/ws/core/src/main/java/org/apache/carbondata/core/util/CarbonMetadataUtil.java>:[145,18]
cannot find symbol
[ERROR] symbol:   class FileFooter3
[ERROR] location: class org.apache.carbondata.core.util.CarbonMetadataUtil
[ERROR] <https://builds.apache.org/job/CarbonData-master/ws/core/src/main/java/org/apache/carbondata/core/reader/CarbonFooterReaderV3.java>:[22,36]
cannot find symbol
[ERROR] symbol:   class FileFooter3
[ERROR] location: package org.apache.carbondata.format
[ERROR] <https://builds.apache.org/job/CarbonData-master/ws/core/src/main/java/org/apache/carbondata/core/reader/CarbonFooterReaderV3.java>:[49,10]
cannot find symbol
[ERROR] symbol:   class FileFooter3
[ERROR] location: class org.apache.carbondata.core.reader.CarbonFooterReaderV3
[ERROR] <https://builds.apache.org/job/CarbonData-master/ws/core/src/main/java/org/apache/carbondata/core/util/DataFileFooterConverterV3.java>:[56,5]
cannot find symbol
[ERROR] symbol:   class FileFooter3
[ERROR] location: class org.apache.carbondata.core.util.DataFileFooterConverterV3
[ERROR] <https://builds.apache.org/job/CarbonData-master/ws/core/src/main/java/org/apache/carbondata/core/util/DataFileFooterConverterV3.java>:[61,79]
cannot find symbol
[ERROR] symbol:   method getColumn_schema()
[ERROR] location: variable fileHeader of type org.apache.carbondata.format.FileHeader
[ERROR] <https://builds.apache.org/job/CarbonData-master/ws/core/src/main/java/org/apache/carbondata/core/util/DataFileFooterConverterV3.java>:[114,53]
cannot find symbol
[ERROR] symbol:   method getNumber_number_of_pages()
[ERROR] location: variable blockletInfoThrift of type org.apache.carbondata.format.BlockletInfo3
[ERROR] <https://builds.apache.org/job/CarbonData-master/ws/core/src/main/java/org/apache/carbondata/core/util/CarbonMetadataUtil.java>:[129,5]
cannot find symbol
[ERROR] symbol:   class FileFooter3
[ERROR] location: class org.apache.carbondata.core.util.CarbonMetadataUtil
[ERROR] <https://builds.apache.org/job/CarbonData-master/ws/core/src/main/java/org/apache/carbondata/core/util/CarbonMetadataUtil.java>:[150,5]
cannot find symbol
[ERROR] symbol:   class FileFooter3
[ERROR] location: class org.apache.carbondata.core.util.CarbonMetadataUtil
[ERROR] <https://builds.apache.org/job/CarbonData-master/ws/core/src/main/java/org/apache/carbondata/core/util/CarbonMetadataUtil.java>:[150,30]
cannot find symbol
[ERROR] symbol:   class FileFooter3
[ERROR] location: class org.apache.carbondata.core.util.CarbonMetadataUtil
[ERROR] <https://builds.apache.org/job/CarbonData-master/ws/core/src/main/java/org/apache/carbondata/core/util/CarbonMetadataUtil.java>:[900,15]
cannot find symbol
[ERROR] symbol:   method setIs_footer_present(boolean)
[ERROR] location: variable fileHeader of type org.apache.carbondata.format.FileHeader
[ERROR] <https://builds.apache.org/job/CarbonData-master/ws/core/src/main/java/org/apache/carbondata/core/util/CarbonMetadataUtil.java>:[901,15]
cannot find symbol
[ERROR] symbol:   method setColumn_schema(java.util.List<org.apache.carbondata.format.ColumnSchema>)
[ERROR] location: variable fileHeader of type org.apache.carbondata.format.FileHeader
[ERROR] <https://builds.apache.org/job/CarbonData-master/ws/core/src/main/java/org/apache/carbondata/core/reader/CarbonFooterReaderV3.java>:[54,5]
cannot find symbol
[ERROR] symbol:   class FileFooter3
[ERROR] location: class org.apache.carbondata.core.reader.CarbonFooterReaderV3
[ERROR] <https://builds.apache.org/job/CarbonData-master/ws/core/src/main/java/org/apache/carbondata/core/reader/CarbonFooterReaderV3.java>:[54,27]
cannot find symbol
[ERROR] symbol:   class FileFooter3
[ERROR] location: class org.apache.carbondata.core.reader.CarbonFooterReaderV3
[ERROR] <https://builds.apache.org/job/CarbonData-master/ws/core/src/main/java/org/apache/carbondata/core/reader/CarbonFooterReaderV3.java>:[70,20]
cannot find symbol
[ERROR] symbol: class FileFooter3
[ERROR] -> [Help 1]
org.apache.maven.lifecycle.LifecycleExecutionException: Failed to execute goal org.apache.maven.plugins:maven-compiler-plugin:3.2:compile
(default-compile) on project carbondata-core: Compilation failure
	at org.apache.maven.lifecycle.internal.MojoExecutor.execute(MojoExecutor.java:212)
	at org.apache.maven.lifecycle.internal.MojoExecutor.execute(MojoExecutor.java:153)
	at org.apache.maven.lifecycle.internal.MojoExecutor.execute(MojoExecutor.java:145)
	at org.apache.maven.lifecycle.internal.LifecycleModuleBuilder.buildProject(LifecycleModuleBuilder.java:116)
	at org.apache.maven.lifecycle.internal.LifecycleModuleBuilder.buildProject(LifecycleModuleBuilder.java:80)
	at org.apache.maven.lifecycle.internal.builder.singlethreaded.SingleThreadedBuilder.build(SingleThreadedBuilder.java:51)
	at org.apache.maven.lifecycle.internal.LifecycleStarter.execute(LifecycleStarter.java:128)
	at org.apache.maven.DefaultMaven.doExecute(DefaultMaven.java:307)
	at org.apache.maven.DefaultMaven.doExecute(DefaultMaven.java:193)
	at org.apache.maven.DefaultMaven.execute(DefaultMaven.java:106)
	at org.jvnet.hudson.maven3.launcher.Maven33Launcher.main(Maven33Launcher.java:129)
	at sun.reflect.NativeMethodAccessorImpl.invoke0(Native Method)
	at sun.reflect.NativeMethodAccessorImpl.invoke(NativeMethodAccessorImpl.java:62)
	at sun.reflect.DelegatingMethodAccessorImpl.invoke(DelegatingMethodAccessorImpl.java:43)
	at java.lang.reflect.Method.invoke(Method.java:498)
	at org.codehaus.plexus.classworlds.launcher.Launcher.launchStandard(Launcher.java:330)
	at org.codehaus.plexus.classworlds.launcher.Launcher.launch(Launcher.java:238)
	at jenkins.maven3.agent.Maven33Main.launch(Maven33Main.java:176)
	at sun.reflect.NativeMethodAccessorImpl.invoke0(Native Method)
	at sun.reflect.NativeMethodAccessorImpl.invoke(NativeMethodAccessorImpl.java:62)
	at sun.reflect.DelegatingMethodAccessorImpl.invoke(DelegatingMethodAccessorImpl.java:43)
	at java.lang.reflect.Method.invoke(Method.java:498)
	at hudson.maven.Maven3Builder.call(Maven3Builder.java:139)
	at hudson.maven.Maven3Builder.call(Maven3Builder.java:70)
	at hudson.remoting.UserRequest.perform(UserRequest.java:153)
	at hudson.remoting.UserRequest.perform(UserRequest.java:50)
	at hudson.remoting.Request$2.run(Request.java:336)
	at hudson.remoting.InterceptingExecutorService$1.call(InterceptingExecutorService.java:68)
	at java.util.concurrent.FutureTask.run(FutureTask.java:266)
	at java.util.concurrent.ThreadPoolExecutor.runWorker(ThreadPoolExecutor.java:1142)
	at java.util.concurrent.ThreadPoolExecutor$Worker.run(ThreadPoolExecutor.java:617)
	at java.lang.Thread.run(Thread.java:745)
Caused by: org.apache.maven.plugin.compiler.CompilationFailureException: Compilation failure
	at org.apache.maven.plugin.compiler.AbstractCompilerMojo.execute(AbstractCompilerMojo.java:909)
	at org.apache.maven.plugin.compiler.CompilerMojo.execute(CompilerMojo.java:129)
	at org.apache.maven.plugin.DefaultBuildPluginManager.executeMojo(DefaultBuildPluginManager.java:134)
	at org.apache.maven.lifecycle.internal.MojoExecutor.execute(MojoExecutor.java:208)
	... 31 more
[ERROR] 
[ERROR] Re-run Maven using the -X switch to enable full debug logging.
[ERROR] 
[ERROR] For more information about the errors and possible solutions, please read the following
articles:
[ERROR] [Help 1] http://cwiki.apache.org/confluence/display/MAVEN/MojoFailureException
[ERROR] 
[ERROR] After correcting the problems, you can resume the build with the command
[ERROR]   mvn <goals> -rf :carbondata-core
[JENKINS] Archiving <https://builds.apache.org/job/CarbonData-master/ws/processing/pom.xml>
to org.apache.carbondata/carbondata-processing/1.1.0-incubating-SNAPSHOT/carbondata-processing-1.1.0-incubating-SNAPSHOT.pom
[JENKINS] Archiving <https://builds.apache.org/job/CarbonData-master/ws/assembly/pom.xml>
to org.apache.carbondata/carbondata-assembly/1.1.0-incubating-SNAPSHOT/carbondata-assembly-1.1.0-incubating-SNAPSHOT.pom
[JENKINS] Archiving <https://builds.apache.org/job/CarbonData-master/ws/integration/spark-common/pom.xml>
to org.apache.carbondata/carbondata-spark-common/1.1.0-incubating-SNAPSHOT/carbondata-spark-common-1.1.0-incubating-SNAPSHOT.pom
[JENKINS] Archiving <https://builds.apache.org/job/CarbonData-master/ws/pom.xml> to
org.apache.carbondata/carbondata-parent/1.1.0-incubating-SNAPSHOT/carbondata-parent-1.1.0-incubating-SNAPSHOT.pom
[JENKINS] Archiving <https://builds.apache.org/job/CarbonData-master/ws/core/pom.xml>
to org.apache.carbondata/carbondata-core/1.1.0-incubating-SNAPSHOT/carbondata-core-1.1.0-incubating-SNAPSHOT.pom
[JENKINS] Archiving <https://builds.apache.org/job/CarbonData-master/ws/hadoop/pom.xml>
to org.apache.carbondata/carbondata-hadoop/1.1.0-incubating-SNAPSHOT/carbondata-hadoop-1.1.0-incubating-SNAPSHOT.pom
[JENKINS] Archiving <https://builds.apache.org/job/CarbonData-master/ws/examples/spark/pom.xml>
to org.apache.carbondata/carbondata-examples-spark/1.1.0-incubating-SNAPSHOT/carbondata-examples-spark-1.1.0-incubating-SNAPSHOT.pom
[JENKINS] Archiving <https://builds.apache.org/job/CarbonData-master/ws/common/pom.xml>
to org.apache.carbondata/carbondata-common/1.1.0-incubating-SNAPSHOT/carbondata-common-1.1.0-incubating-SNAPSHOT.pom
[JENKINS] Archiving <https://builds.apache.org/job/CarbonData-master/ws/common/target/carbondata-common-1.1.0-incubating-SNAPSHOT.jar>
to org.apache.carbondata/carbondata-common/1.1.0-incubating-SNAPSHOT/carbondata-common-1.1.0-incubating-SNAPSHOT.jar
[JENKINS] Archiving <https://builds.apache.org/job/CarbonData-master/ws/integration/spark-common-test/pom.xml>
to org.apache.carbondata/carbondata-spark-common-test/1.1.0-incubating-SNAPSHOT/carbondata-spark-common-test-1.1.0-incubating-SNAPSHOT.pom
[JENKINS] Archiving <https://builds.apache.org/job/CarbonData-master/ws/integration/spark/pom.xml>
to org.apache.carbondata/carbondata-spark/1.1.0-incubating-SNAPSHOT/carbondata-spark-1.1.0-incubating-SNAPSHOT.pom
Sending e-mails to: commits@carbondata.incubator.apache.org
channel stopped

Mime
View raw message