carbondata-commits mailing list archives

Site index · List index
Message view « Date » · « Thread »
Top « Date » · « Thread »
From Apache Jenkins Server <jenk...@builds.apache.org>
Subject Build failed in Jenkins: carbondata-master-spark-2.1 » Apache CarbonData :: presto #1557
Date Sat, 04 Nov 2017 08:01:14 GMT
See <https://builds.apache.org/job/carbondata-master-spark-2.1/org.apache.carbondata$carbondata-presto/1557/display/redirect>

------------------------------------------
[...truncated 159.89 KB...]
INFO: Started o.e.j.s.ServletContextHandler@5507584d{/,null,AVAILABLE,@http}
Nov 04, 2017 8:00:43 AM org.eclipse.jetty.server.Server doStart
INFO: jetty-9.3.13.M0
Nov 04, 2017 8:00:43 AM org.eclipse.jetty.server.Server doStart
WARNING: THIS IS NOT A STABLE RELEASE! DO NOT USE IN PRODUCTION!
Nov 04, 2017 8:00:43 AM org.eclipse.jetty.server.Server doStart
WARNING: Download a stable release from http://download.eclipse.org/jetty/
Nov 04, 2017 8:00:43 AM org.eclipse.jetty.server.handler.AbstractHandler doStart
WARNING: No Server set for org.eclipse.jetty.server.handler.ErrorHandler@25da1dc9
Nov 04, 2017 8:00:43 AM org.eclipse.jetty.server.handler.ContextHandler doStart
INFO: Started o.e.j.s.ServletContextHandler@5bbc033f{/,null,AVAILABLE,@http}
Nov 04, 2017 8:00:43 AM io.airlift.log.Logger info
INFO: Life cycle stopping...
Nov 04, 2017 8:00:43 AM org.eclipse.jetty.server.AbstractConnector doStop
INFO: Stopped http@54033a65{HTTP/1.1,[http/1.1, h2c, h2c-17, h2c-16, h2c-15, h2c-14]}{127.0.0.1:33346}
Nov 04, 2017 8:00:43 AM org.eclipse.jetty.server.handler.ContextHandler doStop
INFO: Stopped o.e.j.s.ServletContextHandler@4fce3ed7{/,null,UNAVAILABLE,@http}
Nov 04, 2017 8:00:43 AM org.eclipse.jetty.util.thread.QueuedThreadPool doStop
WARNING: http-worker{STOPPING,2<=8<=200,i=0,q=2} Couldn't stop Thread[http-worker-153,5,]
Nov 04, 2017 8:00:43 AM org.eclipse.jetty.util.thread.QueuedThreadPool doStop
WARNING: http-worker{STOPPING,2<=8<=200,i=0,q=2} Couldn't stop Thread[http-worker-154,5,]
Nov 04, 2017 8:00:43 AM io.airlift.log.Logger info
INFO: Life cycle stopped.
Nov 04, 2017 8:00:43 AM io.airlift.log.Logger info
INFO: Life cycle stopping...
Nov 04, 2017 8:00:43 AM org.eclipse.jetty.server.AbstractConnector doStop
INFO: Stopped http@25e796fe{HTTP/1.1,[http/1.1, h2c, h2c-17, h2c-16, h2c-15, h2c-14]}{127.0.0.1:40565}
Nov 04, 2017 8:00:43 AM org.eclipse.jetty.server.handler.ContextHandler doStop
INFO: Stopped o.e.j.s.ServletContextHandler@2358443e{/,null,UNAVAILABLE,@http}
Nov 04, 2017 8:00:43 AM org.eclipse.jetty.util.thread.QueuedThreadPool doStop
WARNING: http-worker{STOPPING,2<=8<=200,i=6,q=6} Couldn't stop Thread[http-worker-116,5,main]
Nov 04, 2017 8:00:43 AM org.eclipse.jetty.util.thread.QueuedThreadPool doStop
WARNING: http-worker{STOPPING,2<=8<=200,i=0,q=3} Couldn't stop Thread[http-worker-117,5,]
Nov 04, 2017 8:00:43 AM org.eclipse.jetty.util.thread.QueuedThreadPool doStop
WARNING: http-worker{STOPPING,2<=8<=200,i=0,q=3} Couldn't stop Thread[http-worker-214,5,]
Nov 04, 2017 8:00:43 AM io.airlift.log.Logger info
INFO: Life cycle stopped.
Nov 04, 2017 8:00:43 AM io.airlift.log.Logger info
INFO: Life cycle stopping...
Nov 04, 2017 8:00:43 AM org.eclipse.jetty.server.AbstractConnector doStop
INFO: Stopped http@50f3ba6a{HTTP/1.1,[http/1.1, h2c, h2c-17, h2c-16, h2c-15, h2c-14]}{127.0.0.1:33490}
Nov 04, 2017 8:00:43 AM org.eclipse.jetty.server.handler.ContextHandler doStop
INFO: Stopped o.e.j.s.ServletContextHandler@35454c7a{/,null,UNAVAILABLE,@http}
Nov 04, 2017 8:00:43 AM org.eclipse.jetty.util.thread.QueuedThreadPool doStop
WARNING: http-worker{STOPPING,2<=8<=200,i=8,q=7} Couldn't stop Thread[http-worker-218,5,main]
Nov 04, 2017 8:00:43 AM org.eclipse.jetty.util.thread.QueuedThreadPool doStop
WARNING: http-worker{STOPPING,2<=8<=200,i=3,q=7} Couldn't stop Thread[http-worker-80,5,]
Nov 04, 2017 8:00:43 AM org.eclipse.jetty.util.thread.QueuedThreadPool doStop
WARNING: http-worker{STOPPING,2<=8<=200,i=0,q=6} Couldn't stop Thread[http-worker-217,5,]
Nov 04, 2017 8:00:43 AM io.airlift.log.Logger info
INFO: Life cycle stopped.
Nov 04, 2017 8:00:43 AM io.airlift.log.Logger info
INFO: Life cycle stopping...
Nov 04, 2017 8:00:43 AM org.eclipse.jetty.server.AbstractConnector doStop
INFO: Stopped http@66e827a8{HTTP/1.1,[http/1.1, h2c, h2c-17, h2c-16, h2c-15, h2c-14]}{127.0.0.1:35931}
Nov 04, 2017 8:00:43 AM org.eclipse.jetty.server.handler.ContextHandler doStop
INFO: Stopped o.e.j.s.ServletContextHandler@662be9f7{/,null,UNAVAILABLE,@http}
Nov 04, 2017 8:00:43 AM org.eclipse.jetty.util.thread.QueuedThreadPool doStop
WARNING: http-worker{STOPPING,2<=10<=200,i=6,q=6} Couldn't stop Thread[http-worker-92,5,main]
Nov 04, 2017 8:00:43 AM org.eclipse.jetty.util.thread.QueuedThreadPool doStop
WARNING: http-worker{STOPPING,2<=10<=200,i=0,q=2} Couldn't stop Thread[http-worker-43,5,]
Nov 04, 2017 8:00:43 AM io.airlift.log.Logger info
INFO: Life cycle stopped.
*** RUN ABORTED ***
  java.lang.ExceptionInInitializerError:
  at org.apache.carbondata.presto.integrationtest.PrestoAllDataTypeTest.beforeAll(PrestoAllDataTypeTest.scala:43)
  at org.scalatest.BeforeAndAfterAll$class.beforeAll(BeforeAndAfterAll.scala:187)
  at org.apache.carbondata.presto.integrationtest.PrestoAllDataTypeTest.beforeAll(PrestoAllDataTypeTest.scala:28)
  at org.scalatest.BeforeAndAfterAll$class.run(BeforeAndAfterAll.scala:253)
  at org.apache.carbondata.presto.integrationtest.PrestoAllDataTypeTest.run(PrestoAllDataTypeTest.scala:28)
  at org.scalatest.Suite$class.callExecuteOnSuite$1(Suite.scala:1492)
  at org.scalatest.Suite$$anonfun$runNestedSuites$1.apply(Suite.scala:1528)
  at org.scalatest.Suite$$anonfun$runNestedSuites$1.apply(Suite.scala:1526)
  at scala.collection.IndexedSeqOptimized$class.foreach(IndexedSeqOptimized.scala:33)
  at scala.collection.mutable.ArrayOps$ofRef.foreach(ArrayOps.scala:186)
  ...
  Cause: com.google.inject.CreationException: Unable to create injector, see the following
errors:

1) Error notifying InjectionListener io.airlift.bootstrap.LifeCycleModule$1$$Lambda$92/985032587@1e5e2e06
of io.airlift.http.server.testing.TestingHttpServer.
 Reason: java.lang.RuntimeException: java.lang.reflect.InvocationTargetException
  at io.airlift.http.server.testing.TestingHttpServerModule.configure(TestingHttpServerModule.java:58)
  while locating io.airlift.http.server.testing.TestingHttpServer
  while locating io.airlift.http.server.HttpServer
Caused by: java.lang.RuntimeException: java.lang.reflect.InvocationTargetException
	at io.airlift.bootstrap.LifeCycleModule$1.lambda$hear$0(LifeCycleModule.java:64)
	at com.google.inject.internal.MembersInjectorImpl.notifyListeners(MembersInjectorImpl.java:119)
	at com.google.inject.internal.ConstructorInjector.provision(ConstructorInjector.java:115)
	at com.google.inject.internal.ConstructorInjector.construct(ConstructorInjector.java:85)
	at com.google.inject.internal.ConstructorBindingImpl$Factory.get(ConstructorBindingImpl.java:267)
	at com.google.inject.internal.ProviderToInternalFactoryAdapter$1.call(ProviderToInternalFactoryAdapter.java:46)
	at com.google.inject.internal.InjectorImpl.callInContext(InjectorImpl.java:1103)
	at com.google.inject.internal.ProviderToInternalFactoryAdapter.get(ProviderToInternalFactoryAdapter.java:40)
	at com.google.inject.internal.SingletonScope$1.get(SingletonScope.java:145)
	at com.google.inject.internal.InternalFactoryToProviderAdapter.get(InternalFactoryToProviderAdapter.java:41)
	at com.google.inject.internal.FactoryProxy.get(FactoryProxy.java:56)
	at com.google.inject.internal.InternalInjectorCreator$1.call(InternalInjectorCreator.java:205)
	at com.google.inject.internal.InternalInjectorCreator$1.call(InternalInjectorCreator.java:199)
	at com.google.inject.internal.InjectorImpl.callInContext(InjectorImpl.java:1092)
	at com.google.inject.internal.InternalInjectorCreator.loadEagerSingletons(InternalInjectorCreator.java:199)
	at com.google.inject.internal.InternalInjectorCreator.injectDynamically(InternalInjectorCreator.java:180)
	at com.google.inject.internal.InternalInjectorCreator.build(InternalInjectorCreator.java:110)
	at com.google.inject.Guice.createInjector(Guice.java:96)
	at io.airlift.bootstrap.Bootstrap.initialize(Bootstrap.java:242)
	at com.facebook.presto.server.testing.TestingPrestoServer.<init>(TestingPrestoServer.java:236)
	at com.facebook.presto.tests.DistributedQueryRunner.createTestingPrestoServer(DistributedQueryRunner.java:180)
	at com.facebook.presto.tests.DistributedQueryRunner.<init>(DistributedQueryRunner.java:119)
	at com.facebook.presto.tests.DistributedQueryRunner.<init>(DistributedQueryRunner.java:88)
	at org.apache.carbondata.presto.server.PrestoServer$.<init>(PrestoServer.scala:47)
	at org.apache.carbondata.presto.server.PrestoServer$.<clinit>(PrestoServer.scala)
	at org.apache.carbondata.presto.integrationtest.PrestoAllDataTypeTest.beforeAll(PrestoAllDataTypeTest.scala:43)
	at org.scalatest.BeforeAndAfterAll$class.beforeAll(BeforeAndAfterAll.scala:187)
	at org.apache.carbondata.presto.integrationtest.PrestoAllDataTypeTest.beforeAll(PrestoAllDataTypeTest.scala:28)
	at org.scalatest.BeforeAndAfterAll$class.run(BeforeAndAfterAll.scala:253)
	at org.apache.carbondata.presto.integrationtest.PrestoAllDataTypeTest.run(PrestoAllDataTypeTest.scala:28)
	at org.scalatest.Suite$class.callExecuteOnSuite$1(Suite.scala:1492)
	at org.scalatest.Suite$$anonfun$runNestedSuites$1.apply(Suite.scala:1528)
	at org.scalatest.Suite$$anonfun$runNestedSuites$1.apply(Suite.scala:1526)
	at scala.collection.IndexedSeqOptimized$class.foreach(IndexedSeqOptimized.scala:33)
	at scala.collection.mutable.ArrayOps$ofRef.foreach(ArrayOps.scala:186)
	at org.scalatest.Suite$class.runNestedSuites(Suite.scala:1526)
	at org.scalatest.tools.DiscoverySuite.runNestedSuites(DiscoverySuite.scala:29)
	at org.scalatest.Suite$class.run(Suite.scala:1421)
	at org.scalatest.tools.DiscoverySuite.run(DiscoverySuite.scala:29)
	at org.scalatest.tools.SuiteRunner.run(SuiteRunner.scala:55)
	at org.scalatest.tools.Runner$$anonfun$doRunRunRunDaDoRunRun$3.apply(Runner.scala:2563)
	at org.scalatest.tools.Runner$$anonfun$doRunRunRunDaDoRunRun$3.apply(Runner.scala:2557)
	at scala.collection.immutable.List.foreach(List.scala:381)
	at org.scalatest.tools.Runner$.doRunRunRunDaDoRunRun(Runner.scala:2557)
	at org.scalatest.tools.Runner$$anonfun$runOptionallyWithPassFailReporter$2.apply(Runner.scala:1044)
	at org.scalatest.tools.Runner$$anonfun$runOptionallyWithPassFailReporter$2.apply(Runner.scala:1043)
	at org.scalatest.tools.Runner$.withClassLoaderAndDispatchReporter(Runner.scala:2722)
	at org.scalatest.tools.Runner$.runOptionallyWithPassFailReporter(Runner.scala:1043)
	at org.scalatest.tools.Runner$.main(Runner.scala:860)
	at org.scalatest.tools.Runner.main(Runner.scala)
Caused by: java.lang.reflect.InvocationTargetException
	at sun.reflect.NativeMethodAccessorImpl.invoke0(Native Method)
	at sun.reflect.NativeMethodAccessorImpl.invoke(NativeMethodAccessorImpl.java:62)
	at sun.reflect.DelegatingMethodAccessorImpl.invoke(DelegatingMethodAccessorImpl.java:43)
	at java.lang.reflect.Method.invoke(Method.java:498)
	at io.airlift.bootstrap.LifeCycleManager.startInstance(LifeCycleManager.java:171)
	at io.airlift.bootstrap.LifeCycleManager.addInstance(LifeCycleManager.java:157)
	at io.airlift.bootstrap.LifeCycleModule$1.lambda$hear$0(LifeCycleModule.java:61)
	... 49 more
Caused by: java.net.BindException: Address already in use
	at sun.nio.ch.Net.bind0(Native Method)
	at sun.nio.ch.Net.bind(Net.java:433)
	at sun.nio.ch.Net.bind(Net.java:425)
	at sun.nio.ch.ServerSocketChannelImpl.bind(ServerSocketChannelImpl.java:223)
	at sun.nio.ch.ServerSocketAdaptor.bind(ServerSocketAdaptor.java:74)
	at org.eclipse.jetty.server.ServerConnector.open(ServerConnector.java:317)
	at org.eclipse.jetty.server.AbstractNetworkConnector.doStart(AbstractNetworkConnector.java:80)
	at org.eclipse.jetty.server.ServerConnector.doStart(ServerConnector.java:235)
	at org.eclipse.jetty.util.component.AbstractLifeCycle.start(AbstractLifeCycle.java:68)
	at org.eclipse.jetty.server.Server.doStart(Server.java:390)
	at org.eclipse.jetty.util.component.AbstractLifeCycle.start(AbstractLifeCycle.java:68)
	at io.airlift.http.server.HttpServer.start(HttpServer.java:381)
	... 56 more

2) Error notifying InjectionListener io.airlift.bootstrap.LifeCycleModule$1$$Lambda$92/985032587@1e5e2e06
of io.airlift.http.server.testing.TestingHttpServer.
 Reason: java.lang.RuntimeException: java.lang.reflect.InvocationTargetException
  at io.airlift.http.server.testing.TestingHttpServerModule.configure(TestingHttpServerModule.java:58)
  while locating io.airlift.http.server.testing.TestingHttpServer
Caused by: java.lang.RuntimeException: java.lang.reflect.InvocationTargetException
	at io.airlift.bootstrap.LifeCycleModule$1.lambda$hear$0(LifeCycleModule.java:64)
	at com.google.inject.internal.MembersInjectorImpl.notifyListeners(MembersInjectorImpl.java:119)
	at com.google.inject.internal.ConstructorInjector.provision(ConstructorInjector.java:115)
	at com.google.inject.internal.ConstructorInjector.construct(ConstructorInjector.java:85)
	at com.google.inject.internal.ConstructorBindingImpl$Factory.get(ConstructorBindingImpl.java:267)
	at com.google.inject.internal.ProviderToInternalFactoryAdapter$1.call(ProviderToInternalFactoryAdapter.java:46)
	at com.google.inject.internal.InjectorImpl.callInContext(InjectorImpl.java:1103)
	at com.google.inject.internal.ProviderToInternalFactoryAdapter.get(ProviderToInternalFactoryAdapter.java:40)
	at com.google.inject.internal.SingletonScope$1.get(SingletonScope.java:145)
	at com.google.inject.internal.InternalFactoryToProviderAdapter.get(InternalFactoryToProviderAdapter.java:41)
	at com.google.inject.internal.InternalInjectorCreator$1.call(InternalInjectorCreator.java:205)
	at com.google.inject.internal.InternalInjectorCreator$1.call(InternalInjectorCreator.java:199)
	at com.google.inject.internal.InjectorImpl.callInContext(InjectorImpl.java:1092)
	at com.google.inject.internal.InternalInjectorCreator.loadEagerSingletons(InternalInjectorCreator.java:199)
	at com.google.inject.internal.InternalInjectorCreator.injectDynamically(InternalInjectorCreator.java:180)
	at com.google.inject.internal.InternalInjectorCreator.build(InternalInjectorCreator.java:110)
	at com.google.inject.Guice.createInjector(Guice.java:96)
	at io.airlift.bootstrap.Bootstrap.initialize(Bootstrap.java:242)
	at com.facebook.presto.server.testing.TestingPrestoServer.<init>(TestingPrestoServer.java:236)
	at com.facebook.presto.tests.DistributedQueryRunner.createTestingPrestoServer(DistributedQueryRunner.java:180)
	at com.facebook.presto.tests.DistributedQueryRunner.<init>(DistributedQueryRunner.java:119)
	at com.facebook.presto.tests.DistributedQueryRunner.<init>(DistributedQueryRunner.java:88)
	at org.apache.carbondata.presto.server.PrestoServer$.<init>(PrestoServer.scala:47)
	at org.apache.carbondata.presto.server.PrestoServer$.<clinit>(PrestoServer.scala)
	at org.apache.carbondata.presto.integrationtest.PrestoAllDataTypeTest.beforeAll(PrestoAllDataTypeTest.scala:43)
	at org.scalatest.BeforeAndAfterAll$class.beforeAll(BeforeAndAfterAll.scala:187)
	at org.apache.carbondata.presto.integrationtest.PrestoAllDataTypeTest.beforeAll(PrestoAllDataTypeTest.scala:28)
	at org.scalatest.BeforeAndAfterAll$class.run(BeforeAndAfterAll.scala:253)
	at org.apache.carbondata.presto.integrationtest.PrestoAllDataTypeTest.run(PrestoAllDataTypeTest.scala:28)
	at org.scalatest.Suite$class.callExecuteOnSuite$1(Suite.scala:1492)
	at org.scalatest.Suite$$anonfun$runNestedSuites$1.apply(Suite.scala:1528)
	at org.scalatest.Suite$$anonfun$runNestedSuites$1.apply(Suite.scala:1526)
	at scala.collection.IndexedSeqOptimized$class.foreach(IndexedSeqOptimized.scala:33)
	at scala.collection.mutable.ArrayOps$ofRef.foreach(ArrayOps.scala:186)
	at org.scalatest.Suite$class.runNestedSuites(Suite.scala:1526)
	at org.scalatest.tools.DiscoverySuite.runNestedSuites(DiscoverySuite.scala:29)
	at org.scalatest.Suite$class.run(Suite.scala:1421)
	at org.scalatest.tools.DiscoverySuite.run(DiscoverySuite.scala:29)
	at org.scalatest.tools.SuiteRunner.run(SuiteRunner.scala:55)
	at org.scalatest.tools.Runner$$anonfun$doRunRunRunDaDoRunRun$3.apply(Runner.scala:2563)
	at org.scalatest.tools.Runner$$anonfun$doRunRunRunDaDoRunRun$3.apply(Runner.scala:2557)
	at scala.collection.immutable.List.foreach(List.scala:381)
	at org.scalatest.tools.Runner$.doRunRunRunDaDoRunRun(Runner.scala:2557)
	at org.scalatest.tools.Runner$$anonfun$runOptionallyWithPassFailReporter$2.apply(Runner.scala:1044)
	at org.scalatest.tools.Runner$$anonfun$runOptionallyWithPassFailReporter$2.apply(Runner.scala:1043)
	at org.scalatest.tools.Runner$.withClassLoaderAndDispatchReporter(Runner.scala:2722)
	at org.scalatest.tools.Runner$.runOptionallyWithPassFailReporter(Runner.scala:1043)
	at org.scalatest.tools.Runner$.main(Runner.scala:860)
	at org.scalatest.tools.Runner.main(Runner.scala)
Caused by: java.lang.reflect.InvocationTargetException
	at sun.reflect.NativeMethodAccessorImpl.invoke0(Native Method)
	at sun.reflect.NativeMethodAccessorImpl.invoke(NativeMethodAccessorImpl.java:62)
	at sun.reflect.DelegatingMethodAccessorImpl.invoke(DelegatingMethodAccessorImpl.java:43)
	at java.lang.reflect.Method.invoke(Method.java:498)
	at io.airlift.bootstrap.LifeCycleManager.startInstance(LifeCycleManager.java:171)
	at io.airlift.bootstrap.LifeCycleManager.addInstance(LifeCycleManager.java:157)
	at io.airlift.bootstrap.LifeCycleModule$1.lambda$hear$0(LifeCycleModule.java:61)
	... 48 more
Caused by: java.net.BindException: Address already in use
	at sun.nio.ch.Net.bind0(Native Method)
	at sun.nio.ch.Net.bind(Net.java:433)
	at sun.nio.ch.Net.bind(Net.java:425)
	at sun.nio.ch.ServerSocketChannelImpl.bind(ServerSocketChannelImpl.java:223)
	at sun.nio.ch.ServerSocketAdaptor.bind(ServerSocketAdaptor.java:74)
	at org.eclipse.jetty.server.ServerConnector.open(ServerConnector.java:317)
	at org.eclipse.jetty.server.AbstractNetworkConnector.doStart(AbstractNetworkConnector.java:80)
	at org.eclipse.jetty.server.ServerConnector.doStart(ServerConnector.java:235)
	at org.eclipse.jetty.util.component.AbstractLifeCycle.start(AbstractLifeCycle.java:68)
	at org.eclipse.jetty.server.Server.doStart(Server.java:390)
	at org.eclipse.jetty.util.component.AbstractLifeCycle.start(AbstractLifeCycle.java:68)
	at io.airlift.http.server.HttpServer.start(HttpServer.java:381)
	... 55 more

2 errors
  at com.google.inject.internal.Errors.throwCreationExceptionIfErrorsExist(Errors.java:466)
  at com.google.inject.internal.InternalInjectorCreator.injectDynamically(InternalInjectorCreator.java:184)
  at com.google.inject.internal.InternalInjectorCreator.build(InternalInjectorCreator.java:110)
  at com.google.inject.Guice.createInjector(Guice.java:96)
  at io.airlift.bootstrap.Bootstrap.initialize(Bootstrap.java:242)
  at com.facebook.presto.server.testing.TestingPrestoServer.<init>(TestingPrestoServer.java:236)
  at com.facebook.presto.tests.DistributedQueryRunner.createTestingPrestoServer(DistributedQueryRunner.java:180)
  at com.facebook.presto.tests.DistributedQueryRunner.<init>(DistributedQueryRunner.java:119)
  at com.facebook.presto.tests.DistributedQueryRunner.<init>(DistributedQueryRunner.java:88)
  at org.apache.carbondata.presto.server.PrestoServer$.<init>(PrestoServer.scala:47)
  ...
[JENKINS] Recording test results

Mime
View raw message