carbondata-commits mailing list archives

Site index · List index
Message view « Date » · « Thread »
Top « Date » · « Thread »
From Apache Jenkins Server <jenk...@builds.apache.org>
Subject Build failed in Jenkins: carbondata-master-spark-2.1 #1804
Date Sat, 23 Dec 2017 15:21:27 GMT
See <https://builds.apache.org/job/carbondata-master-spark-2.1/1804/display/redirect?page=changes>

Changes:

[jacky.likun] [CARBONDATA-1674] Describe formatted shows partition type

[jacky.likun] [CARBONDATA-1933] Support Spark 2.2.1 in carbon partition tables

[jacky.likun] [CARBONDATA-1777] Added check to refresh table if catalog relation is

[jacky.likun] [CARBONDATA-1911] Added Insert into query test case for parquet & hive

------------------------------------------
[...truncated 3.12 MB...]
     [java]       At edu.umd.cs.findbugs.detect.BuildUnconditionalParamDerefDatabase.considerMethod(BuildUnconditionalParamDerefDatabase.java:107)
     [java]       At edu.umd.cs.findbugs.detect.BuildUnconditionalParamDerefDatabase.visitClassContext(BuildUnconditionalParamDerefDatabase.java:91)
     [java]       At edu.umd.cs.findbugs.DetectorToDetector2Adapter.visitClass(DetectorToDetector2Adapter.java:76)
     [java]       At edu.umd.cs.findbugs.FindBugs2.analyzeApplication(FindBugs2.java:1089)
     [java]       At edu.umd.cs.findbugs.FindBugs2.execute(FindBugs2.java:283)
     [java]       At edu.umd.cs.findbugs.FindBugs.runMain(FindBugs.java:402)
     [java]       At edu.umd.cs.findbugs.FindBugs2.main(FindBugs2.java:1200)
     [java]   Exception analyzing org.apache.carbondata.examples.SparkSessionExample$ using
detector edu.umd.cs.findbugs.detect.FindDeadLocalStores
     [java]     java.lang.IllegalArgumentException: Can't push void
     [java]       At edu.umd.cs.findbugs.ba.type.TypeFrameModelingVisitor.pushValue(TypeFrameModelingVisitor.java:241)
     [java]       At edu.umd.cs.findbugs.ba.type.TypeFrameModelingVisitor.visitInvokeInstructionCommon(TypeFrameModelingVisitor.java:726)
     [java]       At edu.umd.cs.findbugs.ba.type.TypeFrameModelingVisitor.visitINVOKEINTERFACE(TypeFrameModelingVisitor.java:438)
     [java]       At org.apache.bcel.generic.INVOKEINTERFACE.accept(INVOKEINTERFACE.java:137)
     [java]       At edu.umd.cs.findbugs.ba.AbstractFrameModelingVisitor.analyzeInstruction(AbstractFrameModelingVisitor.java:84)
     [java]       At edu.umd.cs.findbugs.ba.type.TypeFrameModelingVisitor.analyzeInstruction(TypeFrameModelingVisitor.java:197)
     [java]       At edu.umd.cs.findbugs.ba.type.TypeAnalysis.transferInstruction(TypeAnalysis.java:406)
     [java]       At edu.umd.cs.findbugs.ba.type.TypeAnalysis.transferInstruction(TypeAnalysis.java:86)
     [java]       At edu.umd.cs.findbugs.ba.AbstractDataflowAnalysis.transfer(AbstractDataflowAnalysis.java:135)
     [java]       At edu.umd.cs.findbugs.ba.type.TypeAnalysis.transfer(TypeAnalysis.java:414)
     [java]       At edu.umd.cs.findbugs.ba.type.TypeAnalysis.transfer(TypeAnalysis.java:86)
     [java]       At edu.umd.cs.findbugs.ba.Dataflow.execute(Dataflow.java:376)
     [java]       At edu.umd.cs.findbugs.classfile.engine.bcel.TypeDataflowFactory.analyze(TypeDataflowFactory.java:83)
     [java]       At edu.umd.cs.findbugs.classfile.engine.bcel.TypeDataflowFactory.analyze(TypeDataflowFactory.java:43)
     [java]       At edu.umd.cs.findbugs.classfile.impl.AnalysisCache.analyzeMethod(AnalysisCache.java:369)
     [java]       At edu.umd.cs.findbugs.classfile.impl.AnalysisCache.getMethodAnalysis(AnalysisCache.java:322)
     [java]       At edu.umd.cs.findbugs.classfile.engine.bcel.CFGFactory.analyze(CFGFactory.java:160)
     [java]       At edu.umd.cs.findbugs.classfile.engine.bcel.CFGFactory.analyze(CFGFactory.java:65)
     [java]       At edu.umd.cs.findbugs.classfile.impl.AnalysisCache.analyzeMethod(AnalysisCache.java:369)
     [java]       At edu.umd.cs.findbugs.classfile.impl.AnalysisCache.getMethodAnalysis(AnalysisCache.java:322)
     [java]       At edu.umd.cs.findbugs.ba.ClassContext.getMethodAnalysis(ClassContext.java:1002)
     [java]       At edu.umd.cs.findbugs.ba.ClassContext.getMethodAnalysisNoDataflowAnalysisException(ClassContext.java:987)
     [java]       At edu.umd.cs.findbugs.ba.ClassContext.getCFG(ClassContext.java:303)
     [java]       At edu.umd.cs.findbugs.detect.BuildUnconditionalParamDerefDatabase.analyzeMethod(BuildUnconditionalParamDerefDatabase.java:115)
     [java]       At edu.umd.cs.findbugs.detect.BuildUnconditionalParamDerefDatabase.considerMethod(BuildUnconditionalParamDerefDatabase.java:107)
     [java]       At edu.umd.cs.findbugs.detect.BuildUnconditionalParamDerefDatabase.visitClassContext(BuildUnconditionalParamDerefDatabase.java:91)
     [java]       At edu.umd.cs.findbugs.DetectorToDetector2Adapter.visitClass(DetectorToDetector2Adapter.java:76)
     [java]       At edu.umd.cs.findbugs.FindBugs2.analyzeApplication(FindBugs2.java:1089)
     [java]       At edu.umd.cs.findbugs.FindBugs2.execute(FindBugs2.java:283)
     [java]       At edu.umd.cs.findbugs.FindBugs.runMain(FindBugs.java:402)
     [java]       At edu.umd.cs.findbugs.FindBugs2.main(FindBugs2.java:1200)
     [java]   Exception analyzing org.apache.carbondata.examples.SparkSessionExample$ using
detector edu.umd.cs.findbugs.detect.FindBadCast2
     [java]     java.lang.IllegalArgumentException: Can't push void
     [java]       At edu.umd.cs.findbugs.ba.type.TypeFrameModelingVisitor.pushValue(TypeFrameModelingVisitor.java:241)
     [java]       At edu.umd.cs.findbugs.ba.type.TypeFrameModelingVisitor.visitInvokeInstructionCommon(TypeFrameModelingVisitor.java:726)
     [java]       At edu.umd.cs.findbugs.ba.type.TypeFrameModelingVisitor.visitINVOKEINTERFACE(TypeFrameModelingVisitor.java:438)
     [java]       At org.apache.bcel.generic.INVOKEINTERFACE.accept(INVOKEINTERFACE.java:137)
     [java]       At edu.umd.cs.findbugs.ba.AbstractFrameModelingVisitor.analyzeInstruction(AbstractFrameModelingVisitor.java:84)
     [java]       At edu.umd.cs.findbugs.ba.type.TypeFrameModelingVisitor.analyzeInstruction(TypeFrameModelingVisitor.java:197)
     [java]       At edu.umd.cs.findbugs.ba.type.TypeAnalysis.transferInstruction(TypeAnalysis.java:406)
     [java]       At edu.umd.cs.findbugs.ba.type.TypeAnalysis.transferInstruction(TypeAnalysis.java:86)
     [java]       At edu.umd.cs.findbugs.ba.AbstractDataflowAnalysis.transfer(AbstractDataflowAnalysis.java:135)
     [java]       At edu.umd.cs.findbugs.ba.type.TypeAnalysis.transfer(TypeAnalysis.java:414)
     [java]       At edu.umd.cs.findbugs.ba.type.TypeAnalysis.transfer(TypeAnalysis.java:86)
     [java]       At edu.umd.cs.findbugs.ba.Dataflow.execute(Dataflow.java:376)
     [java]       At edu.umd.cs.findbugs.classfile.engine.bcel.TypeDataflowFactory.analyze(TypeDataflowFactory.java:83)
     [java]       At edu.umd.cs.findbugs.classfile.engine.bcel.TypeDataflowFactory.analyze(TypeDataflowFactory.java:43)
     [java]       At edu.umd.cs.findbugs.classfile.impl.AnalysisCache.analyzeMethod(AnalysisCache.java:369)
     [java]       At edu.umd.cs.findbugs.classfile.impl.AnalysisCache.getMethodAnalysis(AnalysisCache.java:322)
     [java]       At edu.umd.cs.findbugs.classfile.engine.bcel.CFGFactory.analyze(CFGFactory.java:160)
     [java]       At edu.umd.cs.findbugs.classfile.engine.bcel.CFGFactory.analyze(CFGFactory.java:65)
     [java]       At edu.umd.cs.findbugs.classfile.impl.AnalysisCache.analyzeMethod(AnalysisCache.java:369)
     [java]       At edu.umd.cs.findbugs.classfile.impl.AnalysisCache.getMethodAnalysis(AnalysisCache.java:322)
     [java]       At edu.umd.cs.findbugs.ba.ClassContext.getMethodAnalysis(ClassContext.java:1002)
     [java]       At edu.umd.cs.findbugs.ba.ClassContext.getMethodAnalysisNoDataflowAnalysisException(ClassContext.java:987)
     [java]       At edu.umd.cs.findbugs.ba.ClassContext.getCFG(ClassContext.java:303)
     [java]       At edu.umd.cs.findbugs.detect.BuildUnconditionalParamDerefDatabase.analyzeMethod(BuildUnconditionalParamDerefDatabase.java:115)
     [java]       At edu.umd.cs.findbugs.detect.BuildUnconditionalParamDerefDatabase.considerMethod(BuildUnconditionalParamDerefDatabase.java:107)
     [java]       At edu.umd.cs.findbugs.detect.BuildUnconditionalParamDerefDatabase.visitClassContext(BuildUnconditionalParamDerefDatabase.java:91)
     [java]       At edu.umd.cs.findbugs.DetectorToDetector2Adapter.visitClass(DetectorToDetector2Adapter.java:76)
     [java]       At edu.umd.cs.findbugs.FindBugs2.analyzeApplication(FindBugs2.java:1089)
     [java]       At edu.umd.cs.findbugs.FindBugs2.execute(FindBugs2.java:283)
     [java]       At edu.umd.cs.findbugs.FindBugs.runMain(FindBugs.java:402)
     [java]       At edu.umd.cs.findbugs.FindBugs2.main(FindBugs2.java:1200)
     [java]   Failure examining basic blocks in Duplicate Branches detector
     [java]     java.lang.IllegalArgumentException: Can't push void
     [java]       At edu.umd.cs.findbugs.ba.type.TypeFrameModelingVisitor.pushValue(TypeFrameModelingVisitor.java:241)
     [java]       At edu.umd.cs.findbugs.ba.type.TypeFrameModelingVisitor.visitInvokeInstructionCommon(TypeFrameModelingVisitor.java:726)
     [java]       At edu.umd.cs.findbugs.ba.type.TypeFrameModelingVisitor.visitINVOKEINTERFACE(TypeFrameModelingVisitor.java:438)
     [java]       At org.apache.bcel.generic.INVOKEINTERFACE.accept(INVOKEINTERFACE.java:137)
     [java]       At edu.umd.cs.findbugs.ba.AbstractFrameModelingVisitor.analyzeInstruction(AbstractFrameModelingVisitor.java:84)
     [java]       At edu.umd.cs.findbugs.ba.type.TypeFrameModelingVisitor.analyzeInstruction(TypeFrameModelingVisitor.java:197)
     [java]       At edu.umd.cs.findbugs.ba.type.TypeAnalysis.transferInstruction(TypeAnalysis.java:406)
     [java]       At edu.umd.cs.findbugs.ba.type.TypeAnalysis.transferInstruction(TypeAnalysis.java:86)
     [java]       At edu.umd.cs.findbugs.ba.AbstractDataflowAnalysis.transfer(AbstractDataflowAnalysis.java:135)
     [java]       At edu.umd.cs.findbugs.ba.type.TypeAnalysis.transfer(TypeAnalysis.java:414)
     [java]       At edu.umd.cs.findbugs.ba.type.TypeAnalysis.transfer(TypeAnalysis.java:86)
     [java]       At edu.umd.cs.findbugs.ba.Dataflow.execute(Dataflow.java:376)
     [java]       At edu.umd.cs.findbugs.classfile.engine.bcel.TypeDataflowFactory.analyze(TypeDataflowFactory.java:83)
     [java]       At edu.umd.cs.findbugs.classfile.engine.bcel.TypeDataflowFactory.analyze(TypeDataflowFactory.java:43)
     [java]       At edu.umd.cs.findbugs.classfile.impl.AnalysisCache.analyzeMethod(AnalysisCache.java:369)
     [java]       At edu.umd.cs.findbugs.classfile.impl.AnalysisCache.getMethodAnalysis(AnalysisCache.java:322)
     [java]       At edu.umd.cs.findbugs.classfile.engine.bcel.CFGFactory.analyze(CFGFactory.java:160)
     [java]       At edu.umd.cs.findbugs.classfile.engine.bcel.CFGFactory.analyze(CFGFactory.java:65)
     [java]       At edu.umd.cs.findbugs.classfile.impl.AnalysisCache.analyzeMethod(AnalysisCache.java:369)
     [java]       At edu.umd.cs.findbugs.classfile.impl.AnalysisCache.getMethodAnalysis(AnalysisCache.java:322)
     [java]       At edu.umd.cs.findbugs.ba.ClassContext.getMethodAnalysis(ClassContext.java:1002)
     [java]       At edu.umd.cs.findbugs.ba.ClassContext.getMethodAnalysisNoDataflowAnalysisException(ClassContext.java:987)
     [java]       At edu.umd.cs.findbugs.ba.ClassContext.getCFG(ClassContext.java:303)
     [java]       At edu.umd.cs.findbugs.detect.BuildUnconditionalParamDerefDatabase.analyzeMethod(BuildUnconditionalParamDerefDatabase.java:115)
     [java]       At edu.umd.cs.findbugs.detect.BuildUnconditionalParamDerefDatabase.considerMethod(BuildUnconditionalParamDerefDatabase.java:107)
     [java]       At edu.umd.cs.findbugs.detect.BuildUnconditionalParamDerefDatabase.visitClassContext(BuildUnconditionalParamDerefDatabase.java:91)
     [java]       At edu.umd.cs.findbugs.DetectorToDetector2Adapter.visitClass(DetectorToDetector2Adapter.java:76)
     [java]       At edu.umd.cs.findbugs.FindBugs2.analyzeApplication(FindBugs2.java:1089)
     [java]       At edu.umd.cs.findbugs.FindBugs2.execute(FindBugs2.java:283)
     [java]       At edu.umd.cs.findbugs.FindBugs.runMain(FindBugs.java:402)
     [java]       At edu.umd.cs.findbugs.FindBugs2.main(FindBugs2.java:1200)
     [java]   Exception analyzing org.apache.carbondata.examples.SparkSessionExample$ using
detector edu.umd.cs.findbugs.detect.FindUnrelatedTypesInGenericContainer
     [java]     java.lang.IllegalArgumentException: Can't push void
     [java]       At edu.umd.cs.findbugs.ba.type.TypeFrameModelingVisitor.pushValue(TypeFrameModelingVisitor.java:241)
     [java]       At edu.umd.cs.findbugs.ba.type.TypeFrameModelingVisitor.visitInvokeInstructionCommon(TypeFrameModelingVisitor.java:726)
     [java]       At edu.umd.cs.findbugs.ba.type.TypeFrameModelingVisitor.visitINVOKEINTERFACE(TypeFrameModelingVisitor.java:438)
     [java]       At org.apache.bcel.generic.INVOKEINTERFACE.accept(INVOKEINTERFACE.java:137)
     [java]       At edu.umd.cs.findbugs.ba.AbstractFrameModelingVisitor.analyzeInstruction(AbstractFrameModelingVisitor.java:84)
     [java]       At edu.umd.cs.findbugs.ba.type.TypeFrameModelingVisitor.analyzeInstruction(TypeFrameModelingVisitor.java:197)
     [java]       At edu.umd.cs.findbugs.ba.type.TypeAnalysis.transferInstruction(TypeAnalysis.java:406)
     [java]       At edu.umd.cs.findbugs.ba.type.TypeAnalysis.transferInstruction(TypeAnalysis.java:86)
     [java]       At edu.umd.cs.findbugs.ba.AbstractDataflowAnalysis.transfer(AbstractDataflowAnalysis.java:135)
     [java]       At edu.umd.cs.findbugs.ba.type.TypeAnalysis.transfer(TypeAnalysis.java:414)
     [java]       At edu.umd.cs.findbugs.ba.type.TypeAnalysis.transfer(TypeAnalysis.java:86)
     [java]       At edu.umd.cs.findbugs.ba.Dataflow.execute(Dataflow.java:376)
     [java]       At edu.umd.cs.findbugs.classfile.engine.bcel.TypeDataflowFactory.analyze(TypeDataflowFactory.java:83)
     [java]       At edu.umd.cs.findbugs.classfile.engine.bcel.TypeDataflowFactory.analyze(TypeDataflowFactory.java:43)
     [java]       At edu.umd.cs.findbugs.classfile.impl.AnalysisCache.analyzeMethod(AnalysisCache.java:369)
     [java]       At edu.umd.cs.findbugs.classfile.impl.AnalysisCache.getMethodAnalysis(AnalysisCache.java:322)
     [java]       At edu.umd.cs.findbugs.classfile.engine.bcel.CFGFactory.analyze(CFGFactory.java:160)
     [java]       At edu.umd.cs.findbugs.classfile.engine.bcel.CFGFactory.analyze(CFGFactory.java:65)
     [java]       At edu.umd.cs.findbugs.classfile.impl.AnalysisCache.analyzeMethod(AnalysisCache.java:369)
     [java]       At edu.umd.cs.findbugs.classfile.impl.AnalysisCache.getMethodAnalysis(AnalysisCache.java:322)
     [java]       At edu.umd.cs.findbugs.ba.ClassContext.getMethodAnalysis(ClassContext.java:1002)
     [java]       At edu.umd.cs.findbugs.ba.ClassContext.getMethodAnalysisNoDataflowAnalysisException(ClassContext.java:987)
     [java]       At edu.umd.cs.findbugs.ba.ClassContext.getCFG(ClassContext.java:303)
     [java]       At edu.umd.cs.findbugs.detect.BuildUnconditionalParamDerefDatabase.analyzeMethod(BuildUnconditionalParamDerefDatabase.java:115)
     [java]       At edu.umd.cs.findbugs.detect.BuildUnconditionalParamDerefDatabase.considerMethod(BuildUnconditionalParamDerefDatabase.java:107)
     [java]       At edu.umd.cs.findbugs.detect.BuildUnconditionalParamDerefDatabase.visitClassContext(BuildUnconditionalParamDerefDatabase.java:91)
     [java]       At edu.umd.cs.findbugs.DetectorToDetector2Adapter.visitClass(DetectorToDetector2Adapter.java:76)
     [java]       At edu.umd.cs.findbugs.FindBugs2.analyzeApplication(FindBugs2.java:1089)
     [java]       At edu.umd.cs.findbugs.FindBugs2.execute(FindBugs2.java:283)
     [java]       At edu.umd.cs.findbugs.FindBugs.runMain(FindBugs.java:402)
     [java]       At edu.umd.cs.findbugs.FindBugs2.main(FindBugs2.java:1200)
[INFO] Done FindBugs Analysis....
[INFO] 
[INFO] <<< findbugs-maven-plugin:3.0.4:check (analyze-compile) < :findbugs @ carbondata-examples-spark2
<<<
[INFO] 
[INFO] --- findbugs-maven-plugin:3.0.4:check (analyze-compile) @ carbondata-examples-spark2
---
[INFO] BugInstance size is 0
[INFO] Error size is 14
[INFO] No errors/warnings found
[INFO] 
[INFO] --- maven-scala-plugin:2.15.2:compile (compile) @ carbondata-examples-spark2 ---
[INFO] Checking for multiple versions of scala
[INFO] includes = [**/*.java,**/*.scala,]
[INFO] excludes = []
[INFO] Nothing to compile - all classes are up to date
[INFO] 
[INFO] --- maven-resources-plugin:2.7:testResources (default-testResources) @ carbondata-examples-spark2
---
[INFO] Using 'UTF-8' encoding to copy filtered resources.
[INFO] skip non existing resourceDirectory <https://builds.apache.org/job/carbondata-master-spark-2.1/ws/examples/spark2/src/test/resources>
[INFO] Copying 3 resources
[INFO] 
[INFO] --- maven-compiler-plugin:3.2:testCompile (default-testCompile) @ carbondata-examples-spark2
---
[INFO] No sources to compile
[INFO] 
[INFO] --- maven-surefire-plugin:2.18.1:test (default-test) @ carbondata-examples-spark2 ---
[JENKINS] Recording test results
[INFO] 
[INFO] --- maven-jar-plugin:2.5:jar (default-jar) @ carbondata-examples-spark2 ---
[INFO] Building jar: <https://builds.apache.org/job/carbondata-master-spark-2.1/ws/examples/spark2/target/carbondata-examples-spark2-1.3.0-SNAPSHOT.jar>
[INFO] 
[INFO] --- maven-site-plugin:3.4:attach-descriptor (attach-descriptor) @ carbondata-examples-spark2
---
[INFO] 
[INFO] --- jacoco-maven-plugin:0.7.9:prepare-agent-integration (default-prepare-agent-integration)
@ carbondata-examples-spark2 ---
[INFO] argLine set to -javaagent:/home/jenkins/jenkins-slave/maven-repositories/0/org/jacoco/org.jacoco.agent/0.7.9/org.jacoco.agent-0.7.9-runtime.jar=destfile=<https://builds.apache.org/job/carbondata-master-spark-2.1/ws/examples/spark2/target/jacoco-it.exec>
[INFO] 
[INFO] --- maven-checkstyle-plugin:2.17:check (default) @ carbondata-examples-spark2 ---
[INFO] Starting audit...
Audit done.
[INFO] 
[INFO] --- scalastyle-maven-plugin:0.8.0:check (default) @ carbondata-examples-spark2 ---
Saving to outputFile=<https://builds.apache.org/job/carbondata-master-spark-2.1/ws/examples/spark2/target/scalastyle-output.xml>
Processed 19 file(s)
Found 0 errors
Found 0 warnings
Found 0 infos
Finished in 348 ms
[INFO] 
[INFO] --- jacoco-maven-plugin:0.7.9:report (default-report) @ carbondata-examples-spark2
---
[INFO] Skipping JaCoCo execution due to missing execution data file.
[INFO] 
[INFO] --- jacoco-maven-plugin:0.7.9:report-integration (default-report-integration) @ carbondata-examples-spark2
---
[INFO] Skipping JaCoCo execution due to missing execution data file.
[INFO] 
[INFO] --- jacoco-maven-plugin:0.7.9:check (default-check) @ carbondata-examples-spark2 ---
[INFO] Skipping JaCoCo execution due to missing execution data <https://builds.apache.org/job/carbondata-master-spark-2.1/ws/examples/spark2/target/jacoco.exec>
[INFO] 
[INFO] --- maven-install-plugin:2.5.2:install (default-install) @ carbondata-examples-spark2
---
[INFO] Installing <https://builds.apache.org/job/carbondata-master-spark-2.1/ws/examples/spark2/target/carbondata-examples-spark2-1.3.0-SNAPSHOT.jar>
to /home/jenkins/jenkins-slave/maven-repositories/0/org/apache/carbondata/carbondata-examples-spark2/1.3.0-SNAPSHOT/carbondata-examples-spark2-1.3.0-SNAPSHOT.jar
[INFO] Installing <https://builds.apache.org/job/carbondata-master-spark-2.1/ws/examples/spark2/pom.xml>
to /home/jenkins/jenkins-slave/maven-repositories/0/org/apache/carbondata/carbondata-examples-spark2/1.3.0-SNAPSHOT/carbondata-examples-spark2-1.3.0-SNAPSHOT.pom
[INFO] ------------------------------------------------------------------------
[INFO] Reactor Summary:
[INFO] 
[INFO] Apache CarbonData :: Parent ........................ SUCCESS [ 17.328 s]
[INFO] Apache CarbonData :: Common ........................ SUCCESS [ 20.956 s]
[INFO] Apache CarbonData :: Core .......................... SUCCESS [03:53 min]
[INFO] Apache CarbonData :: Processing .................... SUCCESS [ 49.633 s]
[INFO] Apache CarbonData :: Hadoop ........................ SUCCESS [ 36.470 s]
[INFO] Apache CarbonData :: Spark Common .................. SUCCESS [01:17 min]
[INFO] Apache CarbonData :: Streaming ..................... SUCCESS [ 33.967 s]
[INFO] Apache CarbonData :: Spark2 ........................ SUCCESS [16:42 min]
[INFO] Apache CarbonData :: Spark Common Test ............. SUCCESS [27:06 min]
[INFO] Apache CarbonData :: Assembly ...................... SUCCESS [ 12.744 s]
[INFO] Apache CarbonData :: Hive .......................... SUCCESS [ 46.444 s]
[INFO] Apache CarbonData :: presto ........................ SUCCESS [01:18 min]
[INFO] Apache CarbonData :: Spark2 Examples ............... SUCCESS [ 49.311 s]
[INFO] ------------------------------------------------------------------------
[INFO] BUILD SUCCESS
[INFO] ------------------------------------------------------------------------
[INFO] Total time: 01:08 h
[INFO] Finished at: 2017-12-23T15:17:25+00:00
[INFO] Final Memory: 161M/1401M
[INFO] ------------------------------------------------------------------------
Waiting for Jenkins to finish collecting data
[JENKINS] Archiving <https://builds.apache.org/job/carbondata-master-spark-2.1/ws/processing/pom.xml>
to org.apache.carbondata/carbondata-processing/1.3.0-SNAPSHOT/carbondata-processing-1.3.0-SNAPSHOT.pom
[JENKINS] Archiving <https://builds.apache.org/job/carbondata-master-spark-2.1/ws/processing/target/carbondata-processing-1.3.0-SNAPSHOT.jar>
to org.apache.carbondata/carbondata-processing/1.3.0-SNAPSHOT/carbondata-processing-1.3.0-SNAPSHOT.jar
[JENKINS] Archiving <https://builds.apache.org/job/carbondata-master-spark-2.1/ws/streaming/pom.xml>
to org.apache.carbondata/carbondata-streaming/1.3.0-SNAPSHOT/carbondata-streaming-1.3.0-SNAPSHOT.pom
[JENKINS] Archiving <https://builds.apache.org/job/carbondata-master-spark-2.1/ws/streaming/target/carbondata-streaming-1.3.0-SNAPSHOT.jar>
to org.apache.carbondata/carbondata-streaming/1.3.0-SNAPSHOT/carbondata-streaming-1.3.0-SNAPSHOT.jar
[JENKINS] Archiving <https://builds.apache.org/job/carbondata-master-spark-2.1/ws/integration/spark-common/pom.xml>
to org.apache.carbondata/carbondata-spark-common/1.3.0-SNAPSHOT/carbondata-spark-common-1.3.0-SNAPSHOT.pom
[JENKINS] Archiving <https://builds.apache.org/job/carbondata-master-spark-2.1/ws/integration/spark-common/target/carbondata-spark-common-1.3.0-SNAPSHOT.jar>
to org.apache.carbondata/carbondata-spark-common/1.3.0-SNAPSHOT/carbondata-spark-common-1.3.0-SNAPSHOT.jar
[JENKINS] Archiving <https://builds.apache.org/job/carbondata-master-spark-2.1/ws/integration/hive/pom.xml>
to org.apache.carbondata/carbondata-hive/1.3.0-SNAPSHOT/carbondata-hive-1.3.0-SNAPSHOT.pom
[JENKINS] Archiving <https://builds.apache.org/job/carbondata-master-spark-2.1/ws/integration/hive/target/carbondata-hive-1.3.0-SNAPSHOT.jar>
to org.apache.carbondata/carbondata-hive/1.3.0-SNAPSHOT/carbondata-hive-1.3.0-SNAPSHOT.jar
[JENKINS] Archiving <https://builds.apache.org/job/carbondata-master-spark-2.1/ws/common/pom.xml>
to org.apache.carbondata/carbondata-common/1.3.0-SNAPSHOT/carbondata-common-1.3.0-SNAPSHOT.pom
[JENKINS] Archiving <https://builds.apache.org/job/carbondata-master-spark-2.1/ws/common/target/carbondata-common-1.3.0-SNAPSHOT.jar>
to org.apache.carbondata/carbondata-common/1.3.0-SNAPSHOT/carbondata-common-1.3.0-SNAPSHOT.jar
[JENKINS] Archiving <https://builds.apache.org/job/carbondata-master-spark-2.1/ws/examples/spark2/pom.xml>
to org.apache.carbondata/carbondata-examples-spark2/1.3.0-SNAPSHOT/carbondata-examples-spark2-1.3.0-SNAPSHOT.pom
[JENKINS] Archiving <https://builds.apache.org/job/carbondata-master-spark-2.1/ws/examples/spark2/target/carbondata-examples-spark2-1.3.0-SNAPSHOT.jar>
to org.apache.carbondata/carbondata-examples-spark2/1.3.0-SNAPSHOT/carbondata-examples-spark2-1.3.0-SNAPSHOT.jar
[JENKINS] Archiving <https://builds.apache.org/job/carbondata-master-spark-2.1/ws/integration/spark2/pom.xml>
to org.apache.carbondata/carbondata-spark2/1.3.0-SNAPSHOT/carbondata-spark2-1.3.0-SNAPSHOT.pom
[JENKINS] Archiving <https://builds.apache.org/job/carbondata-master-spark-2.1/ws/integration/spark2/target/carbondata-spark2-1.3.0-SNAPSHOT.jar>
to org.apache.carbondata/carbondata-spark2/1.3.0-SNAPSHOT/carbondata-spark2-1.3.0-SNAPSHOT.jar
[JENKINS] Archiving <https://builds.apache.org/job/carbondata-master-spark-2.1/ws/assembly/pom.xml>
to org.apache.carbondata/carbondata-assembly/1.3.0-SNAPSHOT/carbondata-assembly-1.3.0-SNAPSHOT.pom
[JENKINS] Archiving <https://builds.apache.org/job/carbondata-master-spark-2.1/ws/pom.xml>
to org.apache.carbondata/carbondata-parent/1.3.0-SNAPSHOT/carbondata-parent-1.3.0-SNAPSHOT.pom
[JENKINS] Archiving <https://builds.apache.org/job/carbondata-master-spark-2.1/ws/core/pom.xml>
to org.apache.carbondata/carbondata-core/1.3.0-SNAPSHOT/carbondata-core-1.3.0-SNAPSHOT.pom
[JENKINS] Archiving <https://builds.apache.org/job/carbondata-master-spark-2.1/ws/core/target/carbondata-core-1.3.0-SNAPSHOT.jar>
to org.apache.carbondata/carbondata-core/1.3.0-SNAPSHOT/carbondata-core-1.3.0-SNAPSHOT.jar
[JENKINS] Archiving <https://builds.apache.org/job/carbondata-master-spark-2.1/ws/hadoop/pom.xml>
to org.apache.carbondata/carbondata-hadoop/1.3.0-SNAPSHOT/carbondata-hadoop-1.3.0-SNAPSHOT.pom
[JENKINS] Archiving <https://builds.apache.org/job/carbondata-master-spark-2.1/ws/hadoop/target/carbondata-hadoop-1.3.0-SNAPSHOT.jar>
to org.apache.carbondata/carbondata-hadoop/1.3.0-SNAPSHOT/carbondata-hadoop-1.3.0-SNAPSHOT.jar
[JENKINS] Archiving <https://builds.apache.org/job/carbondata-master-spark-2.1/ws/integration/presto/pom.xml>
to org.apache.carbondata/carbondata-presto/1.3.0-SNAPSHOT/carbondata-presto-1.3.0-SNAPSHOT.pom
[JENKINS] Archiving <https://builds.apache.org/job/carbondata-master-spark-2.1/ws/integration/presto/target/carbondata-presto-1.3.0-SNAPSHOT.zip>
to org.apache.carbondata/carbondata-presto/1.3.0-SNAPSHOT/carbondata-presto-1.3.0-SNAPSHOT.zip
[JENKINS] Archiving <https://builds.apache.org/job/carbondata-master-spark-2.1/ws/integration/presto/target/carbondata-presto-1.3.0-SNAPSHOT.jar>
to org.apache.carbondata/carbondata-presto/1.3.0-SNAPSHOT/carbondata-presto-1.3.0-SNAPSHOT.jar
[Fast Archiver] Compressed 66.14 MB of artifacts by 94.8% relative to #1802
[JENKINS] Archiving <https://builds.apache.org/job/carbondata-master-spark-2.1/ws/integration/spark-common-test/pom.xml>
to org.apache.carbondata/carbondata-spark-common-test/1.3.0-SNAPSHOT/carbondata-spark-common-test-1.3.0-SNAPSHOT.pom
[JENKINS] Archiving <https://builds.apache.org/job/carbondata-master-spark-2.1/ws/integration/spark-common-test/target/carbondata-spark-common-test-1.3.0-SNAPSHOT.jar>
to org.apache.carbondata/carbondata-spark-common-test/1.3.0-SNAPSHOT/carbondata-spark-common-test-1.3.0-SNAPSHOT.jar
channel stopped
Not sending mail to unregistered user jacky.likun@huawei.com

Mime
View raw message