carbondata-commits mailing list archives

Site index · List index
Message view « Date » · « Thread »
Top « Date » · « Thread »
From Apache Jenkins Server <jenk...@builds.apache.org>
Subject Build failed in Jenkins: carbondata-master-spark-2.1 #2132
Date Mon, 12 Mar 2018 07:52:05 GMT
See <https://builds.apache.org/job/carbondata-master-spark-2.1/2132/display/redirect>

------------------------------------------
[...truncated 1.51 MB...]
18/03/12 00:51:08 AUDIT CarbonDataRDDFactory$: [asf927.gq1.ygridcore.net][jenkins][Thread-1]Data
load is successful for default.dropcolumntest
18/03/12 00:51:08 AUDIT CacheProvider: [asf927.gq1.ygridcore.net][jenkins][Thread-1]The key
carbon.input.segments.default.carbon_table_multi_thread with value 1,2,3 added in the session
param
18/03/12 00:51:08 AUDIT CarbonAlterTableCompactionCommand: [asf927.gq1.ygridcore.net][jenkins][Thread-1]Compaction
request received for table default.dropcolumntest
18/03/12 00:51:08 AUDIT CarbonTableCompactor: [asf927.gq1.ygridcore.net][jenkins][Thread-1]Compaction
request completed for table default.dropcolumntest
18/03/12 00:51:08 AUDIT CacheProvider: [asf927.gq1.ygridcore.net][jenkins][Thread-1]The key
carbon.input.segments.default.carbon_table_multi_thread with value 1,2,3 added in the session
param
18/03/12 00:51:08 AUDIT CacheProvider: [asf927.gq1.ygridcore.net][jenkins][Thread-1]The key
carbon.input.segments.default.carbon_table_multi_thread with value 1,2,3 added in the session
param
18/03/12 00:51:08 AUDIT CacheProvider: [asf927.gq1.ygridcore.net][jenkins][Thread-1]The key
carbon.input.segments.default.carbon_table_multi_thread with value 1,2,3 added in the session
param
18/03/12 00:51:08 AUDIT CacheProvider: [asf927.gq1.ygridcore.net][jenkins][Thread-1]The key
carbon.input.segments.default.carbon_table_multi_thread with value 1,2,3 added in the session
param
18/03/12 00:51:08 AUDIT CarbonDropTableCommand: [asf927.gq1.ygridcore.net][jenkins][Thread-1]Deleting
table [dropcolumntest] under database [default]
18/03/12 00:51:08 AUDIT CarbonDropTableCommand: [asf927.gq1.ygridcore.net][jenkins][Thread-1]Deleted
table [dropcolumntest] under database [default]
18/03/12 00:51:08 AUDIT CacheProvider: [asf927.gq1.ygridcore.net][jenkins][Thread-1]The key
carbon.input.segments.default.carbon_table_multi_thread with value 1,2,3 added in the session
param
18/03/12 00:51:09 AUDIT CacheProvider: [asf927.gq1.ygridcore.net][jenkins][Thread-1]The key
carbon.input.segments.default.carbon_table_multi_thread with value 1,2,3 added in the session
param
18/03/12 00:51:09 AUDIT CacheProvider: [asf927.gq1.ygridcore.net][jenkins][Thread-1]The key
carbon.input.segments.default.carbon_table_multi_thread with value 1,2,3 added in the session
param
18/03/12 00:51:09 AUDIT CacheProvider: [asf927.gq1.ygridcore.net][jenkins][Thread-1]The key
carbon.input.segments.default.carbon_table_multi_thread with value 1,2,3 added in the session
param
18/03/12 00:51:09 AUDIT CarbonCreateTableCommand: [asf927.gq1.ygridcore.net][jenkins][Thread-1]Creating
Table with Database name [default] and Table name [dropcolumntest]
18/03/12 00:51:09 AUDIT CacheProvider: [asf927.gq1.ygridcore.net][jenkins][Thread-1]The key
carbon.input.segments.default.carbon_table_multi_thread with value 1,2,3 added in the session
param
18/03/12 00:51:09 AUDIT CacheProvider: [asf927.gq1.ygridcore.net][jenkins][Thread-1]The key
carbon.input.segments.default.carbon_table_multi_thread with value 1,2,3 added in the session
param
18/03/12 00:51:09 AUDIT CarbonCreateTableCommand: [asf927.gq1.ygridcore.net][jenkins][Thread-1]Table
created with Database name [default] and Table name [dropcolumntest]
18/03/12 00:51:09 AUDIT CacheProvider: [asf927.gq1.ygridcore.net][jenkins][Thread-1]The key
carbon.input.segments.default.carbon_table_multi_thread with value 1,2,3 added in the session
param
18/03/12 00:51:09 AUDIT CacheProvider: [asf927.gq1.ygridcore.net][jenkins][Thread-1]The key
carbon.input.segments.default.carbon_table_multi_thread with value 1,2,3 added in the session
param
18/03/12 00:51:09 AUDIT CarbonDataRDDFactory$: [asf927.gq1.ygridcore.net][jenkins][Thread-1]Data
load request has been received for table default.dropcolumntest
18/03/12 00:51:09 AUDIT CarbonDataRDDFactory$: [asf927.gq1.ygridcore.net][jenkins][Thread-1]Data
load is successful for default.dropcolumntest
18/03/12 00:51:09 AUDIT CacheProvider: [asf927.gq1.ygridcore.net][jenkins][Thread-1]The key
carbon.input.segments.default.carbon_table_multi_thread with value 1,2,3 added in the session
param
18/03/12 00:51:09 AUDIT CarbonAlterTableDropColumnCommand: [asf927.gq1.ygridcore.net][jenkins][Thread-1]Alter
table drop columns request has been received for default.dropcolumntest
18/03/12 00:51:09 AUDIT CacheProvider: [asf927.gq1.ygridcore.net][jenkins][Thread-1]The key
carbon.input.segments.default.carbon_table_multi_thread with value 1,2,3 added in the session
param
18/03/12 00:51:09 AUDIT CacheProvider: [asf927.gq1.ygridcore.net][jenkins][Thread-1]The key
carbon.input.segments.default.carbon_table_multi_thread with value 1,2,3 added in the session
param
18/03/12 00:51:09 AUDIT CarbonAlterTableDropColumnCommand: [asf927.gq1.ygridcore.net][jenkins][Thread-1]Alter
table for drop columns is successful for table default.dropcolumntest
18/03/12 00:51:09 AUDIT CacheProvider: [asf927.gq1.ygridcore.net][jenkins][Thread-1]The key
carbon.input.segments.default.carbon_table_multi_thread with value 1,2,3 added in the session
param
18/03/12 00:51:09 AUDIT CarbonDataRDDFactory$: [asf927.gq1.ygridcore.net][jenkins][Thread-1]Data
load request has been received for table default.dropcolumntest
18/03/12 00:51:09 ERROR DataLoadExecutor: [Executor task launch worker-1][partitionID:dropcolumntest;queryID:7076126396990263]
Data Load is partially success for table dropcolumntest
18/03/12 00:51:09 AUDIT CarbonDataRDDFactory$: [asf927.gq1.ygridcore.net][jenkins][Thread-1]Data
load is successful for default.dropcolumntest
18/03/12 00:51:09 AUDIT CacheProvider: [asf927.gq1.ygridcore.net][jenkins][Thread-1]The key
carbon.input.segments.default.carbon_table_multi_thread with value 1,2,3 added in the session
param
18/03/12 00:51:09 AUDIT CarbonAlterTableCompactionCommand: [asf927.gq1.ygridcore.net][jenkins][Thread-1]Compaction
request received for table default.dropcolumntest
18/03/12 00:51:09 AUDIT CarbonTableCompactor: [asf927.gq1.ygridcore.net][jenkins][Thread-1]Compaction
request completed for table default.dropcolumntest
18/03/12 00:51:09 AUDIT CacheProvider: [asf927.gq1.ygridcore.net][jenkins][Thread-1]The key
carbon.input.segments.default.carbon_table_multi_thread with value 1,2,3 added in the session
param
18/03/12 00:51:09 AUDIT CacheProvider: [asf927.gq1.ygridcore.net][jenkins][Thread-1]The key
carbon.input.segments.default.carbon_table_multi_thread with value 1,2,3 added in the session
param
18/03/12 00:51:09 AUDIT CacheProvider: [asf927.gq1.ygridcore.net][jenkins][Thread-1]The key
carbon.input.segments.default.carbon_table_multi_thread with value 1,2,3 added in the session
param
18/03/12 00:51:09 AUDIT CacheProvider: [asf927.gq1.ygridcore.net][jenkins][Thread-1]The key
carbon.input.segments.default.carbon_table_multi_thread with value 1,2,3 added in the session
param
18/03/12 00:51:09 AUDIT CarbonDropTableCommand: [asf927.gq1.ygridcore.net][jenkins][Thread-1]Deleting
table [dropcolumntest] under database [default]
18/03/12 00:51:09 AUDIT CarbonDropTableCommand: [asf927.gq1.ygridcore.net][jenkins][Thread-1]Deleted
table [dropcolumntest] under database [default]
18/03/12 00:51:09 AUDIT CacheProvider: [asf927.gq1.ygridcore.net][jenkins][Thread-1]The key
carbon.input.segments.default.carbon_table_multi_thread with value 1,2,3 added in the session
param
- test drop column and compaction
18/03/12 00:51:09 AUDIT CacheProvider: [asf927.gq1.ygridcore.net][jenkins][Thread-1]The key
carbon.input.segments.default.carbon_table_multi_thread with value 1,2,3 added in the session
param
18/03/12 00:51:09 AUDIT CacheProvider: [asf927.gq1.ygridcore.net][jenkins][Thread-1]The key
carbon.input.segments.default.carbon_table_multi_thread with value 1,2,3 added in the session
param
18/03/12 00:51:09 AUDIT CacheProvider: [asf927.gq1.ygridcore.net][jenkins][Thread-1]The key
carbon.input.segments.default.carbon_table_multi_thread with value 1,2,3 added in the session
param
18/03/12 00:51:09 AUDIT CarbonCreateTableCommand: [asf927.gq1.ygridcore.net][jenkins][Thread-1]Creating
Table with Database name [default] and Table name [preaggmain]
18/03/12 00:51:09 AUDIT CacheProvider: [asf927.gq1.ygridcore.net][jenkins][Thread-1]The key
carbon.input.segments.default.carbon_table_multi_thread with value 1,2,3 added in the session
param
18/03/12 00:51:09 AUDIT CacheProvider: [asf927.gq1.ygridcore.net][jenkins][Thread-1]The key
carbon.input.segments.default.carbon_table_multi_thread with value 1,2,3 added in the session
param
18/03/12 00:51:09 AUDIT CarbonCreateTableCommand: [asf927.gq1.ygridcore.net][jenkins][Thread-1]Table
created with Database name [default] and Table name [preaggmain]
18/03/12 00:51:09 AUDIT CacheProvider: [asf927.gq1.ygridcore.net][jenkins][Thread-1]The key
carbon.input.segments.default.carbon_table_multi_thread with value 1,2,3 added in the session
param
18/03/12 00:51:09 AUDIT CacheProvider: [asf927.gq1.ygridcore.net][jenkins][Thread-1]The key
carbon.input.segments.default.carbon_table_multi_thread with value 1,2,3 added in the session
param
18/03/12 00:51:09 AUDIT CacheProvider: [asf927.gq1.ygridcore.net][jenkins][Thread-1]The key
carbon.input.segments.default.carbon_table_multi_thread with value 1,2,3 added in the session
param
18/03/12 00:51:09 AUDIT CarbonCreateTableCommand: [asf927.gq1.ygridcore.net][jenkins][Thread-1]Creating
Table with Database name [default] and Table name [preaggmain_preagg1]
18/03/12 00:51:09 AUDIT CacheProvider: [asf927.gq1.ygridcore.net][jenkins][Thread-1]The key
carbon.input.segments.default.carbon_table_multi_thread with value 1,2,3 added in the session
param
18/03/12 00:51:10 AUDIT CacheProvider: [asf927.gq1.ygridcore.net][jenkins][Thread-1]The key
carbon.input.segments.default.carbon_table_multi_thread with value 1,2,3 added in the session
param
18/03/12 00:51:10 AUDIT CarbonCreateTableCommand: [asf927.gq1.ygridcore.net][jenkins][Thread-1]Table
created with Database name [default] and Table name [preaggmain_preagg1]
18/03/12 00:51:10 AUDIT CacheProvider: [asf927.gq1.ygridcore.net][jenkins][Thread-1]The key
carbon.input.segments.default.carbon_table_multi_thread with value 1,2,3 added in the session
param
18/03/12 00:51:10 AUDIT CacheProvider: [asf927.gq1.ygridcore.net][jenkins][Thread-1]The key
carbon.input.segments.default.carbon_table_multi_thread with value 1,2,3 added in the session
param
18/03/12 00:51:10 AUDIT CacheProvider: [asf927.gq1.ygridcore.net][jenkins][Thread-1]The key
carbon.input.segments.default.carbon_table_multi_thread with value 1,2,3 added in the session
param
18/03/12 00:51:10 AUDIT CarbonCreateDataMapCommand: [asf927.gq1.ygridcore.net][jenkins][Thread-1]DataMap
preagg1 successfully added to Table PreAggMain
18/03/12 00:51:10 AUDIT CacheProvider: [asf927.gq1.ygridcore.net][jenkins][Thread-1]The key
carbon.input.segments.default.carbon_table_multi_thread with value 1,2,3 added in the session
param
18/03/12 00:51:10 AUDIT CarbonAlterTableDropColumnCommand: [asf927.gq1.ygridcore.net][jenkins][Thread-1]Alter
table drop columns request has been received for default.preaggmain
18/03/12 00:51:10 AUDIT CacheProvider: [asf927.gq1.ygridcore.net][jenkins][Thread-1]The key
carbon.input.segments.default.carbon_table_multi_thread with value 1,2,3 added in the session
param
18/03/12 00:51:10 AUDIT CacheProvider: [asf927.gq1.ygridcore.net][jenkins][Thread-1]The key
carbon.input.segments.default.carbon_table_multi_thread with value 1,2,3 added in the session
param
18/03/12 00:51:10 AUDIT CarbonAlterTableDropColumnCommand: [asf927.gq1.ygridcore.net][jenkins][Thread-1]Alter
table for drop columns is successful for table default.preaggmain
18/03/12 00:51:10 AUDIT CacheProvider: [asf927.gq1.ygridcore.net][jenkins][Thread-1]The key
carbon.input.segments.default.carbon_table_multi_thread with value 1,2,3 added in the session
param
18/03/12 00:51:10 AUDIT CarbonAlterTableDropColumnCommand: [asf927.gq1.ygridcore.net][jenkins][Thread-1]Alter
table drop columns request has been received for default.preaggmain_preagg1
18/03/12 00:51:10 ERROR CarbonAlterTableDropColumnCommand: ScalaTest-main-running-DropColumnTestCases
Alter table drop columns failed : Cannot drop columns in pre-aggreagate table default.preaggmain_preagg1
18/03/12 00:51:10 AUDIT CacheProvider: [asf927.gq1.ygridcore.net][jenkins][Thread-1]The key
carbon.input.segments.default.carbon_table_multi_thread with value 1,2,3 added in the session
param
18/03/12 00:51:10 AUDIT CarbonDropTableCommand: [asf927.gq1.ygridcore.net][jenkins][Thread-1]Deleting
table [preaggmain] under database [default]
18/03/12 00:51:10 AUDIT CarbonDropTableCommand: [asf927.gq1.ygridcore.net][jenkins][Thread-1]Deleting
table [preaggmain_preagg1] under database [default]
18/03/12 00:51:10 AUDIT CarbonDropTableCommand: [asf927.gq1.ygridcore.net][jenkins][Thread-1]Deleted
table [preaggmain_preagg1] under database [default]
18/03/12 00:51:10 AUDIT CarbonDropTableCommand: [asf927.gq1.ygridcore.net][jenkins][Thread-1]Deleted
table [preaggmain] under database [default]
18/03/12 00:51:10 AUDIT CacheProvider: [asf927.gq1.ygridcore.net][jenkins][Thread-1]The key
carbon.input.segments.default.carbon_table_multi_thread with value 1,2,3 added in the session
param
- test dropping of column in pre-aggregate should throw exception
18/03/12 00:51:10 AUDIT CacheProvider: [asf927.gq1.ygridcore.net][jenkins][Thread-1]The key
carbon.input.segments.default.carbon_table_multi_thread with value 1,2,3 added in the session
param
18/03/12 00:51:10 AUDIT CacheProvider: [asf927.gq1.ygridcore.net][jenkins][Thread-1]The key
carbon.input.segments.default.carbon_table_multi_thread with value 1,2,3 added in the session
param
Run completed in 12 minutes, 5 seconds.
Total number of tests run: 330
Suites: completed 40, aborted 0
Tests: succeeded 329, failed 1, canceled 0, ignored 4, pending 0
*** 1 TEST FAILED ***
[JENKINS] Recording test results
[INFO] 
[INFO] --- maven-jar-plugin:2.5:jar (default-jar) @ carbondata-spark2 ---
[INFO] Building jar: <https://builds.apache.org/job/carbondata-master-spark-2.1/ws/integration/spark2/target/carbondata-spark2-1.4.0-SNAPSHOT.jar>
[INFO] 
[INFO] --- maven-site-plugin:3.4:attach-descriptor (attach-descriptor) @ carbondata-spark2
---
[INFO] 
[INFO] --- jacoco-maven-plugin:0.7.9:prepare-agent-integration (default-prepare-agent-integration)
@ carbondata-spark2 ---
[INFO] argLine set to -javaagent:/home/jenkins/jenkins-slave/maven-repositories/0/org/jacoco/org.jacoco.agent/0.7.9/org.jacoco.agent-0.7.9-runtime.jar=destfile=<https://builds.apache.org/job/carbondata-master-spark-2.1/ws/integration/spark2/target/jacoco-it.exec>
[INFO] 
[INFO] --- maven-checkstyle-plugin:2.17:check (default) @ carbondata-spark2 ---
[INFO] Starting audit...
Audit done.
[INFO] 
[INFO] --- scalastyle-maven-plugin:0.8.0:check (default) @ carbondata-spark2 ---
Saving to outputFile=<https://builds.apache.org/job/carbondata-master-spark-2.1/ws/integration/spark2/target/scalastyle-output.xml>
Processed 93 file(s)
Found 0 errors
Found 0 warnings
Found 0 infos
Finished in 2609 ms
[INFO] 
[INFO] --- jacoco-maven-plugin:0.7.9:report (default-report) @ carbondata-spark2 ---
[INFO] Loading execution data file <https://builds.apache.org/job/carbondata-master-spark-2.1/ws/integration/spark2/target/jacoco.exec>
[INFO] Analyzed bundle 'Apache CarbonData :: Spark2' with 1363 classes
[INFO] 
[INFO] --- jacoco-maven-plugin:0.7.9:report-integration (default-report-integration) @ carbondata-spark2
---
[INFO] Skipping JaCoCo execution due to missing execution data file.
[INFO] 
[INFO] --- jacoco-maven-plugin:0.7.9:check (default-check) @ carbondata-spark2 ---
[INFO] Loading execution data file <https://builds.apache.org/job/carbondata-master-spark-2.1/ws/integration/spark2/target/jacoco.exec>
[INFO] Analyzed bundle 'carbondata-spark2' with 0 classes
[INFO] All coverage checks have been met.
[INFO] 
[INFO] --- maven-install-plugin:2.5.2:install (default-install) @ carbondata-spark2 ---
[INFO] Installing <https://builds.apache.org/job/carbondata-master-spark-2.1/ws/integration/spark2/target/carbondata-spark2-1.4.0-SNAPSHOT.jar>
to /home/jenkins/jenkins-slave/maven-repositories/0/org/apache/carbondata/carbondata-spark2/1.4.0-SNAPSHOT/carbondata-spark2-1.4.0-SNAPSHOT.jar
[INFO] Installing <https://builds.apache.org/job/carbondata-master-spark-2.1/ws/integration/spark2/pom.xml>
to /home/jenkins/jenkins-slave/maven-repositories/0/org/apache/carbondata/carbondata-spark2/1.4.0-SNAPSHOT/carbondata-spark2-1.4.0-SNAPSHOT.pom
[INFO]                                                                         
[INFO] ------------------------------------------------------------------------
[INFO] Building Apache CarbonData :: Spark Common Test 1.4.0-SNAPSHOT
[INFO] ------------------------------------------------------------------------
[INFO] Downloading: http://repository.apache.org/snapshots/org/apache/carbondata/carbondata-lucene/1.4.0-SNAPSHOT/maven-metadata.xml
[INFO] Downloading: http://repo1.maven.org/maven2/org/apache/carbondata/carbondata-lucene/1.4.0-SNAPSHOT/maven-metadata.xml
[INFO] Downloading: http://repo1.maven.org/maven2/org/apache/carbondata/carbondata-lucene/1.4.0-SNAPSHOT/carbondata-lucene-1.4.0-SNAPSHOT.pom
[INFO] Downloading: http://repository.apache.org/snapshots/org/apache/carbondata/carbondata-lucene/1.4.0-SNAPSHOT/carbondata-lucene-1.4.0-SNAPSHOT.pom
[WARNING] The POM for org.apache.carbondata:carbondata-lucene:jar:1.4.0-SNAPSHOT is missing,
no dependency information available
[INFO] Downloading: http://repo1.maven.org/maven2/org/apache/carbondata/carbondata-lucene/1.4.0-SNAPSHOT/carbondata-lucene-1.4.0-SNAPSHOT.jar
[INFO] Downloading: http://repository.apache.org/snapshots/org/apache/carbondata/carbondata-lucene/1.4.0-SNAPSHOT/carbondata-lucene-1.4.0-SNAPSHOT.jar
[INFO] ------------------------------------------------------------------------
[INFO] Reactor Summary:
[INFO] 
[INFO] Apache CarbonData :: Parent ........................ SUCCESS [  9.312 s]
[INFO] Apache CarbonData :: Common ........................ SUCCESS [ 14.159 s]
[INFO] Apache CarbonData :: Core .......................... SUCCESS [02:39 min]
[INFO] Apache CarbonData :: Processing .................... SUCCESS [ 33.376 s]
[INFO] Apache CarbonData :: Hadoop ........................ SUCCESS [ 32.638 s]
[INFO] Apache CarbonData :: Spark Common .................. SUCCESS [01:10 min]
[INFO] Apache CarbonData :: Streaming ..................... SUCCESS [ 30.981 s]
[INFO] Apache CarbonData :: Spark2 ........................ SUCCESS [13:56 min]
[INFO] Apache CarbonData :: Spark Common Test ............. FAILURE [  1.093 s]
[INFO] Apache CarbonData :: DataMap Examples .............. SKIPPED
[INFO] Apache CarbonData :: Store SDK ..................... SKIPPED
[INFO] Apache CarbonData :: Assembly ...................... SKIPPED
[INFO] Apache CarbonData :: Hive .......................... SKIPPED
[INFO] Apache CarbonData :: presto ........................ SKIPPED
[INFO] Apache CarbonData :: Spark2 Examples ............... SKIPPED
[INFO] ------------------------------------------------------------------------
[INFO] BUILD FAILURE
[INFO] ------------------------------------------------------------------------
[INFO] Total time: 20:19 min
[INFO] Finished at: 2018-03-12T07:51:36+00:00
[INFO] Final Memory: 134M/1699M
[INFO] ------------------------------------------------------------------------
[ERROR] Failed to execute goal on project carbondata-spark-common-test: Could not resolve
dependencies for project org.apache.carbondata:carbondata-spark-common-test:jar:1.4.0-SNAPSHOT:
Could not find artifact org.apache.carbondata:carbondata-lucene:jar:1.4.0-SNAPSHOT in central
(http://repo1.maven.org/maven2) -> [Help 1]
org.apache.maven.lifecycle.LifecycleExecutionException: Failed to execute goal on project
carbondata-spark-common-test: Could not resolve dependencies for project org.apache.carbondata:carbondata-spark-common-test:jar:1.4.0-SNAPSHOT:
Could not find artifact org.apache.carbondata:carbondata-lucene:jar:1.4.0-SNAPSHOT in central
(http://repo1.maven.org/maven2)
	at org.apache.maven.lifecycle.internal.LifecycleDependencyResolver.getDependencies(LifecycleDependencyResolver.java:221)
	at org.apache.maven.lifecycle.internal.LifecycleDependencyResolver.resolveProjectDependencies(LifecycleDependencyResolver.java:127)
	at org.apache.maven.lifecycle.internal.MojoExecutor.ensureDependenciesAreResolved(MojoExecutor.java:245)
	at org.apache.maven.lifecycle.internal.MojoExecutor.execute(MojoExecutor.java:199)
	at org.apache.maven.lifecycle.internal.MojoExecutor.execute(MojoExecutor.java:153)
	at org.apache.maven.lifecycle.internal.MojoExecutor.execute(MojoExecutor.java:145)
	at org.apache.maven.lifecycle.internal.LifecycleModuleBuilder.buildProject(LifecycleModuleBuilder.java:116)
	at org.apache.maven.lifecycle.internal.LifecycleModuleBuilder.buildProject(LifecycleModuleBuilder.java:80)
	at org.apache.maven.lifecycle.internal.builder.singlethreaded.SingleThreadedBuilder.build(SingleThreadedBuilder.java:51)
	at org.apache.maven.lifecycle.internal.LifecycleStarter.execute(LifecycleStarter.java:128)
	at org.apache.maven.DefaultMaven.doExecute(DefaultMaven.java:307)
	at org.apache.maven.DefaultMaven.doExecute(DefaultMaven.java:193)
	at org.apache.maven.DefaultMaven.execute(DefaultMaven.java:106)
	at org.jvnet.hudson.maven3.launcher.Maven33Launcher.main(Maven33Launcher.java:129)
	at sun.reflect.NativeMethodAccessorImpl.invoke0(Native Method)
	at sun.reflect.NativeMethodAccessorImpl.invoke(NativeMethodAccessorImpl.java:62)
	at sun.reflect.DelegatingMethodAccessorImpl.invoke(DelegatingMethodAccessorImpl.java:43)
	at java.lang.reflect.Method.invoke(Method.java:498)
	at org.codehaus.plexus.classworlds.launcher.Launcher.launchStandard(Launcher.java:330)
	at org.codehaus.plexus.classworlds.launcher.Launcher.launch(Launcher.java:238)
	at jenkins.maven3.agent.Maven33Main.launch(Maven33Main.java:176)
	at sun.reflect.NativeMethodAccessorImpl.invoke0(Native Method)
	at sun.reflect.NativeMethodAccessorImpl.invoke(NativeMethodAccessorImpl.java:62)
	at sun.reflect.DelegatingMethodAccessorImpl.invoke(DelegatingMethodAccessorImpl.java:43)
	at java.lang.reflect.Method.invoke(Method.java:498)
	at hudson.maven.Maven3Builder.call(Maven3Builder.java:139)
	at hudson.maven.Maven3Builder.call(Maven3Builder.java:70)
	at hudson.remoting.UserRequest.perform(UserRequest.java:207)
	at hudson.remoting.UserRequest.perform(UserRequest.java:53)
	at hudson.remoting.Request$2.run(Request.java:358)
	at hudson.remoting.InterceptingExecutorService$1.call(InterceptingExecutorService.java:72)
	at java.util.concurrent.FutureTask.run(FutureTask.java:266)
	at java.util.concurrent.ThreadPoolExecutor.runWorker(ThreadPoolExecutor.java:1149)
	at java.util.concurrent.ThreadPoolExecutor$Worker.run(ThreadPoolExecutor.java:624)
	at java.lang.Thread.run(Thread.java:748)
Caused by: org.apache.maven.project.DependencyResolutionException: Could not resolve dependencies
for project org.apache.carbondata:carbondata-spark-common-test:jar:1.4.0-SNAPSHOT: Could not
find artifact org.apache.carbondata:carbondata-lucene:jar:1.4.0-SNAPSHOT in central (http://repo1.maven.org/maven2)
	at org.apache.maven.project.DefaultProjectDependenciesResolver.resolve(DefaultProjectDependenciesResolver.java:211)
	at org.apache.maven.lifecycle.internal.LifecycleDependencyResolver.getDependencies(LifecycleDependencyResolver.java:195)
	... 34 more
Caused by: org.eclipse.aether.resolution.DependencyResolutionException: Could not find artifact
org.apache.carbondata:carbondata-lucene:jar:1.4.0-SNAPSHOT in central (http://repo1.maven.org/maven2)
	at org.eclipse.aether.internal.impl.DefaultRepositorySystem.resolveDependencies(DefaultRepositorySystem.java:384)
	at org.apache.maven.project.DefaultProjectDependenciesResolver.resolve(DefaultProjectDependenciesResolver.java:205)
	... 35 more
Caused by: org.eclipse.aether.resolution.ArtifactResolutionException: Could not find artifact
org.apache.carbondata:carbondata-lucene:jar:1.4.0-SNAPSHOT in central (http://repo1.maven.org/maven2)
	at org.eclipse.aether.internal.impl.DefaultArtifactResolver.resolve(DefaultArtifactResolver.java:444)
	at org.eclipse.aether.internal.impl.DefaultArtifactResolver.resolveArtifacts(DefaultArtifactResolver.java:246)
	at org.eclipse.aether.internal.impl.DefaultRepositorySystem.resolveDependencies(DefaultRepositorySystem.java:367)
	... 36 more
Caused by: org.eclipse.aether.transfer.ArtifactNotFoundException: Could not find artifact
org.apache.carbondata:carbondata-lucene:jar:1.4.0-SNAPSHOT in central (http://repo1.maven.org/maven2)
	at org.eclipse.aether.connector.basic.ArtifactTransportListener.transferFailed(ArtifactTransportListener.java:39)
	at org.eclipse.aether.connector.basic.BasicRepositoryConnector$TaskRunner.run(BasicRepositoryConnector.java:355)
	at org.eclipse.aether.util.concurrency.RunnableErrorForwarder$1.run(RunnableErrorForwarder.java:67)
	at org.eclipse.aether.connector.basic.BasicRepositoryConnector$DirectExecutor.execute(BasicRepositoryConnector.java:581)
	at org.eclipse.aether.connector.basic.BasicRepositoryConnector.get(BasicRepositoryConnector.java:249)
	at org.eclipse.aether.internal.impl.DefaultArtifactResolver.performDownloads(DefaultArtifactResolver.java:520)
	at org.eclipse.aether.internal.impl.DefaultArtifactResolver.resolve(DefaultArtifactResolver.java:421)
	... 38 more
[ERROR] 
[ERROR] Re-run Maven using the -X switch to enable full debug logging.
[ERROR] 
[ERROR] For more information about the errors and possible solutions, please read the following
articles:
[ERROR] [Help 1] http://cwiki.apache.org/confluence/display/MAVEN/DependencyResolutionException
[ERROR] 
[ERROR] After correcting the problems, you can resume the build with the command
[ERROR]   mvn <goals> -rf :carbondata-spark-common-test
[JENKINS] Archiving <https://builds.apache.org/job/carbondata-master-spark-2.1/ws/processing/pom.xml>
to org.apache.carbondata/carbondata-processing/1.4.0-SNAPSHOT/carbondata-processing-1.4.0-SNAPSHOT.pom
[JENKINS] Archiving <https://builds.apache.org/job/carbondata-master-spark-2.1/ws/processing/target/carbondata-processing-1.4.0-SNAPSHOT.jar>
to org.apache.carbondata/carbondata-processing/1.4.0-SNAPSHOT/carbondata-processing-1.4.0-SNAPSHOT.jar
[JENKINS] Archiving <https://builds.apache.org/job/carbondata-master-spark-2.1/ws/datamap/examples/pom.xml>
to org.apache.carbondata/carbondata-datamap-examples/1.4.0-SNAPSHOT/carbondata-datamap-examples-1.4.0-SNAPSHOT.pom
[JENKINS] Archiving <https://builds.apache.org/job/carbondata-master-spark-2.1/ws/streaming/pom.xml>
to org.apache.carbondata/carbondata-streaming/1.4.0-SNAPSHOT/carbondata-streaming-1.4.0-SNAPSHOT.pom
[JENKINS] Archiving <https://builds.apache.org/job/carbondata-master-spark-2.1/ws/streaming/target/carbondata-streaming-1.4.0-SNAPSHOT.jar>
to org.apache.carbondata/carbondata-streaming/1.4.0-SNAPSHOT/carbondata-streaming-1.4.0-SNAPSHOT.jar
[JENKINS] Archiving <https://builds.apache.org/job/carbondata-master-spark-2.1/ws/integration/spark-common/pom.xml>
to org.apache.carbondata/carbondata-spark-common/1.4.0-SNAPSHOT/carbondata-spark-common-1.4.0-SNAPSHOT.pom
[JENKINS] Archiving <https://builds.apache.org/job/carbondata-master-spark-2.1/ws/integration/spark-common/target/carbondata-spark-common-1.4.0-SNAPSHOT.jar>
to org.apache.carbondata/carbondata-spark-common/1.4.0-SNAPSHOT/carbondata-spark-common-1.4.0-SNAPSHOT.jar
[JENKINS] Archiving <https://builds.apache.org/job/carbondata-master-spark-2.1/ws/integration/hive/pom.xml>
to org.apache.carbondata/carbondata-hive/1.4.0-SNAPSHOT/carbondata-hive-1.4.0-SNAPSHOT.pom
[JENKINS] Archiving <https://builds.apache.org/job/carbondata-master-spark-2.1/ws/common/pom.xml>
to org.apache.carbondata/carbondata-common/1.4.0-SNAPSHOT/carbondata-common-1.4.0-SNAPSHOT.pom
[JENKINS] Archiving <https://builds.apache.org/job/carbondata-master-spark-2.1/ws/common/target/carbondata-common-1.4.0-SNAPSHOT.jar>
to org.apache.carbondata/carbondata-common/1.4.0-SNAPSHOT/carbondata-common-1.4.0-SNAPSHOT.jar
[JENKINS] Archiving <https://builds.apache.org/job/carbondata-master-spark-2.1/ws/examples/spark2/pom.xml>
to org.apache.carbondata/carbondata-examples-spark2/1.4.0-SNAPSHOT/carbondata-examples-spark2-1.4.0-SNAPSHOT.pom
[JENKINS] Archiving <https://builds.apache.org/job/carbondata-master-spark-2.1/ws/integration/spark2/pom.xml>
to org.apache.carbondata/carbondata-spark2/1.4.0-SNAPSHOT/carbondata-spark2-1.4.0-SNAPSHOT.pom
[JENKINS] Archiving <https://builds.apache.org/job/carbondata-master-spark-2.1/ws/integration/spark2/target/carbondata-spark2-1.4.0-SNAPSHOT.jar>
to org.apache.carbondata/carbondata-spark2/1.4.0-SNAPSHOT/carbondata-spark2-1.4.0-SNAPSHOT.jar
[JENKINS] Archiving <https://builds.apache.org/job/carbondata-master-spark-2.1/ws/assembly/pom.xml>
to org.apache.carbondata/carbondata-assembly/1.4.0-SNAPSHOT/carbondata-assembly-1.4.0-SNAPSHOT.pom
[JENKINS] Archiving <https://builds.apache.org/job/carbondata-master-spark-2.1/ws/pom.xml>
to org.apache.carbondata/carbondata-parent/1.4.0-SNAPSHOT/carbondata-parent-1.4.0-SNAPSHOT.pom
[JENKINS] Archiving <https://builds.apache.org/job/carbondata-master-spark-2.1/ws/core/pom.xml>
to org.apache.carbondata/carbondata-core/1.4.0-SNAPSHOT/carbondata-core-1.4.0-SNAPSHOT.pom
[JENKINS] Archiving <https://builds.apache.org/job/carbondata-master-spark-2.1/ws/core/target/carbondata-core-1.4.0-SNAPSHOT.jar>
to org.apache.carbondata/carbondata-core/1.4.0-SNAPSHOT/carbondata-core-1.4.0-SNAPSHOT.jar
[JENKINS] Archiving <https://builds.apache.org/job/carbondata-master-spark-2.1/ws/hadoop/pom.xml>
to org.apache.carbondata/carbondata-hadoop/1.4.0-SNAPSHOT/carbondata-hadoop-1.4.0-SNAPSHOT.pom
[JENKINS] Archiving <https://builds.apache.org/job/carbondata-master-spark-2.1/ws/hadoop/target/carbondata-hadoop-1.4.0-SNAPSHOT.jar>
to org.apache.carbondata/carbondata-hadoop/1.4.0-SNAPSHOT/carbondata-hadoop-1.4.0-SNAPSHOT.jar
[JENKINS] Archiving <https://builds.apache.org/job/carbondata-master-spark-2.1/ws/integration/presto/pom.xml>
to org.apache.carbondata/carbondata-presto/1.4.0-SNAPSHOT/carbondata-presto-1.4.0-SNAPSHOT.pom
[JENKINS] Archiving <https://builds.apache.org/job/carbondata-master-spark-2.1/ws/integration/spark-common-test/pom.xml>
to org.apache.carbondata/carbondata-spark-common-test/1.4.0-SNAPSHOT/carbondata-spark-common-test-1.4.0-SNAPSHOT.pom
[JENKINS] Archiving <https://builds.apache.org/job/carbondata-master-spark-2.1/ws/store/sdk/pom.xml>
to org.apache.carbondata/carbondata-store-sdk/1.4.0-SNAPSHOT/carbondata-store-sdk-1.4.0-SNAPSHOT.pom
Sending e-mails to: commits@carbondata.apache.org
Sending e-mails to: commits@carbondata.apache.org
channel stopped
Not sending mail to unregistered user jacky.likun@qq.com
Not sending mail to unregistered user ramana.gollamudi@huawei.com

Mime
View raw message