carbondata-commits mailing list archives

Site index · List index
Message view « Date » · « Thread »
Top « Date » · « Thread »
From Apache Jenkins Server <jenk...@builds.apache.org>
Subject Build failed in Jenkins: carbondata-master-spark-2.2 #406
Date Tue, 08 May 2018 20:08:04 GMT
See <https://builds.apache.org/job/carbondata-master-spark-2.2/406/display/redirect?page=changes>

Changes:

[ravipesala] [CARBONDATA-2434] Add ExternalTableExample and LuceneDataMapExample

------------------------------------------
[...truncated 5.58 MB...]
|which test1 good4|who and name4|
|which test1 good4|who and name4|
|which test1 good4|who and name4|
|which test1 good4|who and name4|
+-----------------+-------------+

18/05/08 13:06:52 AUDIT CarbonDropTableCommand: [asf924.gq1.ygridcore.net][jenkins][Thread-1]Deleting
table [persontable] under database [default]
18/05/08 13:06:52 AUDIT CarbonDropTableCommand: [asf924.gq1.ygridcore.net][jenkins][Thread-1]Deleted
table [persontable] under database [default]
- LuceneDataMapExample
18/05/08 13:06:52 AUDIT CarbonCreateTableCommand: [asf924.gq1.ygridcore.net][jenkins][Thread-1]Creating
Table with Database name [default] and Table name [origin_table]
18/05/08 13:06:52 AUDIT CarbonCreateTableCommand: [asf924.gq1.ygridcore.net][jenkins][Thread-1]Table
created with Database name [default] and Table name [origin_table]
18/05/08 13:06:52 AUDIT CarbonDataRDDFactory$: [asf924.gq1.ygridcore.net][jenkins][Thread-1]Data
load request has been received for table default.origin_table
18/05/08 13:06:53 ERROR DataLoadExecutor: [Executor task launch worker for task 2297][partitionID:table;queryID:49062461524765290]
Data Load is partially success for table origin_table
18/05/08 13:06:53 AUDIT CarbonDataRDDFactory$: [asf924.gq1.ygridcore.net][jenkins][Thread-1]Data
load is successful for default.origin_table
18/05/08 13:06:53 AUDIT CarbonDataRDDFactory$: [asf924.gq1.ygridcore.net][jenkins][Thread-1]Data
load request has been received for table default.origin_table
18/05/08 13:06:53 ERROR DataLoadExecutor: [Executor task launch worker for task 2298][partitionID:table;queryID:49062461953513748]
Data Load is partially success for table origin_table
18/05/08 13:06:53 AUDIT CarbonDataRDDFactory$: [asf924.gq1.ygridcore.net][jenkins][Thread-1]Data
load is successful for default.origin_table
18/05/08 13:06:53 AUDIT CarbonDataRDDFactory$: [asf924.gq1.ygridcore.net][jenkins][Thread-1]Data
load request has been received for table default.origin_table
18/05/08 13:06:53 ERROR DataLoadExecutor: [Executor task launch worker for task 2299][partitionID:table;queryID:49062462360508015]
Data Load is partially success for table origin_table
18/05/08 13:06:53 AUDIT CarbonDataRDDFactory$: [asf924.gq1.ygridcore.net][jenkins][Thread-1]Data
load is successful for default.origin_table
18/05/08 13:06:53 AUDIT CarbonDataRDDFactory$: [asf924.gq1.ygridcore.net][jenkins][Thread-1]Data
load request has been received for table default.origin_table
18/05/08 13:06:54 ERROR DataLoadExecutor: [Executor task launch worker for task 2300][partitionID:table;queryID:49062462708682201]
Data Load is partially success for table origin_table
18/05/08 13:06:54 AUDIT CarbonDataRDDFactory$: [asf924.gq1.ygridcore.net][jenkins][Thread-1]Data
load is successful for default.origin_table
+--------+
|count(1)|
+--------+
|      40|
+--------+

18/05/08 13:06:54 AUDIT CarbonCreateTableCommand: [asf924.gq1.ygridcore.net][jenkins][Thread-1]Creating
Table with Database name [default] and Table name [external_table]
18/05/08 13:06:54 AUDIT CarbonCreateTableCommand: [asf924.gq1.ygridcore.net][jenkins][Thread-1]Table
created with Database name [default] and Table name [external_table]
+--------+
|count(1)|
+--------+
|      40|
+--------+

18/05/08 13:06:54 AUDIT CarbonDataRDDFactory$: [asf924.gq1.ygridcore.net][jenkins][Thread-1]Data
load request has been received for table default.origin_table
18/05/08 13:06:54 ERROR DataLoadExecutor: [Executor task launch worker for task 2305][partitionID:table;queryID:49062463312839845]
Data Load is partially success for table origin_table
18/05/08 13:06:54 AUDIT CarbonDataRDDFactory$: [asf924.gq1.ygridcore.net][jenkins][Thread-1]Data
load is successful for default.origin_table
18/05/08 13:06:54 AUDIT CarbonDataRDDFactory$: [asf924.gq1.ygridcore.net][jenkins][Thread-1]Data
load request has been received for table default.origin_table
18/05/08 13:06:55 ERROR DataLoadExecutor: [Executor task launch worker for task 2306][partitionID:table;queryID:49062463709729032]
Data Load is partially success for table origin_table
18/05/08 13:06:55 AUDIT CarbonDataRDDFactory$: [asf924.gq1.ygridcore.net][jenkins][Thread-1]Data
load is successful for default.origin_table
+--------+
|count(1)|
+--------+
|      60|
+--------+

18/05/08 13:06:55 AUDIT CarbonDropTableCommand: [asf924.gq1.ygridcore.net][jenkins][Thread-1]Deleting
table [origin_table] under database [default]
18/05/08 13:06:55 AUDIT CarbonDropTableCommand: [asf924.gq1.ygridcore.net][jenkins][Thread-1]Deleted
table [origin_table] under database [default]
- ExternalTableExample
Run completed in 1 minute, 56 seconds.
Total number of tests run: 17
Suites: completed 2, aborted 0
Tests: succeeded 17, failed 0, canceled 0, ignored 0, pending 0
All tests passed.
[JENKINS] Recording test results
[INFO] 
[INFO] --- maven-jar-plugin:2.5:jar (default-jar) @ carbondata-examples-spark2 ---
[INFO] Building jar: <https://builds.apache.org/job/carbondata-master-spark-2.2/ws/examples/spark2/target/carbondata-examples-spark2-1.4.0-SNAPSHOT.jar>
[INFO] 
[INFO] --- maven-site-plugin:3.4:attach-descriptor (attach-descriptor) @ carbondata-examples-spark2
---
[INFO] 
[INFO] --- scalastyle-maven-plugin:0.8.0:check (default-cli) @ carbondata-examples-spark2
---
Saving to outputFile=<https://builds.apache.org/job/carbondata-master-spark-2.2/ws/examples/spark2/target/scalastyle-output.xml>
Processed 33 file(s)
Found 0 errors
Found 0 warnings
Found 0 infos
Finished in 806 ms
[INFO] 
[INFO] --- maven-checkstyle-plugin:2.17:check (default-cli) @ carbondata-examples-spark2 ---
[INFO]                                                                         
[INFO] ------------------------------------------------------------------------
[INFO] Building Apache CarbonData :: Parent 1.4.0-SNAPSHOT
[INFO] ------------------------------------------------------------------------
[INFO] 
[INFO] --- coveralls-maven-plugin:4.3.0:report (default-cli) @ carbondata-parent ---
[INFO] Downloading: https://repo.maven.apache.org/maven2/org/apache/httpcomponents/httpmime/4.5.2/httpmime-4.5.2.pom
[INFO] Downloaded: https://repo.maven.apache.org/maven2/org/apache/httpcomponents/httpmime/4.5.2/httpmime-4.5.2.pom
(5 KB at 116.7 KB/sec)
[INFO] Downloading: https://repo.maven.apache.org/maven2/com/fasterxml/jackson/core/jackson-core/2.8.3/jackson-core-2.8.3.pom
[INFO] Downloaded: https://repo.maven.apache.org/maven2/com/fasterxml/jackson/core/jackson-core/2.8.3/jackson-core-2.8.3.pom
(6 KB at 311.1 KB/sec)
[INFO] Downloading: https://repo.maven.apache.org/maven2/com/fasterxml/jackson/core/jackson-annotations/2.8.3/jackson-annotations-2.8.3.pom
[INFO] Downloaded: https://repo.maven.apache.org/maven2/com/fasterxml/jackson/core/jackson-annotations/2.8.3/jackson-annotations-2.8.3.pom
(2 KB at 120.3 KB/sec)
[INFO] Downloading: https://repo.maven.apache.org/maven2/com/fasterxml/jackson/core/jackson-databind/2.8.3/jackson-databind-2.8.3.pom
[INFO] Downloaded: https://repo.maven.apache.org/maven2/com/fasterxml/jackson/core/jackson-databind/2.8.3/jackson-databind-2.8.3.pom
(6 KB at 353.3 KB/sec)
[INFO] Downloading: https://repo.maven.apache.org/maven2/org/eclipse/jgit/org.eclipse.jgit/4.5.0.201609210915-r/org.eclipse.jgit-4.5.0.201609210915-r.pom
[INFO] Downloaded: https://repo.maven.apache.org/maven2/org/eclipse/jgit/org.eclipse.jgit/4.5.0.201609210915-r/org.eclipse.jgit-4.5.0.201609210915-r.pom
(10 KB at 290.0 KB/sec)
[INFO] Downloading: https://repo.maven.apache.org/maven2/org/eclipse/jgit/org.eclipse.jgit-parent/4.5.0.201609210915-r/org.eclipse.jgit-parent-4.5.0.201609210915-r.pom
[INFO] Downloaded: https://repo.maven.apache.org/maven2/org/eclipse/jgit/org.eclipse.jgit-parent/4.5.0.201609210915-r/org.eclipse.jgit-parent-4.5.0.201609210915-r.pom
(27 KB at 1321.2 KB/sec)
[INFO] Downloading: https://repo.maven.apache.org/maven2/com/googlecode/javaewah/JavaEWAH/0.7.9/JavaEWAH-0.7.9.pom
[INFO] Downloaded: https://repo.maven.apache.org/maven2/com/googlecode/javaewah/JavaEWAH/0.7.9/JavaEWAH-0.7.9.pom
(5 KB at 282.8 KB/sec)
[INFO] Downloading: https://repo.maven.apache.org/maven2/org/codehaus/plexus/plexus-utils/2.0.7/plexus-utils-2.0.7.pom
[INFO] Downloaded: https://repo.maven.apache.org/maven2/org/codehaus/plexus/plexus-utils/2.0.7/plexus-utils-2.0.7.pom
(3 KB at 67.0 KB/sec)
[INFO] Downloading: https://repo.maven.apache.org/maven2/org/sonatype/sisu/sisu-inject-plexus/1.4.3.2/sisu-inject-plexus-1.4.3.2.pom
[INFO] Downloaded: https://repo.maven.apache.org/maven2/org/sonatype/sisu/sisu-inject-plexus/1.4.3.2/sisu-inject-plexus-1.4.3.2.pom
(6 KB at 103.8 KB/sec)
[INFO] Downloading: https://repo.maven.apache.org/maven2/org/sonatype/sisu/inject/guice-plexus/1.4.3.2/guice-plexus-1.4.3.2.pom
[INFO] Downloaded: https://repo.maven.apache.org/maven2/org/sonatype/sisu/inject/guice-plexus/1.4.3.2/guice-plexus-1.4.3.2.pom
(3 KB at 197.5 KB/sec)
[INFO] Downloading: https://repo.maven.apache.org/maven2/org/sonatype/sisu/inject/guice-bean/1.4.3.2/guice-bean-1.4.3.2.pom
[INFO] Downloaded: https://repo.maven.apache.org/maven2/org/sonatype/sisu/inject/guice-bean/1.4.3.2/guice-bean-1.4.3.2.pom
(3 KB at 154.2 KB/sec)
[INFO] Downloading: https://repo.maven.apache.org/maven2/org/sonatype/sisu/sisu-inject/1.4.3.2/sisu-inject-1.4.3.2.pom
[INFO] Downloaded: https://repo.maven.apache.org/maven2/org/sonatype/sisu/sisu-inject/1.4.3.2/sisu-inject-1.4.3.2.pom
(2 KB at 78.4 KB/sec)
[INFO] Downloading: https://repo.maven.apache.org/maven2/org/sonatype/sisu/sisu-parent/1.4.3.2/sisu-parent-1.4.3.2.pom
[INFO] Downloaded: https://repo.maven.apache.org/maven2/org/sonatype/sisu/sisu-parent/1.4.3.2/sisu-parent-1.4.3.2.pom
(8 KB at 493.3 KB/sec)
[INFO] Downloading: https://repo.maven.apache.org/maven2/org/sonatype/sisu/sisu-inject-bean/1.4.3.2/sisu-inject-bean-1.4.3.2.pom
[INFO] Downloaded: https://repo.maven.apache.org/maven2/org/sonatype/sisu/sisu-inject-bean/1.4.3.2/sisu-inject-bean-1.4.3.2.pom
(6 KB at 323.4 KB/sec)
[INFO] Downloading: https://repo.maven.apache.org/maven2/org/sonatype/sisu/sisu-guice/2.9.2/sisu-guice-2.9.2.pom
[INFO] Downloaded: https://repo.maven.apache.org/maven2/org/sonatype/sisu/sisu-guice/2.9.2/sisu-guice-2.9.2.pom
(8 KB at 448.5 KB/sec)
[INFO] Downloading: https://repo.maven.apache.org/maven2/org/sonatype/sisu/inject/guice-parent/2.9.2/guice-parent-2.9.2.pom
[INFO] Downloaded: https://repo.maven.apache.org/maven2/org/sonatype/sisu/inject/guice-parent/2.9.2/guice-parent-2.9.2.pom
(12 KB at 747.3 KB/sec)
[INFO] Downloading: https://repo.maven.apache.org/maven2/org/apache/httpcomponents/httpmime/4.5.2/httpmime-4.5.2.jar
[INFO] Downloading: https://repo.maven.apache.org/maven2/com/fasterxml/jackson/core/jackson-core/2.8.3/jackson-core-2.8.3.jar
[INFO] Downloading: https://repo.maven.apache.org/maven2/com/fasterxml/jackson/core/jackson-annotations/2.8.3/jackson-annotations-2.8.3.jar
[INFO] Downloading: https://repo.maven.apache.org/maven2/com/fasterxml/jackson/core/jackson-databind/2.8.3/jackson-databind-2.8.3.jar
[INFO] Downloading: https://repo.maven.apache.org/maven2/org/eclipse/jgit/org.eclipse.jgit/4.5.0.201609210915-r/org.eclipse.jgit-4.5.0.201609210915-r.jar
[INFO] Downloaded: https://repo.maven.apache.org/maven2/com/fasterxml/jackson/core/jackson-core/2.8.3/jackson-core-2.8.3.jar
(275 KB at 3659.9 KB/sec)
[INFO] Downloading: https://repo.maven.apache.org/maven2/com/googlecode/javaewah/JavaEWAH/0.7.9/JavaEWAH-0.7.9.jar
[INFO] Downloaded: https://repo.maven.apache.org/maven2/com/googlecode/javaewah/JavaEWAH/0.7.9/JavaEWAH-0.7.9.jar
(123 KB at 1247.1 KB/sec)
[INFO] Downloading: https://repo.maven.apache.org/maven2/org/codehaus/plexus/plexus-utils/2.0.7/plexus-utils-2.0.7.jar
[INFO] Downloaded: https://repo.maven.apache.org/maven2/org/apache/httpcomponents/httpmime/4.5.2/httpmime-4.5.2.jar
(41 KB at 381.6 KB/sec)
[INFO] Downloading: https://repo.maven.apache.org/maven2/org/sonatype/sisu/sisu-inject-plexus/1.4.3.2/sisu-inject-plexus-1.4.3.2.jar
[INFO] Downloaded: https://repo.maven.apache.org/maven2/com/fasterxml/jackson/core/jackson-annotations/2.8.3/jackson-annotations-2.8.3.jar
(55 KB at 498.6 KB/sec)
[INFO] Downloading: https://repo.maven.apache.org/maven2/org/sonatype/sisu/sisu-inject-bean/1.4.3.2/sisu-inject-bean-1.4.3.2.jar
[INFO] Downloaded: https://repo.maven.apache.org/maven2/org/codehaus/plexus/plexus-utils/2.0.7/plexus-utils-2.0.7.jar
(219 KB at 1573.3 KB/sec)
[INFO] Downloaded: https://repo.maven.apache.org/maven2/org/sonatype/sisu/sisu-inject-plexus/1.4.3.2/sisu-inject-plexus-1.4.3.2.jar
(201 KB at 1449.8 KB/sec)
[INFO] Downloading: https://repo.maven.apache.org/maven2/org/sonatype/sisu/sisu-guice/2.9.2/sisu-guice-2.9.2-no_aop.jar
[INFO] Downloaded: https://repo.maven.apache.org/maven2/org/sonatype/sisu/sisu-inject-bean/1.4.3.2/sisu-inject-bean-1.4.3.2.jar
(157 KB at 1119.0 KB/sec)
[INFO] Downloaded: https://repo.maven.apache.org/maven2/org/sonatype/sisu/sisu-guice/2.9.2/sisu-guice-2.9.2-no_aop.jar
(469 KB at 2505.8 KB/sec)
[INFO] Downloaded: https://repo.maven.apache.org/maven2/com/fasterxml/jackson/core/jackson-databind/2.8.3/jackson-databind-2.8.3.jar
(1205 KB at 5964.3 KB/sec)
[INFO] Downloaded: https://repo.maven.apache.org/maven2/org/eclipse/jgit/org.eclipse.jgit/4.5.0.201609210915-r/org.eclipse.jgit-4.5.0.201609210915-r.jar
(2324 KB at 8238.8 KB/sec)
[INFO] ------------------------------------------------------------------------
[INFO] Reactor Summary:
[INFO] 
[INFO] Apache CarbonData :: Parent ........................ FAILURE [  2.467 s]
[INFO] Apache CarbonData :: Common ........................ SUCCESS [ 17.105 s]
[INFO] Apache CarbonData :: Core .......................... SUCCESS [03:41 min]
[INFO] Apache CarbonData :: Processing .................... SUCCESS [ 29.851 s]
[INFO] Apache CarbonData :: Hadoop ........................ SUCCESS [ 55.962 s]
[INFO] Apache CarbonData :: Streaming ..................... SUCCESS [ 34.381 s]
[INFO] Apache CarbonData :: Spark Common .................. SUCCESS [01:14 min]
[INFO] Apache CarbonData :: Store SDK ..................... SUCCESS [ 44.847 s]
[INFO] Apache CarbonData :: Search ........................ SUCCESS [ 31.081 s]
[INFO] Apache CarbonData :: Lucene Index DataMap .......... SUCCESS [ 16.440 s]
[INFO] Apache CarbonData :: Bloom Index DataMap ........... SUCCESS [ 16.463 s]
[INFO] Apache CarbonData :: Spark2 ........................ SUCCESS [05:52 min]
[INFO] Apache CarbonData :: Spark Common Test ............. SUCCESS [58:28 min]
[INFO] Apache CarbonData :: DataMap Examples .............. SUCCESS [ 12.753 s]
[INFO] Apache CarbonData :: Assembly ...................... SUCCESS [ 18.866 s]
[INFO] Apache CarbonData :: Hive .......................... SUCCESS [ 38.609 s]
[INFO] Apache CarbonData :: presto ........................ SUCCESS [01:15 min]
[INFO] Apache CarbonData :: Spark2 Examples ............... SUCCESS [02:44 min]
[INFO] ------------------------------------------------------------------------
[INFO] BUILD FAILURE
[INFO] ------------------------------------------------------------------------
[INFO] Total time: 01:20 h
[INFO] Finished at: 2018-05-08T20:07:28+00:00
[INFO] Final Memory: 172M/1497M
[INFO] ------------------------------------------------------------------------
Waiting for Jenkins to finish collecting data
[ERROR] Failed to execute goal org.eluder.coveralls:coveralls-maven-plugin:4.3.0:report (default-cli)
on project carbondata-parent: I/O operation failed: No coverage report files found -> [Help
1]
org.apache.maven.lifecycle.LifecycleExecutionException: Failed to execute goal org.eluder.coveralls:coveralls-maven-plugin:4.3.0:report
(default-cli) on project carbondata-parent: I/O operation failed
	at org.apache.maven.lifecycle.internal.MojoExecutor.execute(MojoExecutor.java:212)
	at org.apache.maven.lifecycle.internal.MojoExecutor.execute(MojoExecutor.java:153)
	at org.apache.maven.lifecycle.internal.MojoExecutor.execute(MojoExecutor.java:145)
	at org.apache.maven.lifecycle.internal.LifecycleModuleBuilder.buildProject(LifecycleModuleBuilder.java:116)
	at org.apache.maven.lifecycle.internal.LifecycleModuleBuilder.buildProject(LifecycleModuleBuilder.java:80)
	at org.apache.maven.lifecycle.internal.builder.singlethreaded.SingleThreadedBuilder.build(SingleThreadedBuilder.java:51)
	at org.apache.maven.lifecycle.internal.LifecycleStarter.execute(LifecycleStarter.java:128)
	at org.apache.maven.DefaultMaven.doExecute(DefaultMaven.java:307)
	at org.apache.maven.DefaultMaven.doExecute(DefaultMaven.java:193)
	at org.apache.maven.DefaultMaven.execute(DefaultMaven.java:106)
	at org.jvnet.hudson.maven3.launcher.Maven33Launcher.main(Maven33Launcher.java:129)
	at sun.reflect.NativeMethodAccessorImpl.invoke0(Native Method)
	at sun.reflect.NativeMethodAccessorImpl.invoke(NativeMethodAccessorImpl.java:62)
	at sun.reflect.DelegatingMethodAccessorImpl.invoke(DelegatingMethodAccessorImpl.java:43)
	at java.lang.reflect.Method.invoke(Method.java:498)
	at org.codehaus.plexus.classworlds.launcher.Launcher.launchStandard(Launcher.java:330)
	at org.codehaus.plexus.classworlds.launcher.Launcher.launch(Launcher.java:238)
	at jenkins.maven3.agent.Maven33Main.launch(Maven33Main.java:176)
	at sun.reflect.NativeMethodAccessorImpl.invoke0(Native Method)
	at sun.reflect.NativeMethodAccessorImpl.invoke(NativeMethodAccessorImpl.java:62)
	at sun.reflect.DelegatingMethodAccessorImpl.invoke(DelegatingMethodAccessorImpl.java:43)
	at java.lang.reflect.Method.invoke(Method.java:498)
	at hudson.maven.Maven3Builder.call(Maven3Builder.java:139)
	at hudson.maven.Maven3Builder.call(Maven3Builder.java:70)
	at hudson.remoting.UserRequest.perform(UserRequest.java:207)
	at hudson.remoting.UserRequest.perform(UserRequest.java:53)
	at hudson.remoting.Request$2.run(Request.java:358)
	at hudson.remoting.InterceptingExecutorService$1.call(InterceptingExecutorService.java:72)
	at java.util.concurrent.FutureTask.run(FutureTask.java:266)
	at java.util.concurrent.ThreadPoolExecutor.runWorker(ThreadPoolExecutor.java:1149)
	at java.util.concurrent.ThreadPoolExecutor$Worker.run(ThreadPoolExecutor.java:624)
	at java.lang.Thread.run(Thread.java:748)
Caused by: org.apache.maven.plugin.MojoFailureException: I/O operation failed
	at org.eluder.coveralls.maven.plugin.CoverallsReportMojo.execute(CoverallsReportMojo.java:259)
	at org.apache.maven.plugin.DefaultBuildPluginManager.executeMojo(DefaultBuildPluginManager.java:134)
	at org.apache.maven.lifecycle.internal.MojoExecutor.execute(MojoExecutor.java:207)
	... 31 more
Caused by: java.io.IOException: No coverage report files found
	at org.eluder.coveralls.maven.plugin.util.CoverageParsersFactory.createParsers(CoverageParsersFactory.java:132)
	at org.eluder.coveralls.maven.plugin.CoverallsReportMojo.createCoverageParsers(CoverallsReportMojo.java:277)
	at org.eluder.coveralls.maven.plugin.CoverallsReportMojo.execute(CoverallsReportMojo.java:241)
	... 33 more
[ERROR] 
[ERROR] Re-run Maven using the -X switch to enable full debug logging.
[ERROR] 
[ERROR] For more information about the errors and possible solutions, please read the following
articles:
[ERROR] [Help 1] http://cwiki.apache.org/confluence/display/MAVEN/MojoFailureException
[JENKINS] Archiving <https://builds.apache.org/job/carbondata-master-spark-2.2/ws/processing/pom.xml>
to org.apache.carbondata/carbondata-processing/1.4.0-SNAPSHOT/carbondata-processing-1.4.0-SNAPSHOT.pom
[JENKINS] Archiving <https://builds.apache.org/job/carbondata-master-spark-2.2/ws/processing/target/carbondata-processing-1.4.0-SNAPSHOT.jar>
to org.apache.carbondata/carbondata-processing/1.4.0-SNAPSHOT/carbondata-processing-1.4.0-SNAPSHOT.jar
[JENKINS] Archiving <https://builds.apache.org/job/carbondata-master-spark-2.2/ws/datamap/examples/pom.xml>
to org.apache.carbondata/carbondata-datamap-examples/1.4.0-SNAPSHOT/carbondata-datamap-examples-1.4.0-SNAPSHOT.pom
[JENKINS] Archiving <https://builds.apache.org/job/carbondata-master-spark-2.2/ws/datamap/examples/target/carbondata-datamap-examples-1.4.0-SNAPSHOT.jar>
to org.apache.carbondata/carbondata-datamap-examples/1.4.0-SNAPSHOT/carbondata-datamap-examples-1.4.0-SNAPSHOT.jar
[JENKINS] Archiving <https://builds.apache.org/job/carbondata-master-spark-2.2/ws/store/search/pom.xml>
to org.apache.carbondata/carbondata-search/1.4.0-SNAPSHOT/carbondata-search-1.4.0-SNAPSHOT.pom
[JENKINS] Archiving <https://builds.apache.org/job/carbondata-master-spark-2.2/ws/store/search/target/carbondata-search-1.4.0-SNAPSHOT.jar>
to org.apache.carbondata/carbondata-search/1.4.0-SNAPSHOT/carbondata-search-1.4.0-SNAPSHOT.jar
[JENKINS] Archiving <https://builds.apache.org/job/carbondata-master-spark-2.2/ws/streaming/pom.xml>
to org.apache.carbondata/carbondata-streaming/1.4.0-SNAPSHOT/carbondata-streaming-1.4.0-SNAPSHOT.pom
[JENKINS] Archiving <https://builds.apache.org/job/carbondata-master-spark-2.2/ws/streaming/target/carbondata-streaming-1.4.0-SNAPSHOT.jar>
to org.apache.carbondata/carbondata-streaming/1.4.0-SNAPSHOT/carbondata-streaming-1.4.0-SNAPSHOT.jar
[JENKINS] Archiving <https://builds.apache.org/job/carbondata-master-spark-2.2/ws/integration/spark-common/pom.xml>
to org.apache.carbondata/carbondata-spark-common/1.4.0-SNAPSHOT/carbondata-spark-common-1.4.0-SNAPSHOT.pom
[JENKINS] Archiving <https://builds.apache.org/job/carbondata-master-spark-2.2/ws/integration/spark-common/target/carbondata-spark-common-1.4.0-SNAPSHOT.jar>
to org.apache.carbondata/carbondata-spark-common/1.4.0-SNAPSHOT/carbondata-spark-common-1.4.0-SNAPSHOT.jar
[JENKINS] Archiving <https://builds.apache.org/job/carbondata-master-spark-2.2/ws/datamap/lucene/pom.xml>
to org.apache.carbondata/carbondata-lucene/1.4.0-SNAPSHOT/carbondata-lucene-1.4.0-SNAPSHOT.pom
[JENKINS] Archiving <https://builds.apache.org/job/carbondata-master-spark-2.2/ws/datamap/lucene/target/carbondata-lucene-1.4.0-SNAPSHOT.jar>
to org.apache.carbondata/carbondata-lucene/1.4.0-SNAPSHOT/carbondata-lucene-1.4.0-SNAPSHOT.jar
[JENKINS] Archiving <https://builds.apache.org/job/carbondata-master-spark-2.2/ws/integration/hive/pom.xml>
to org.apache.carbondata/carbondata-hive/1.4.0-SNAPSHOT/carbondata-hive-1.4.0-SNAPSHOT.pom
[JENKINS] Archiving <https://builds.apache.org/job/carbondata-master-spark-2.2/ws/integration/hive/target/carbondata-hive-1.4.0-SNAPSHOT.jar>
to org.apache.carbondata/carbondata-hive/1.4.0-SNAPSHOT/carbondata-hive-1.4.0-SNAPSHOT.jar
[JENKINS] Archiving <https://builds.apache.org/job/carbondata-master-spark-2.2/ws/common/pom.xml>
to org.apache.carbondata/carbondata-common/1.4.0-SNAPSHOT/carbondata-common-1.4.0-SNAPSHOT.pom
[JENKINS] Archiving <https://builds.apache.org/job/carbondata-master-spark-2.2/ws/common/target/carbondata-common-1.4.0-SNAPSHOT.jar>
to org.apache.carbondata/carbondata-common/1.4.0-SNAPSHOT/carbondata-common-1.4.0-SNAPSHOT.jar
[JENKINS] Archiving <https://builds.apache.org/job/carbondata-master-spark-2.2/ws/examples/spark2/pom.xml>
to org.apache.carbondata/carbondata-examples-spark2/1.4.0-SNAPSHOT/carbondata-examples-spark2-1.4.0-SNAPSHOT.pom
[JENKINS] Archiving <https://builds.apache.org/job/carbondata-master-spark-2.2/ws/examples/spark2/target/carbondata-examples-spark2-1.4.0-SNAPSHOT.jar>
to org.apache.carbondata/carbondata-examples-spark2/1.4.0-SNAPSHOT/carbondata-examples-spark2-1.4.0-SNAPSHOT.jar
[JENKINS] Archiving <https://builds.apache.org/job/carbondata-master-spark-2.2/ws/integration/spark2/pom.xml>
to org.apache.carbondata/carbondata-spark2/1.4.0-SNAPSHOT/carbondata-spark2-1.4.0-SNAPSHOT.pom
[JENKINS] Archiving <https://builds.apache.org/job/carbondata-master-spark-2.2/ws/integration/spark2/target/carbondata-spark2-1.4.0-SNAPSHOT.jar>
to org.apache.carbondata/carbondata-spark2/1.4.0-SNAPSHOT/carbondata-spark2-1.4.0-SNAPSHOT.jar
[JENKINS] Archiving <https://builds.apache.org/job/carbondata-master-spark-2.2/ws/datamap/bloom/pom.xml>
to org.apache.carbondata/carbondata-bloom/1.4.0-SNAPSHOT/carbondata-bloom-1.4.0-SNAPSHOT.pom
[JENKINS] Archiving <https://builds.apache.org/job/carbondata-master-spark-2.2/ws/datamap/bloom/target/carbondata-bloom-1.4.0-SNAPSHOT.jar>
to org.apache.carbondata/carbondata-bloom/1.4.0-SNAPSHOT/carbondata-bloom-1.4.0-SNAPSHOT.jar
[JENKINS] Archiving <https://builds.apache.org/job/carbondata-master-spark-2.2/ws/assembly/pom.xml>
to org.apache.carbondata/carbondata-assembly/1.4.0-SNAPSHOT/carbondata-assembly-1.4.0-SNAPSHOT.pom
[JENKINS] Archiving <https://builds.apache.org/job/carbondata-master-spark-2.2/ws/pom.xml>
to org.apache.carbondata/carbondata-parent/1.4.0-SNAPSHOT/carbondata-parent-1.4.0-SNAPSHOT.pom
[JENKINS] Archiving <https://builds.apache.org/job/carbondata-master-spark-2.2/ws/core/pom.xml>
to org.apache.carbondata/carbondata-core/1.4.0-SNAPSHOT/carbondata-core-1.4.0-SNAPSHOT.pom
[JENKINS] Archiving <https://builds.apache.org/job/carbondata-master-spark-2.2/ws/core/target/carbondata-core-1.4.0-SNAPSHOT.jar>
to org.apache.carbondata/carbondata-core/1.4.0-SNAPSHOT/carbondata-core-1.4.0-SNAPSHOT.jar
[JENKINS] Archiving <https://builds.apache.org/job/carbondata-master-spark-2.2/ws/hadoop/pom.xml>
to org.apache.carbondata/carbondata-hadoop/1.4.0-SNAPSHOT/carbondata-hadoop-1.4.0-SNAPSHOT.pom
[JENKINS] Archiving <https://builds.apache.org/job/carbondata-master-spark-2.2/ws/hadoop/target/carbondata-hadoop-1.4.0-SNAPSHOT.jar>
to org.apache.carbondata/carbondata-hadoop/1.4.0-SNAPSHOT/carbondata-hadoop-1.4.0-SNAPSHOT.jar
[JENKINS] Archiving <https://builds.apache.org/job/carbondata-master-spark-2.2/ws/integration/presto/pom.xml>
to org.apache.carbondata/carbondata-presto/1.4.0-SNAPSHOT/carbondata-presto-1.4.0-SNAPSHOT.pom
[JENKINS] Archiving <https://builds.apache.org/job/carbondata-master-spark-2.2/ws/integration/presto/target/carbondata-presto-1.4.0-SNAPSHOT.zip>
to org.apache.carbondata/carbondata-presto/1.4.0-SNAPSHOT/carbondata-presto-1.4.0-SNAPSHOT.zip
[JENKINS] Archiving <https://builds.apache.org/job/carbondata-master-spark-2.2/ws/integration/presto/target/carbondata-presto-1.4.0-SNAPSHOT.jar>
to org.apache.carbondata/carbondata-presto/1.4.0-SNAPSHOT/carbondata-presto-1.4.0-SNAPSHOT.jar
[Fast Archiver] Compressed 77.33 MB of artifacts by 94.8% relative to #405
[JENKINS] Archiving <https://builds.apache.org/job/carbondata-master-spark-2.2/ws/integration/spark-common-test/pom.xml>
to org.apache.carbondata/carbondata-spark-common-test/1.4.0-SNAPSHOT/carbondata-spark-common-test-1.4.0-SNAPSHOT.pom
[JENKINS] Archiving <https://builds.apache.org/job/carbondata-master-spark-2.2/ws/integration/spark-common-test/target/carbondata-spark-common-test-1.4.0-SNAPSHOT.jar>
to org.apache.carbondata/carbondata-spark-common-test/1.4.0-SNAPSHOT/carbondata-spark-common-test-1.4.0-SNAPSHOT.jar
[JENKINS] Archiving <https://builds.apache.org/job/carbondata-master-spark-2.2/ws/store/sdk/pom.xml>
to org.apache.carbondata/carbondata-store-sdk/1.4.0-SNAPSHOT/carbondata-store-sdk-1.4.0-SNAPSHOT.pom
[JENKINS] Archiving <https://builds.apache.org/job/carbondata-master-spark-2.2/ws/store/sdk/target/carbondata-store-sdk-1.4.0-SNAPSHOT.jar>
to org.apache.carbondata/carbondata-store-sdk/1.4.0-SNAPSHOT/carbondata-store-sdk-1.4.0-SNAPSHOT.jar
Sending e-mails to: commits@carbondata.apache.org
Sending e-mails to: commits@carbondata.apache.org
channel stopped
Not sending mail to unregistered user kunalkapoor642@gmail.com

Mime
View raw message