carbondata-commits mailing list archives

Site index · List index
Message view « Date » · « Thread »
Top « Date » · « Thread »
From Apache Jenkins Server <jenk...@builds.apache.org>
Subject Build failed in Jenkins: carbondata-master-spark-2.2 #413
Date Wed, 09 May 2018 12:52:21 GMT
See <https://builds.apache.org/job/carbondata-master-spark-2.2/413/display/redirect?page=changes>

Changes:

[QiangCai] [CARBONDATA-2416] Support DEFERRED REBUILD when creating DataMap

------------------------------------------
[...truncated 269.97 MB...]
time for query on table with lucene datamap table:0.413
time for query on table without lucene datamap table:0.454
+-----------------+-------------+
|               id|         name|
+-----------------+-------------+
|which test1 good2|who and name6|
|which test1 good2|who and name6|
|which test1 good7|who and name2|
|which test1 good7|who and name2|
|which test1 good8|who and name1|
|which test1 good8|who and name1|
+-----------------+-------------+

+-----------------+-------------+
|               id|         name|
+-----------------+-------------+
|which test1 good2|who and name6|
|which test1 good2|who and name6|
|which test1 good7|who and name2|
|which test1 good7|who and name2|
|which test1 good8|who and name1|
|which test1 good8|who and name1|
+-----------------+-------------+

18/05/09 05:51:12 AUDIT CarbonDropTableCommand: [asf933.gq1.ygridcore.net][jenkins][Thread-1]Deleting
table [persontable] under database [default]
18/05/09 05:51:12 AUDIT CarbonDropTableCommand: [asf933.gq1.ygridcore.net][jenkins][Thread-1]Deleted
table [persontable] under database [default]
- LuceneDataMapExample
18/05/09 05:51:12 AUDIT CarbonCreateTableCommand: [asf933.gq1.ygridcore.net][jenkins][Thread-1]Creating
Table with Database name [default] and Table name [origin_table]
18/05/09 05:51:12 AUDIT CarbonCreateTableCommand: [asf933.gq1.ygridcore.net][jenkins][Thread-1]Table
created with Database name [default] and Table name [origin_table]
18/05/09 05:51:12 AUDIT CarbonDataRDDFactory$: [asf933.gq1.ygridcore.net][jenkins][Thread-1]Data
load request has been received for table default.origin_table
18/05/09 05:51:12 ERROR DataLoadExecutor: [Executor task launch worker for task 2295][partitionID:table;queryID:15507512310540160]
Data Load is partially success for table origin_table
18/05/09 05:51:12 AUDIT CarbonDataRDDFactory$: [asf933.gq1.ygridcore.net][jenkins][Thread-1]Data
load is successful for default.origin_table
18/05/09 05:51:12 AUDIT CarbonDataRDDFactory$: [asf933.gq1.ygridcore.net][jenkins][Thread-1]Data
load request has been received for table default.origin_table
18/05/09 05:51:12 ERROR DataLoadExecutor: [Executor task launch worker for task 2296][partitionID:table;queryID:15507512541552915]
Data Load is partially success for table origin_table
18/05/09 05:51:12 AUDIT CarbonDataRDDFactory$: [asf933.gq1.ygridcore.net][jenkins][Thread-1]Data
load is successful for default.origin_table
18/05/09 05:51:12 AUDIT CarbonDataRDDFactory$: [asf933.gq1.ygridcore.net][jenkins][Thread-1]Data
load request has been received for table default.origin_table
18/05/09 05:51:13 ERROR DataLoadExecutor: [Executor task launch worker for task 2297][partitionID:table;queryID:15507512759588480]
Data Load is partially success for table origin_table
18/05/09 05:51:13 AUDIT CarbonDataRDDFactory$: [asf933.gq1.ygridcore.net][jenkins][Thread-1]Data
load is successful for default.origin_table
18/05/09 05:51:13 AUDIT CarbonDataRDDFactory$: [asf933.gq1.ygridcore.net][jenkins][Thread-1]Data
load request has been received for table default.origin_table
18/05/09 05:51:13 ERROR DataLoadExecutor: [Executor task launch worker for task 2298][partitionID:table;queryID:15507512992953014]
Data Load is partially success for table origin_table
18/05/09 05:51:13 AUDIT CarbonDataRDDFactory$: [asf933.gq1.ygridcore.net][jenkins][Thread-1]Data
load is successful for default.origin_table
+--------+
|count(1)|
+--------+
|      40|
+--------+

18/05/09 05:51:13 AUDIT CarbonCreateTableCommand: [asf933.gq1.ygridcore.net][jenkins][Thread-1]Creating
Table with Database name [default] and Table name [external_table]
18/05/09 05:51:13 AUDIT CarbonCreateTableCommand: [asf933.gq1.ygridcore.net][jenkins][Thread-1]Table
created with Database name [default] and Table name [external_table]
+--------+
|count(1)|
+--------+
|      40|
+--------+

18/05/09 05:51:13 AUDIT CarbonDataRDDFactory$: [asf933.gq1.ygridcore.net][jenkins][Thread-1]Data
load request has been received for table default.origin_table
18/05/09 05:51:13 ERROR DataLoadExecutor: [Executor task launch worker for task 2303][partitionID:table;queryID:15507513508808731]
Data Load is partially success for table origin_table
18/05/09 05:51:13 AUDIT CarbonDataRDDFactory$: [asf933.gq1.ygridcore.net][jenkins][Thread-1]Data
load is successful for default.origin_table
18/05/09 05:51:13 AUDIT CarbonDataRDDFactory$: [asf933.gq1.ygridcore.net][jenkins][Thread-1]Data
load request has been received for table default.origin_table
18/05/09 05:51:14 ERROR DataLoadExecutor: [Executor task launch worker for task 2304][partitionID:table;queryID:15507513734280319]
Data Load is partially success for table origin_table
18/05/09 05:51:14 AUDIT CarbonDataRDDFactory$: [asf933.gq1.ygridcore.net][jenkins][Thread-1]Data
load is successful for default.origin_table
+--------+
|count(1)|
+--------+
|      60|
+--------+

18/05/09 05:51:14 AUDIT CarbonDropTableCommand: [asf933.gq1.ygridcore.net][jenkins][Thread-1]Deleting
table [origin_table] under database [default]
18/05/09 05:51:14 AUDIT CarbonDropTableCommand: [asf933.gq1.ygridcore.net][jenkins][Thread-1]Deleted
table [origin_table] under database [default]
- ExternalTableExample
Run completed in 2 minutes, 25 seconds.
Total number of tests run: 17
Suites: completed 2, aborted 0
Tests: succeeded 17, failed 0, canceled 0, ignored 0, pending 0
All tests passed.
[JENKINS] Recording test results
[INFO] 
[INFO] --- maven-jar-plugin:2.5:jar (default-jar) @ carbondata-examples-spark2 ---
[INFO] Building jar: <https://builds.apache.org/job/carbondata-master-spark-2.2/ws/examples/spark2/target/carbondata-examples-spark2-1.4.0-SNAPSHOT.jar>
[INFO] 
[INFO] --- maven-site-plugin:3.4:attach-descriptor (attach-descriptor) @ carbondata-examples-spark2
---
[INFO] 
[INFO] --- jacoco-maven-plugin:0.7.9:prepare-agent-integration (default-prepare-agent-integration)
@ carbondata-examples-spark2 ---
[INFO] argLine set to -javaagent:/home/jenkins/jenkins-slave/maven-repositories/0/org/jacoco/org.jacoco.agent/0.7.9/org.jacoco.agent-0.7.9-runtime.jar=destfile=<https://builds.apache.org/job/carbondata-master-spark-2.2/ws/examples/spark2/target/jacoco-it.exec>
[INFO] 
[INFO] --- maven-checkstyle-plugin:2.17:check (default) @ carbondata-examples-spark2 ---
[INFO] 
[INFO] --- scalastyle-maven-plugin:0.8.0:check (default) @ carbondata-examples-spark2 ---
Saving to outputFile=<https://builds.apache.org/job/carbondata-master-spark-2.2/ws/examples/spark2/target/scalastyle-output.xml>
Processed 33 file(s)
Found 0 errors
Found 0 warnings
Found 0 infos
Finished in 803 ms
[INFO] 
[INFO] --- jacoco-maven-plugin:0.7.9:report (default-report) @ carbondata-examples-spark2
---
[INFO] Skipping JaCoCo execution due to missing execution data file.
[INFO] 
[INFO] --- jacoco-maven-plugin:0.7.9:report-integration (default-report-integration) @ carbondata-examples-spark2
---
[INFO] Skipping JaCoCo execution due to missing execution data file.
[INFO] 
[INFO] --- jacoco-maven-plugin:0.7.9:check (default-check) @ carbondata-examples-spark2 ---
[INFO] Skipping JaCoCo execution due to missing execution data <https://builds.apache.org/job/carbondata-master-spark-2.2/ws/examples/spark2/target/jacoco.exec>
[INFO] 
[INFO] --- maven-install-plugin:2.5.2:install (default-install) @ carbondata-examples-spark2
---
[INFO] Installing <https://builds.apache.org/job/carbondata-master-spark-2.2/ws/examples/spark2/target/carbondata-examples-spark2-1.4.0-SNAPSHOT.jar>
to /home/jenkins/jenkins-slave/maven-repositories/0/org/apache/carbondata/carbondata-examples-spark2/1.4.0-SNAPSHOT/carbondata-examples-spark2-1.4.0-SNAPSHOT.jar
[INFO] Installing <https://builds.apache.org/job/carbondata-master-spark-2.2/ws/examples/spark2/pom.xml>
to /home/jenkins/jenkins-slave/maven-repositories/0/org/apache/carbondata/carbondata-examples-spark2/1.4.0-SNAPSHOT/carbondata-examples-spark2-1.4.0-SNAPSHOT.pom
[INFO]                                                                         
[INFO] ------------------------------------------------------------------------
[INFO] Building Apache CarbonData :: Parent 1.4.0-SNAPSHOT
[INFO] ------------------------------------------------------------------------
[INFO] 
[INFO] --- coveralls-maven-plugin:4.3.0:report (default-cli) @ carbondata-parent ---
[INFO] Starting Coveralls job for jenkins (413 / https://builds.apache.org/job/carbondata-master-spark-2.2/413/)
[INFO] Using repository token <secret>
[INFO] Git commit 747be9b in master
[INFO] Writing Coveralls data to <https://builds.apache.org/job/carbondata-master-spark-2.2/ws/target/coveralls.json...>
[INFO] Processing coverage report from <https://builds.apache.org/job/carbondata-master-spark-2.2/ws/target/carbondata-coverage-report/carbondata-coverage-report.xml>
[INFO] ------------------------------------------------------------------------
[INFO] Reactor Summary:
[INFO] 
[INFO] Apache CarbonData :: Parent ........................ FAILURE [  1.620 s]
[INFO] Apache CarbonData :: Common ........................ SUCCESS [ 19.137 s]
[INFO] Apache CarbonData :: Core .......................... SUCCESS [02:56 min]
[INFO] Apache CarbonData :: Processing .................... SUCCESS [ 35.452 s]
[INFO] Apache CarbonData :: Hadoop ........................ SUCCESS [ 28.779 s]
[INFO] Apache CarbonData :: Streaming ..................... SUCCESS [ 38.632 s]
[INFO] Apache CarbonData :: Spark Common .................. SUCCESS [01:33 min]
[INFO] Apache CarbonData :: Store SDK ..................... SUCCESS [ 49.668 s]
[INFO] Apache CarbonData :: Search ........................ SUCCESS [ 39.676 s]
[INFO] Apache CarbonData :: Lucene Index DataMap .......... SUCCESS [ 20.094 s]
[INFO] Apache CarbonData :: Bloom Index DataMap ........... SUCCESS [ 18.197 s]
[INFO] Apache CarbonData :: Spark2 ........................ SUCCESS [22:35 min]
[INFO] Apache CarbonData :: Spark Common Test ............. SUCCESS [  01:10 h]
[INFO] Apache CarbonData :: DataMap Examples .............. SUCCESS [ 12.906 s]
[INFO] Apache CarbonData :: Assembly ...................... SUCCESS [ 21.947 s]
[INFO] Apache CarbonData :: Hive .......................... SUCCESS [ 45.125 s]
[INFO] Apache CarbonData :: presto ........................ SUCCESS [01:32 min]
[INFO] Apache CarbonData :: Spark2 Examples ............... SUCCESS [03:25 min]
[INFO] ------------------------------------------------------------------------
[INFO] BUILD FAILURE
[INFO] ------------------------------------------------------------------------
[INFO] Total time: 01:49 h
[INFO] Finished at: 2018-05-09T12:51:46+00:00
[INFO] Final Memory: 182M/1558M
[INFO] ------------------------------------------------------------------------
Waiting for Jenkins to finish collecting data
[ERROR] Failed to execute goal org.eluder.coveralls:coveralls-maven-plugin:4.3.0:report (default-cli)
on project carbondata-parent: I/O operation failed: No source found for org/apache/spark/sql/SparkCarbonFileFormat.scala
-> [Help 1]
org.apache.maven.lifecycle.LifecycleExecutionException: Failed to execute goal org.eluder.coveralls:coveralls-maven-plugin:4.3.0:report
(default-cli) on project carbondata-parent: I/O operation failed
	at org.apache.maven.lifecycle.internal.MojoExecutor.execute(MojoExecutor.java:212)
	at org.apache.maven.lifecycle.internal.MojoExecutor.execute(MojoExecutor.java:153)
	at org.apache.maven.lifecycle.internal.MojoExecutor.execute(MojoExecutor.java:145)
	at org.apache.maven.lifecycle.internal.LifecycleModuleBuilder.buildProject(LifecycleModuleBuilder.java:116)
	at org.apache.maven.lifecycle.internal.LifecycleModuleBuilder.buildProject(LifecycleModuleBuilder.java:80)
	at org.apache.maven.lifecycle.internal.builder.singlethreaded.SingleThreadedBuilder.build(SingleThreadedBuilder.java:51)
	at org.apache.maven.lifecycle.internal.LifecycleStarter.execute(LifecycleStarter.java:128)
	at org.apache.maven.DefaultMaven.doExecute(DefaultMaven.java:307)
	at org.apache.maven.DefaultMaven.doExecute(DefaultMaven.java:193)
	at org.apache.maven.DefaultMaven.execute(DefaultMaven.java:106)
	at org.jvnet.hudson.maven3.launcher.Maven33Launcher.main(Maven33Launcher.java:129)
	at sun.reflect.NativeMethodAccessorImpl.invoke0(Native Method)
	at sun.reflect.NativeMethodAccessorImpl.invoke(NativeMethodAccessorImpl.java:62)
	at sun.reflect.DelegatingMethodAccessorImpl.invoke(DelegatingMethodAccessorImpl.java:43)
	at java.lang.reflect.Method.invoke(Method.java:498)
	at org.codehaus.plexus.classworlds.launcher.Launcher.launchStandard(Launcher.java:330)
	at org.codehaus.plexus.classworlds.launcher.Launcher.launch(Launcher.java:238)
	at jenkins.maven3.agent.Maven33Main.launch(Maven33Main.java:176)
	at sun.reflect.NativeMethodAccessorImpl.invoke0(Native Method)
	at sun.reflect.NativeMethodAccessorImpl.invoke(NativeMethodAccessorImpl.java:62)
	at sun.reflect.DelegatingMethodAccessorImpl.invoke(DelegatingMethodAccessorImpl.java:43)
	at java.lang.reflect.Method.invoke(Method.java:498)
	at hudson.maven.Maven3Builder.call(Maven3Builder.java:139)
	at hudson.maven.Maven3Builder.call(Maven3Builder.java:70)
	at hudson.remoting.UserRequest.perform(UserRequest.java:207)
	at hudson.remoting.UserRequest.perform(UserRequest.java:53)
	at hudson.remoting.Request$2.run(Request.java:358)
	at hudson.remoting.InterceptingExecutorService$1.call(InterceptingExecutorService.java:72)
	at java.util.concurrent.FutureTask.run(FutureTask.java:266)
	at java.util.concurrent.ThreadPoolExecutor.runWorker(ThreadPoolExecutor.java:1149)
	at java.util.concurrent.ThreadPoolExecutor$Worker.run(ThreadPoolExecutor.java:624)
	at java.lang.Thread.run(Thread.java:748)
Caused by: org.apache.maven.plugin.MojoFailureException: I/O operation failed
	at org.eluder.coveralls.maven.plugin.CoverallsReportMojo.execute(CoverallsReportMojo.java:259)
	at org.apache.maven.plugin.DefaultBuildPluginManager.executeMojo(DefaultBuildPluginManager.java:134)
	at org.apache.maven.lifecycle.internal.MojoExecutor.execute(MojoExecutor.java:207)
	... 31 more
Caused by: java.io.IOException: No source found for org/apache/spark/sql/SparkCarbonFileFormat.scala
	at org.eluder.coveralls.maven.plugin.source.MultiSourceLoader.load(MultiSourceLoader.java:52)
	at org.eluder.coveralls.maven.plugin.parser.AbstractXmlEventParser.loadSource(AbstractXmlEventParser.java:106)
	at org.eluder.coveralls.maven.plugin.parser.JaCoCoParser.onEvent(JaCoCoParser.java:56)
	at org.eluder.coveralls.maven.plugin.parser.AbstractXmlEventParser.parse(AbstractXmlEventParser.java:64)
	at org.eluder.coveralls.maven.plugin.CoverallsReportMojo.writeCoveralls(CoverallsReportMojo.java:386)
	at org.eluder.coveralls.maven.plugin.CoverallsReportMojo.execute(CoverallsReportMojo.java:250)
	... 33 more
[ERROR] 
[ERROR] Re-run Maven using the -X switch to enable full debug logging.
[ERROR] 
[ERROR] For more information about the errors and possible solutions, please read the following
articles:
[ERROR] [Help 1] http://cwiki.apache.org/confluence/display/MAVEN/MojoFailureException
[JENKINS] Archiving <https://builds.apache.org/job/carbondata-master-spark-2.2/ws/processing/pom.xml>
to org.apache.carbondata/carbondata-processing/1.4.0-SNAPSHOT/carbondata-processing-1.4.0-SNAPSHOT.pom
[JENKINS] Archiving <https://builds.apache.org/job/carbondata-master-spark-2.2/ws/processing/target/carbondata-processing-1.4.0-SNAPSHOT.jar>
to org.apache.carbondata/carbondata-processing/1.4.0-SNAPSHOT/carbondata-processing-1.4.0-SNAPSHOT.jar
[Fast Archiver] No artifacts from carbondata-master-spark-2.2 » Apache CarbonData :: Processing
#414 to compare, so performing full copy of artifacts
[JENKINS] Archiving <https://builds.apache.org/job/carbondata-master-spark-2.2/ws/datamap/examples/pom.xml>
to org.apache.carbondata/carbondata-datamap-examples/1.4.0-SNAPSHOT/carbondata-datamap-examples-1.4.0-SNAPSHOT.pom
[JENKINS] Archiving <https://builds.apache.org/job/carbondata-master-spark-2.2/ws/datamap/examples/target/carbondata-datamap-examples-1.4.0-SNAPSHOT.jar>
to org.apache.carbondata/carbondata-datamap-examples/1.4.0-SNAPSHOT/carbondata-datamap-examples-1.4.0-SNAPSHOT.jar
[JENKINS] Archiving <https://builds.apache.org/job/carbondata-master-spark-2.2/ws/store/search/pom.xml>
to org.apache.carbondata/carbondata-search/1.4.0-SNAPSHOT/carbondata-search-1.4.0-SNAPSHOT.pom
[JENKINS] Archiving <https://builds.apache.org/job/carbondata-master-spark-2.2/ws/store/search/target/carbondata-search-1.4.0-SNAPSHOT.jar>
to org.apache.carbondata/carbondata-search/1.4.0-SNAPSHOT/carbondata-search-1.4.0-SNAPSHOT.jar
[Fast Archiver] No artifacts from carbondata-master-spark-2.2 » Apache CarbonData :: Search
#414 to compare, so performing full copy of artifacts
[JENKINS] Archiving <https://builds.apache.org/job/carbondata-master-spark-2.2/ws/streaming/pom.xml>
to org.apache.carbondata/carbondata-streaming/1.4.0-SNAPSHOT/carbondata-streaming-1.4.0-SNAPSHOT.pom
[JENKINS] Archiving <https://builds.apache.org/job/carbondata-master-spark-2.2/ws/streaming/target/carbondata-streaming-1.4.0-SNAPSHOT.jar>
to org.apache.carbondata/carbondata-streaming/1.4.0-SNAPSHOT/carbondata-streaming-1.4.0-SNAPSHOT.jar
[Fast Archiver] No artifacts from carbondata-master-spark-2.2 » Apache CarbonData :: Streaming
#414 to compare, so performing full copy of artifacts
[JENKINS] Archiving <https://builds.apache.org/job/carbondata-master-spark-2.2/ws/integration/spark-common/pom.xml>
to org.apache.carbondata/carbondata-spark-common/1.4.0-SNAPSHOT/carbondata-spark-common-1.4.0-SNAPSHOT.pom
[JENKINS] Archiving <https://builds.apache.org/job/carbondata-master-spark-2.2/ws/integration/spark-common/target/carbondata-spark-common-1.4.0-SNAPSHOT.jar>
to org.apache.carbondata/carbondata-spark-common/1.4.0-SNAPSHOT/carbondata-spark-common-1.4.0-SNAPSHOT.jar
[Fast Archiver] No artifacts from carbondata-master-spark-2.2 » Apache CarbonData :: Spark
Common #414 to compare, so performing full copy of artifacts
[JENKINS] Archiving <https://builds.apache.org/job/carbondata-master-spark-2.2/ws/datamap/lucene/pom.xml>
to org.apache.carbondata/carbondata-lucene/1.4.0-SNAPSHOT/carbondata-lucene-1.4.0-SNAPSHOT.pom
[JENKINS] Archiving <https://builds.apache.org/job/carbondata-master-spark-2.2/ws/datamap/lucene/target/carbondata-lucene-1.4.0-SNAPSHOT.jar>
to org.apache.carbondata/carbondata-lucene/1.4.0-SNAPSHOT/carbondata-lucene-1.4.0-SNAPSHOT.jar
[Fast Archiver] No artifacts from carbondata-master-spark-2.2 » Apache CarbonData :: Lucene
Index DataMap #414 to compare, so performing full copy of artifacts
[JENKINS] Archiving <https://builds.apache.org/job/carbondata-master-spark-2.2/ws/integration/hive/pom.xml>
to org.apache.carbondata/carbondata-hive/1.4.0-SNAPSHOT/carbondata-hive-1.4.0-SNAPSHOT.pom
[JENKINS] Archiving <https://builds.apache.org/job/carbondata-master-spark-2.2/ws/integration/hive/target/carbondata-hive-1.4.0-SNAPSHOT.jar>
to org.apache.carbondata/carbondata-hive/1.4.0-SNAPSHOT/carbondata-hive-1.4.0-SNAPSHOT.jar
[JENKINS] Archiving <https://builds.apache.org/job/carbondata-master-spark-2.2/ws/common/pom.xml>
to org.apache.carbondata/carbondata-common/1.4.0-SNAPSHOT/carbondata-common-1.4.0-SNAPSHOT.pom
[JENKINS] Archiving <https://builds.apache.org/job/carbondata-master-spark-2.2/ws/common/target/carbondata-common-1.4.0-SNAPSHOT.jar>
to org.apache.carbondata/carbondata-common/1.4.0-SNAPSHOT/carbondata-common-1.4.0-SNAPSHOT.jar
[Fast Archiver] No artifacts from carbondata-master-spark-2.2 » Apache CarbonData :: Common
#414 to compare, so performing full copy of artifacts
[JENKINS] Archiving <https://builds.apache.org/job/carbondata-master-spark-2.2/ws/examples/spark2/pom.xml>
to org.apache.carbondata/carbondata-examples-spark2/1.4.0-SNAPSHOT/carbondata-examples-spark2-1.4.0-SNAPSHOT.pom
[JENKINS] Archiving <https://builds.apache.org/job/carbondata-master-spark-2.2/ws/examples/spark2/target/carbondata-examples-spark2-1.4.0-SNAPSHOT.jar>
to org.apache.carbondata/carbondata-examples-spark2/1.4.0-SNAPSHOT/carbondata-examples-spark2-1.4.0-SNAPSHOT.jar
[JENKINS] Archiving <https://builds.apache.org/job/carbondata-master-spark-2.2/ws/integration/spark2/pom.xml>
to org.apache.carbondata/carbondata-spark2/1.4.0-SNAPSHOT/carbondata-spark2-1.4.0-SNAPSHOT.pom
[JENKINS] Archiving <https://builds.apache.org/job/carbondata-master-spark-2.2/ws/integration/spark2/target/carbondata-spark2-1.4.0-SNAPSHOT.jar>
to org.apache.carbondata/carbondata-spark2/1.4.0-SNAPSHOT/carbondata-spark2-1.4.0-SNAPSHOT.jar
[JENKINS] Archiving <https://builds.apache.org/job/carbondata-master-spark-2.2/ws/datamap/bloom/pom.xml>
to org.apache.carbondata/carbondata-bloom/1.4.0-SNAPSHOT/carbondata-bloom-1.4.0-SNAPSHOT.pom
[JENKINS] Archiving <https://builds.apache.org/job/carbondata-master-spark-2.2/ws/datamap/bloom/target/carbondata-bloom-1.4.0-SNAPSHOT.jar>
to org.apache.carbondata/carbondata-bloom/1.4.0-SNAPSHOT/carbondata-bloom-1.4.0-SNAPSHOT.jar
[Fast Archiver] No artifacts from carbondata-master-spark-2.2 » Apache CarbonData :: Bloom
Index DataMap #414 to compare, so performing full copy of artifacts
[JENKINS] Archiving <https://builds.apache.org/job/carbondata-master-spark-2.2/ws/assembly/pom.xml>
to org.apache.carbondata/carbondata-assembly/1.4.0-SNAPSHOT/carbondata-assembly-1.4.0-SNAPSHOT.pom
[JENKINS] Archiving <https://builds.apache.org/job/carbondata-master-spark-2.2/ws/pom.xml>
to org.apache.carbondata/carbondata-parent/1.4.0-SNAPSHOT/carbondata-parent-1.4.0-SNAPSHOT.pom
[JENKINS] Archiving <https://builds.apache.org/job/carbondata-master-spark-2.2/ws/core/pom.xml>
to org.apache.carbondata/carbondata-core/1.4.0-SNAPSHOT/carbondata-core-1.4.0-SNAPSHOT.pom
[JENKINS] Archiving <https://builds.apache.org/job/carbondata-master-spark-2.2/ws/core/target/carbondata-core-1.4.0-SNAPSHOT.jar>
to org.apache.carbondata/carbondata-core/1.4.0-SNAPSHOT/carbondata-core-1.4.0-SNAPSHOT.jar
[Fast Archiver] No artifacts from carbondata-master-spark-2.2 » Apache CarbonData :: Core
#414 to compare, so performing full copy of artifacts
[JENKINS] Archiving <https://builds.apache.org/job/carbondata-master-spark-2.2/ws/hadoop/pom.xml>
to org.apache.carbondata/carbondata-hadoop/1.4.0-SNAPSHOT/carbondata-hadoop-1.4.0-SNAPSHOT.pom
[JENKINS] Archiving <https://builds.apache.org/job/carbondata-master-spark-2.2/ws/hadoop/target/carbondata-hadoop-1.4.0-SNAPSHOT.jar>
to org.apache.carbondata/carbondata-hadoop/1.4.0-SNAPSHOT/carbondata-hadoop-1.4.0-SNAPSHOT.jar
[Fast Archiver] No artifacts from carbondata-master-spark-2.2 » Apache CarbonData :: Hadoop
#414 to compare, so performing full copy of artifacts
[JENKINS] Archiving <https://builds.apache.org/job/carbondata-master-spark-2.2/ws/integration/presto/pom.xml>
to org.apache.carbondata/carbondata-presto/1.4.0-SNAPSHOT/carbondata-presto-1.4.0-SNAPSHOT.pom
[JENKINS] Archiving <https://builds.apache.org/job/carbondata-master-spark-2.2/ws/integration/presto/target/carbondata-presto-1.4.0-SNAPSHOT.zip>
to org.apache.carbondata/carbondata-presto/1.4.0-SNAPSHOT/carbondata-presto-1.4.0-SNAPSHOT.zip
[JENKINS] Archiving <https://builds.apache.org/job/carbondata-master-spark-2.2/ws/integration/presto/target/carbondata-presto-1.4.0-SNAPSHOT.jar>
to org.apache.carbondata/carbondata-presto/1.4.0-SNAPSHOT/carbondata-presto-1.4.0-SNAPSHOT.jar
[Fast Archiver] Compressed 77.33 MB of artifacts by 94.8% relative to #412
[JENKINS] Archiving <https://builds.apache.org/job/carbondata-master-spark-2.2/ws/integration/spark-common-test/pom.xml>
to org.apache.carbondata/carbondata-spark-common-test/1.4.0-SNAPSHOT/carbondata-spark-common-test-1.4.0-SNAPSHOT.pom
[JENKINS] Archiving <https://builds.apache.org/job/carbondata-master-spark-2.2/ws/integration/spark-common-test/target/carbondata-spark-common-test-1.4.0-SNAPSHOT.jar>
to org.apache.carbondata/carbondata-spark-common-test/1.4.0-SNAPSHOT/carbondata-spark-common-test-1.4.0-SNAPSHOT.jar
[JENKINS] Archiving <https://builds.apache.org/job/carbondata-master-spark-2.2/ws/store/sdk/pom.xml>
to org.apache.carbondata/carbondata-store-sdk/1.4.0-SNAPSHOT/carbondata-store-sdk-1.4.0-SNAPSHOT.pom
[JENKINS] Archiving <https://builds.apache.org/job/carbondata-master-spark-2.2/ws/store/sdk/target/carbondata-store-sdk-1.4.0-SNAPSHOT.jar>
to org.apache.carbondata/carbondata-store-sdk/1.4.0-SNAPSHOT/carbondata-store-sdk-1.4.0-SNAPSHOT.jar
[Fast Archiver] No artifacts from carbondata-master-spark-2.2 » Apache CarbonData :: Store
SDK #414 to compare, so performing full copy of artifacts
Sending e-mails to: commits@carbondata.apache.org
channel stopped
Not sending mail to unregistered user jacky.likun@qq.com
Not sending mail to unregistered user kunalkapoor642@gmail.com

Mime
View raw message