carbondata-commits mailing list archives

Site index · List index
Message view « Date » · « Thread »
Top « Date » · « Thread »
From Apache Jenkins Server <jenk...@builds.apache.org>
Subject Build failed in Jenkins: carbondata-master-spark-2.2 #615
Date Fri, 06 Jul 2018 08:03:29 GMT
See <https://builds.apache.org/job/carbondata-master-spark-2.2/615/display/redirect?page=changes>

Changes:

[jacky.likun] [CARBONDATA-2683][32K] fix data convertion problem for Varchar

------------------------------------------
[...truncated 5.72 MB...]
|which test1 good8|who and name3|
|which test1 good8|who and name3|
|which test1 good8|who and name4|
|which test1 good8|who and name4|
|which test1 good9|who and name1|
|which test1 good9|who and name1|
+-----------------+-------------+

+-----------------+-------------+
|               id|         name|
+-----------------+-------------+
|which test1 good0|who and name6|
|which test1 good0|who and name6|
|which test1 good1|who and name1|
|which test1 good1|who and name1|
|which test1 good1|who and name6|
|which test1 good1|who and name6|
|which test1 good1|who and name6|
|which test1 good1|who and name6|
|which test1 good2|who and name0|
|which test1 good2|who and name0|
+-----------------+-------------+

18/07/06 00:40:23 AUDIT CarbonDropTableCommand: [jenkins-ubuntu2][jenkins][Thread-1]Deleting
table [persontable] under database [default]
18/07/06 00:40:23 AUDIT CarbonDropTableCommand: [jenkins-ubuntu2][jenkins][Thread-1]Deleted
table [persontable] under database [default]
- LuceneDataMapExample
18/07/06 00:40:23 AUDIT CarbonCreateTableCommand: [jenkins-ubuntu2][jenkins][Thread-1]Creating
Table with Database name [default] and Table name [origin_table]
18/07/06 00:40:23 AUDIT CarbonCreateTableCommand: [jenkins-ubuntu2][jenkins][Thread-1]Table
created with Database name [default] and Table name [origin_table]
18/07/06 00:40:23 AUDIT CarbonDataRDDFactory$: [jenkins-ubuntu2][jenkins][Thread-1]Data load
request has been received for table default.origin_table
18/07/06 00:40:24 ERROR DataLoadExecutor: [Executor task launch worker for task 2299][partitionID:table;queryID:9129716913567128]
Data Load is partially success for table origin_table
18/07/06 00:40:24 AUDIT CarbonDataRDDFactory$: [jenkins-ubuntu2][jenkins][Thread-1]Data load
is successful for default.origin_table
18/07/06 00:40:24 AUDIT CarbonDataRDDFactory$: [jenkins-ubuntu2][jenkins][Thread-1]Data load
request has been received for table default.origin_table
18/07/06 00:40:24 ERROR DataLoadExecutor: [Executor task launch worker for task 2300][partitionID:table;queryID:9129717729668939]
Data Load is partially success for table origin_table
18/07/06 00:40:24 AUDIT CarbonDataRDDFactory$: [jenkins-ubuntu2][jenkins][Thread-1]Data load
is successful for default.origin_table
18/07/06 00:40:24 AUDIT CarbonDataRDDFactory$: [jenkins-ubuntu2][jenkins][Thread-1]Data load
request has been received for table default.origin_table
18/07/06 00:40:25 ERROR DataLoadExecutor: [Executor task launch worker for task 2301][partitionID:table;queryID:9129718511508814]
Data Load is partially success for table origin_table
18/07/06 00:40:25 AUDIT CarbonDataRDDFactory$: [jenkins-ubuntu2][jenkins][Thread-1]Data load
is successful for default.origin_table
18/07/06 00:40:25 AUDIT CarbonDataRDDFactory$: [jenkins-ubuntu2][jenkins][Thread-1]Data load
request has been received for table default.origin_table
18/07/06 00:40:26 ERROR DataLoadExecutor: [Executor task launch worker for task 2302][partitionID:table;queryID:9129719355621370]
Data Load is partially success for table origin_table
18/07/06 00:40:26 AUDIT CarbonDataRDDFactory$: [jenkins-ubuntu2][jenkins][Thread-1]Data load
is successful for default.origin_table
+--------+
|count(1)|
+--------+
|      40|
+--------+

18/07/06 00:40:26 AUDIT CarbonCreateTableCommand: [jenkins-ubuntu2][jenkins][Thread-1]Creating
Table with Database name [default] and Table name [external_table]
18/07/06 00:40:26 AUDIT CarbonCreateTableCommand: [jenkins-ubuntu2][jenkins][Thread-1]Table
created with Database name [default] and Table name [external_table]
+--------+
|count(1)|
+--------+
|      40|
+--------+

18/07/06 00:40:26 AUDIT CarbonDataRDDFactory$: [jenkins-ubuntu2][jenkins][Thread-1]Data load
request has been received for table default.origin_table
18/07/06 00:40:28 ERROR DataLoadExecutor: [Executor task launch worker for task 2307][partitionID:table;queryID:9129720454341255]
Data Load is partially success for table origin_table
18/07/06 00:40:28 AUDIT CarbonDataRDDFactory$: [jenkins-ubuntu2][jenkins][Thread-1]Data load
is successful for default.origin_table
18/07/06 00:40:28 AUDIT CarbonDataRDDFactory$: [jenkins-ubuntu2][jenkins][Thread-1]Data load
request has been received for table default.origin_table
18/07/06 00:40:28 ERROR DataLoadExecutor: [Executor task launch worker for task 2308][partitionID:table;queryID:9129721620995164]
Data Load is partially success for table origin_table
18/07/06 00:40:28 AUDIT CarbonDataRDDFactory$: [jenkins-ubuntu2][jenkins][Thread-1]Data load
is successful for default.origin_table
+--------+
|count(1)|
+--------+
|      60|
+--------+

18/07/06 00:40:29 AUDIT CarbonDropTableCommand: [jenkins-ubuntu2][jenkins][Thread-1]Deleting
table [origin_table] under database [default]
18/07/06 00:40:29 AUDIT CarbonDropTableCommand: [jenkins-ubuntu2][jenkins][Thread-1]Deleted
table [origin_table] under database [default]
- ExternalTableExample
Run completed in 2 minutes, 39 seconds.
Total number of tests run: 17
Suites: completed 2, aborted 0
Tests: succeeded 17, failed 0, canceled 0, ignored 0, pending 0
All tests passed.
[JENKINS] Recording test results
[INFO] 
[INFO] --- maven-jar-plugin:2.5:jar (default-jar) @ carbondata-examples-spark2 ---
[INFO] Building jar: <https://builds.apache.org/job/carbondata-master-spark-2.2/ws/examples/spark2/target/carbondata-examples-spark2-1.5.0-SNAPSHOT.jar>
[INFO] 
[INFO] --- maven-site-plugin:3.4:attach-descriptor (attach-descriptor) @ carbondata-examples-spark2
---
[INFO] 
[INFO] --- jacoco-maven-plugin:0.7.9:prepare-agent-integration (default-prepare-agent-integration)
@ carbondata-examples-spark2 ---
[INFO] argLine set to -javaagent:/home/jenkins/jenkins-slave/maven-repositories/0/org/jacoco/org.jacoco.agent/0.7.9/org.jacoco.agent-0.7.9-runtime.jar=destfile=<https://builds.apache.org/job/carbondata-master-spark-2.2/ws/examples/spark2/target/jacoco-it.exec>
[INFO] 
[INFO] --- maven-checkstyle-plugin:2.17:check (default) @ carbondata-examples-spark2 ---
[INFO] 
[INFO] --- scalastyle-maven-plugin:0.8.0:check (default) @ carbondata-examples-spark2 ---
Saving to outputFile=<https://builds.apache.org/job/carbondata-master-spark-2.2/ws/examples/spark2/target/scalastyle-output.xml>
Processed 34 file(s)
Found 0 errors
Found 0 warnings
Found 0 infos
Finished in 486 ms
[INFO] 
[INFO] --- jacoco-maven-plugin:0.7.9:report (default-report) @ carbondata-examples-spark2
---
[INFO] Skipping JaCoCo execution due to missing execution data file.
[INFO] 
[INFO] --- jacoco-maven-plugin:0.7.9:report-integration (default-report-integration) @ carbondata-examples-spark2
---
[INFO] Skipping JaCoCo execution due to missing execution data file.
[INFO] 
[INFO] --- jacoco-maven-plugin:0.7.9:check (default-check) @ carbondata-examples-spark2 ---
[INFO] Skipping JaCoCo execution due to missing execution data <https://builds.apache.org/job/carbondata-master-spark-2.2/ws/examples/spark2/target/jacoco.exec>
[INFO] 
[INFO] --- maven-install-plugin:2.5.2:install (default-install) @ carbondata-examples-spark2
---
[INFO] Installing <https://builds.apache.org/job/carbondata-master-spark-2.2/ws/examples/spark2/target/carbondata-examples-spark2-1.5.0-SNAPSHOT.jar>
to /home/jenkins/jenkins-slave/maven-repositories/0/org/apache/carbondata/carbondata-examples-spark2/1.5.0-SNAPSHOT/carbondata-examples-spark2-1.5.0-SNAPSHOT.jar
[INFO] Installing <https://builds.apache.org/job/carbondata-master-spark-2.2/ws/examples/spark2/pom.xml>
to /home/jenkins/jenkins-slave/maven-repositories/0/org/apache/carbondata/carbondata-examples-spark2/1.5.0-SNAPSHOT/carbondata-examples-spark2-1.5.0-SNAPSHOT.pom
[INFO]                                                                         
[INFO] ------------------------------------------------------------------------
[INFO] Building Apache CarbonData :: Parent 1.5.0-SNAPSHOT
[INFO] ------------------------------------------------------------------------
[INFO] 
[INFO] --- coveralls-maven-plugin:4.3.0:report (default-cli) @ carbondata-parent ---
[INFO] Starting Coveralls job for jenkins (615 / https://builds.apache.org/job/carbondata-master-spark-2.2/615/)
[INFO] Using repository token <secret>
[INFO] Git commit 3e88858 in master
[INFO] Writing Coveralls data to <https://builds.apache.org/job/carbondata-master-spark-2.2/ws/target/coveralls.json...>
[INFO] Processing coverage report from <https://builds.apache.org/job/carbondata-master-spark-2.2/ws/target/carbondata-coverage-report/carbondata-coverage-report.xml>
[INFO] ------------------------------------------------------------------------
[INFO] Reactor Summary:
[INFO] 
[INFO] Apache CarbonData :: Parent ........................ FAILURE [  3.089 s]
[INFO] Apache CarbonData :: Common ........................ SUCCESS [ 16.412 s]
[INFO] Apache CarbonData :: Core .......................... SUCCESS [03:37 min]
[INFO] Apache CarbonData :: Processing .................... SUCCESS [ 35.648 s]
[INFO] Apache CarbonData :: Hadoop ........................ SUCCESS [ 25.008 s]
[INFO] Apache CarbonData :: Streaming ..................... SUCCESS [ 32.652 s]
[INFO] Apache CarbonData :: Spark Common .................. SUCCESS [01:08 min]
[INFO] Apache CarbonData :: Store SDK ..................... SUCCESS [01:27 min]
[INFO] Apache CarbonData :: Search ........................ SUCCESS [ 42.068 s]
[INFO] Apache CarbonData :: Lucene Index DataMap .......... SUCCESS [ 17.583 s]
[INFO] Apache CarbonData :: Bloom Index DataMap ........... SUCCESS [ 18.206 s]
[INFO] Apache CarbonData :: Spark2 ........................ SUCCESS [19:07 min]
[INFO] Apache CarbonData :: Spark Common Test ............. SUCCESS [20:55 min]
[INFO] Apache CarbonData :: DataMap Examples .............. SUCCESS [ 10.899 s]
[INFO] Apache CarbonData :: Assembly ...................... SUCCESS [ 16.907 s]
[INFO] Apache CarbonData :: Hive .......................... SUCCESS [ 35.822 s]
[INFO] Apache CarbonData :: presto ........................ SUCCESS [01:22 min]
[INFO] Apache CarbonData :: Spark2 Examples ............... SUCCESS [03:25 min]
[INFO] ------------------------------------------------------------------------
[INFO] BUILD FAILURE
[INFO] ------------------------------------------------------------------------
[INFO] Total time: 56:41 min
[INFO] Finished at: 2018-07-06T07:40:48+00:00
[INFO] Final Memory: 187M/1436M
[INFO] ------------------------------------------------------------------------
Waiting for Jenkins to finish collecting data
[ERROR] Failed to execute goal org.eluder.coveralls:coveralls-maven-plugin:4.3.0:report (default-cli)
on project carbondata-parent: Build error: Line number 228 is greater than the source file
integration/presto/src/main/java/org/apache/carbondata/presto/CarbondataPageSource.java size
-> [Help 1]
org.apache.maven.lifecycle.LifecycleExecutionException: Failed to execute goal org.eluder.coveralls:coveralls-maven-plugin:4.3.0:report
(default-cli) on project carbondata-parent: Build error
	at org.apache.maven.lifecycle.internal.MojoExecutor.execute(MojoExecutor.java:212)
	at org.apache.maven.lifecycle.internal.MojoExecutor.execute(MojoExecutor.java:153)
	at org.apache.maven.lifecycle.internal.MojoExecutor.execute(MojoExecutor.java:145)
	at org.apache.maven.lifecycle.internal.LifecycleModuleBuilder.buildProject(LifecycleModuleBuilder.java:116)
	at org.apache.maven.lifecycle.internal.LifecycleModuleBuilder.buildProject(LifecycleModuleBuilder.java:80)
	at org.apache.maven.lifecycle.internal.builder.singlethreaded.SingleThreadedBuilder.build(SingleThreadedBuilder.java:51)
	at org.apache.maven.lifecycle.internal.LifecycleStarter.execute(LifecycleStarter.java:128)
	at org.apache.maven.DefaultMaven.doExecute(DefaultMaven.java:307)
	at org.apache.maven.DefaultMaven.doExecute(DefaultMaven.java:193)
	at org.apache.maven.DefaultMaven.execute(DefaultMaven.java:106)
	at org.jvnet.hudson.maven3.launcher.Maven33Launcher.main(Maven33Launcher.java:129)
	at sun.reflect.NativeMethodAccessorImpl.invoke0(Native Method)
	at sun.reflect.NativeMethodAccessorImpl.invoke(NativeMethodAccessorImpl.java:62)
	at sun.reflect.DelegatingMethodAccessorImpl.invoke(DelegatingMethodAccessorImpl.java:43)
	at java.lang.reflect.Method.invoke(Method.java:498)
	at org.codehaus.plexus.classworlds.launcher.Launcher.launchStandard(Launcher.java:330)
	at org.codehaus.plexus.classworlds.launcher.Launcher.launch(Launcher.java:238)
	at jenkins.maven3.agent.Maven33Main.launch(Maven33Main.java:176)
	at sun.reflect.NativeMethodAccessorImpl.invoke0(Native Method)
	at sun.reflect.NativeMethodAccessorImpl.invoke(NativeMethodAccessorImpl.java:62)
	at sun.reflect.DelegatingMethodAccessorImpl.invoke(DelegatingMethodAccessorImpl.java:43)
	at java.lang.reflect.Method.invoke(Method.java:498)
	at hudson.maven.Maven3Builder.call(Maven3Builder.java:139)
	at hudson.maven.Maven3Builder.call(Maven3Builder.java:70)
	at hudson.remoting.UserRequest.perform(UserRequest.java:212)
	at hudson.remoting.UserRequest.perform(UserRequest.java:54)
	at hudson.remoting.Request$2.run(Request.java:369)
	at hudson.remoting.InterceptingExecutorService$1.call(InterceptingExecutorService.java:72)
	at java.util.concurrent.FutureTask.run(FutureTask.java:266)
	at java.util.concurrent.ThreadPoolExecutor.runWorker(ThreadPoolExecutor.java:1149)
	at java.util.concurrent.ThreadPoolExecutor$Worker.run(ThreadPoolExecutor.java:624)
	at java.lang.Thread.run(Thread.java:748)
Caused by: org.apache.maven.plugin.MojoExecutionException: Build error
	at org.eluder.coveralls.maven.plugin.CoverallsReportMojo.execute(CoverallsReportMojo.java:261)
	at org.apache.maven.plugin.DefaultBuildPluginManager.executeMojo(DefaultBuildPluginManager.java:134)
	at org.apache.maven.lifecycle.internal.MojoExecutor.execute(MojoExecutor.java:207)
	... 31 more
Caused by: java.lang.IllegalArgumentException: Line number 228 is greater than the source
file integration/presto/src/main/java/org/apache/carbondata/presto/CarbondataPageSource.java
size
	at org.eluder.coveralls.maven.plugin.domain.Source.addCoverage(Source.java:92)
	at org.eluder.coveralls.maven.plugin.parser.JaCoCoParser.onEvent(JaCoCoParser.java:61)
	at org.eluder.coveralls.maven.plugin.parser.AbstractXmlEventParser.parse(AbstractXmlEventParser.java:64)
	at org.eluder.coveralls.maven.plugin.CoverallsReportMojo.writeCoveralls(CoverallsReportMojo.java:386)
	at org.eluder.coveralls.maven.plugin.CoverallsReportMojo.execute(CoverallsReportMojo.java:250)
	... 33 more
[ERROR] 
[ERROR] Re-run Maven using the -X switch to enable full debug logging.
[ERROR] 
[ERROR] For more information about the errors and possible solutions, please read the following
articles:
[ERROR] [Help 1] http://cwiki.apache.org/confluence/display/MAVEN/MojoExecutionException
[JENKINS] Archiving <https://builds.apache.org/job/carbondata-master-spark-2.2/ws/processing/pom.xml>
to org.apache.carbondata/carbondata-processing/1.5.0-SNAPSHOT/carbondata-processing-1.5.0-SNAPSHOT.pom
[JENKINS] Archiving <https://builds.apache.org/job/carbondata-master-spark-2.2/ws/processing/target/carbondata-processing-1.5.0-SNAPSHOT.jar>
to org.apache.carbondata/carbondata-processing/1.5.0-SNAPSHOT/carbondata-processing-1.5.0-SNAPSHOT.jar
[Fast Archiver] No artifacts from carbondata-master-spark-2.2 » Apache CarbonData :: Processing
#616 to compare, so performing full copy of artifacts
[JENKINS] Archiving <https://builds.apache.org/job/carbondata-master-spark-2.2/ws/datamap/examples/pom.xml>
to org.apache.carbondata/carbondata-datamap-examples/1.5.0-SNAPSHOT/carbondata-datamap-examples-1.5.0-SNAPSHOT.pom
[JENKINS] Archiving <https://builds.apache.org/job/carbondata-master-spark-2.2/ws/datamap/examples/target/carbondata-datamap-examples-1.5.0-SNAPSHOT.jar>
to org.apache.carbondata/carbondata-datamap-examples/1.5.0-SNAPSHOT/carbondata-datamap-examples-1.5.0-SNAPSHOT.jar
[JENKINS] Archiving <https://builds.apache.org/job/carbondata-master-spark-2.2/ws/store/search/pom.xml>
to org.apache.carbondata/carbondata-search/1.5.0-SNAPSHOT/carbondata-search-1.5.0-SNAPSHOT.pom
[JENKINS] Archiving <https://builds.apache.org/job/carbondata-master-spark-2.2/ws/store/search/target/carbondata-search-1.5.0-SNAPSHOT.jar>
to org.apache.carbondata/carbondata-search/1.5.0-SNAPSHOT/carbondata-search-1.5.0-SNAPSHOT.jar
[Fast Archiver] No artifacts from carbondata-master-spark-2.2 » Apache CarbonData :: Search
#616 to compare, so performing full copy of artifacts
[JENKINS] Archiving <https://builds.apache.org/job/carbondata-master-spark-2.2/ws/streaming/pom.xml>
to org.apache.carbondata/carbondata-streaming/1.5.0-SNAPSHOT/carbondata-streaming-1.5.0-SNAPSHOT.pom
[JENKINS] Archiving <https://builds.apache.org/job/carbondata-master-spark-2.2/ws/streaming/target/carbondata-streaming-1.5.0-SNAPSHOT.jar>
to org.apache.carbondata/carbondata-streaming/1.5.0-SNAPSHOT/carbondata-streaming-1.5.0-SNAPSHOT.jar
[Fast Archiver] No artifacts from carbondata-master-spark-2.2 » Apache CarbonData :: Streaming
#616 to compare, so performing full copy of artifacts
[JENKINS] Archiving <https://builds.apache.org/job/carbondata-master-spark-2.2/ws/integration/spark-common/pom.xml>
to org.apache.carbondata/carbondata-spark-common/1.5.0-SNAPSHOT/carbondata-spark-common-1.5.0-SNAPSHOT.pom
[JENKINS] Archiving <https://builds.apache.org/job/carbondata-master-spark-2.2/ws/integration/spark-common/target/carbondata-spark-common-1.5.0-SNAPSHOT.jar>
to org.apache.carbondata/carbondata-spark-common/1.5.0-SNAPSHOT/carbondata-spark-common-1.5.0-SNAPSHOT.jar
[Fast Archiver] No artifacts from carbondata-master-spark-2.2 » Apache CarbonData :: Spark
Common #616 to compare, so performing full copy of artifacts
[JENKINS] Archiving <https://builds.apache.org/job/carbondata-master-spark-2.2/ws/datamap/lucene/pom.xml>
to org.apache.carbondata/carbondata-lucene/1.5.0-SNAPSHOT/carbondata-lucene-1.5.0-SNAPSHOT.pom
[JENKINS] Archiving <https://builds.apache.org/job/carbondata-master-spark-2.2/ws/datamap/lucene/target/carbondata-lucene-1.5.0-SNAPSHOT.jar>
to org.apache.carbondata/carbondata-lucene/1.5.0-SNAPSHOT/carbondata-lucene-1.5.0-SNAPSHOT.jar
[Fast Archiver] No artifacts from carbondata-master-spark-2.2 » Apache CarbonData :: Lucene
Index DataMap #616 to compare, so performing full copy of artifacts
[JENKINS] Archiving <https://builds.apache.org/job/carbondata-master-spark-2.2/ws/integration/hive/pom.xml>
to org.apache.carbondata/carbondata-hive/1.5.0-SNAPSHOT/carbondata-hive-1.5.0-SNAPSHOT.pom
[JENKINS] Archiving <https://builds.apache.org/job/carbondata-master-spark-2.2/ws/integration/hive/target/carbondata-hive-1.5.0-SNAPSHOT.jar>
to org.apache.carbondata/carbondata-hive/1.5.0-SNAPSHOT/carbondata-hive-1.5.0-SNAPSHOT.jar
[JENKINS] Archiving <https://builds.apache.org/job/carbondata-master-spark-2.2/ws/common/pom.xml>
to org.apache.carbondata/carbondata-common/1.5.0-SNAPSHOT/carbondata-common-1.5.0-SNAPSHOT.pom
[JENKINS] Archiving <https://builds.apache.org/job/carbondata-master-spark-2.2/ws/common/target/carbondata-common-1.5.0-SNAPSHOT.jar>
to org.apache.carbondata/carbondata-common/1.5.0-SNAPSHOT/carbondata-common-1.5.0-SNAPSHOT.jar
[Fast Archiver] No artifacts from carbondata-master-spark-2.2 » Apache CarbonData :: Common
#616 to compare, so performing full copy of artifacts
[JENKINS] Archiving <https://builds.apache.org/job/carbondata-master-spark-2.2/ws/examples/spark2/pom.xml>
to org.apache.carbondata/carbondata-examples-spark2/1.5.0-SNAPSHOT/carbondata-examples-spark2-1.5.0-SNAPSHOT.pom
[JENKINS] Archiving <https://builds.apache.org/job/carbondata-master-spark-2.2/ws/examples/spark2/target/carbondata-examples-spark2-1.5.0-SNAPSHOT.jar>
to org.apache.carbondata/carbondata-examples-spark2/1.5.0-SNAPSHOT/carbondata-examples-spark2-1.5.0-SNAPSHOT.jar
[JENKINS] Archiving <https://builds.apache.org/job/carbondata-master-spark-2.2/ws/integration/spark2/pom.xml>
to org.apache.carbondata/carbondata-spark2/1.5.0-SNAPSHOT/carbondata-spark2-1.5.0-SNAPSHOT.pom
[JENKINS] Archiving <https://builds.apache.org/job/carbondata-master-spark-2.2/ws/integration/spark2/target/carbondata-spark2-1.5.0-SNAPSHOT.jar>
to org.apache.carbondata/carbondata-spark2/1.5.0-SNAPSHOT/carbondata-spark2-1.5.0-SNAPSHOT.jar
[Fast Archiver] No artifacts from carbondata-master-spark-2.2 » Apache CarbonData :: Spark2
#616 to compare, so performing full copy of artifacts
[JENKINS] Archiving <https://builds.apache.org/job/carbondata-master-spark-2.2/ws/datamap/bloom/pom.xml>
to org.apache.carbondata/carbondata-bloom/1.5.0-SNAPSHOT/carbondata-bloom-1.5.0-SNAPSHOT.pom
[JENKINS] Archiving <https://builds.apache.org/job/carbondata-master-spark-2.2/ws/datamap/bloom/target/carbondata-bloom-1.5.0-SNAPSHOT.jar>
to org.apache.carbondata/carbondata-bloom/1.5.0-SNAPSHOT/carbondata-bloom-1.5.0-SNAPSHOT.jar
[Fast Archiver] No artifacts from carbondata-master-spark-2.2 » Apache CarbonData :: Bloom
Index DataMap #616 to compare, so performing full copy of artifacts
[JENKINS] Archiving <https://builds.apache.org/job/carbondata-master-spark-2.2/ws/assembly/pom.xml>
to org.apache.carbondata/carbondata-assembly/1.5.0-SNAPSHOT/carbondata-assembly-1.5.0-SNAPSHOT.pom
[JENKINS] Archiving <https://builds.apache.org/job/carbondata-master-spark-2.2/ws/pom.xml>
to org.apache.carbondata/carbondata-parent/1.5.0-SNAPSHOT/carbondata-parent-1.5.0-SNAPSHOT.pom
[Fast Archiver] No artifacts from carbondata-master-spark-2.2 » Apache CarbonData :: Parent
#616 to compare, so performing full copy of artifacts
[JENKINS] Archiving <https://builds.apache.org/job/carbondata-master-spark-2.2/ws/core/pom.xml>
to org.apache.carbondata/carbondata-core/1.5.0-SNAPSHOT/carbondata-core-1.5.0-SNAPSHOT.pom
[JENKINS] Archiving <https://builds.apache.org/job/carbondata-master-spark-2.2/ws/core/target/carbondata-core-1.5.0-SNAPSHOT.jar>
to org.apache.carbondata/carbondata-core/1.5.0-SNAPSHOT/carbondata-core-1.5.0-SNAPSHOT.jar
[Fast Archiver] No artifacts from carbondata-master-spark-2.2 » Apache CarbonData :: Core
#616 to compare, so performing full copy of artifacts
[JENKINS] Archiving <https://builds.apache.org/job/carbondata-master-spark-2.2/ws/hadoop/pom.xml>
to org.apache.carbondata/carbondata-hadoop/1.5.0-SNAPSHOT/carbondata-hadoop-1.5.0-SNAPSHOT.pom
[JENKINS] Archiving <https://builds.apache.org/job/carbondata-master-spark-2.2/ws/hadoop/target/carbondata-hadoop-1.5.0-SNAPSHOT.jar>
to org.apache.carbondata/carbondata-hadoop/1.5.0-SNAPSHOT/carbondata-hadoop-1.5.0-SNAPSHOT.jar
[Fast Archiver] No artifacts from carbondata-master-spark-2.2 » Apache CarbonData :: Hadoop
#616 to compare, so performing full copy of artifacts
[JENKINS] Archiving <https://builds.apache.org/job/carbondata-master-spark-2.2/ws/integration/presto/pom.xml>
to org.apache.carbondata/carbondata-presto/1.5.0-SNAPSHOT/carbondata-presto-1.5.0-SNAPSHOT.pom
[JENKINS] Archiving <https://builds.apache.org/job/carbondata-master-spark-2.2/ws/integration/presto/target/carbondata-presto-1.5.0-SNAPSHOT.zip>
to org.apache.carbondata/carbondata-presto/1.5.0-SNAPSHOT/carbondata-presto-1.5.0-SNAPSHOT.zip
[JENKINS] Archiving <https://builds.apache.org/job/carbondata-master-spark-2.2/ws/integration/presto/target/carbondata-presto-1.5.0-SNAPSHOT.jar>
to org.apache.carbondata/carbondata-presto/1.5.0-SNAPSHOT/carbondata-presto-1.5.0-SNAPSHOT.jar
[Fast Archiver] Compressed 104.23 MB of artifacts by 94.9% relative to #612
[JENKINS] Archiving <https://builds.apache.org/job/carbondata-master-spark-2.2/ws/integration/spark-common-test/pom.xml>
to org.apache.carbondata/carbondata-spark-common-test/1.5.0-SNAPSHOT/carbondata-spark-common-test-1.5.0-SNAPSHOT.pom
[JENKINS] Archiving <https://builds.apache.org/job/carbondata-master-spark-2.2/ws/integration/spark-common-test/target/carbondata-spark-common-test-1.5.0-SNAPSHOT.jar>
to org.apache.carbondata/carbondata-spark-common-test/1.5.0-SNAPSHOT/carbondata-spark-common-test-1.5.0-SNAPSHOT.jar
[JENKINS] Archiving <https://builds.apache.org/job/carbondata-master-spark-2.2/ws/store/sdk/pom.xml>
to org.apache.carbondata/carbondata-store-sdk/1.5.0-SNAPSHOT/carbondata-store-sdk-1.5.0-SNAPSHOT.pom
[JENKINS] Archiving <https://builds.apache.org/job/carbondata-master-spark-2.2/ws/store/sdk/target/carbondata-store-sdk-1.5.0-SNAPSHOT.jar>
to org.apache.carbondata/carbondata-store-sdk/1.5.0-SNAPSHOT/carbondata-store-sdk-1.5.0-SNAPSHOT.jar
[Fast Archiver] No artifacts from carbondata-master-spark-2.2 » Apache CarbonData :: Store
SDK #616 to compare, so performing full copy of artifacts
Sending e-mails to: commits@carbondata.apache.org
Sending e-mails to: commits@carbondata.apache.org tomanishgupta18@gmail.com
channel stopped
Not sending mail to unregistered user jacky.likun@qq.com

Mime
View raw message