carbondata-commits mailing list archives

Site index · List index
Message view « Date » · « Thread »
Top « Date » · « Thread »
From Apache Jenkins Server <jenk...@builds.apache.org>
Subject Build failed in Jenkins: carbondata-master-spark-2.1 » Apache CarbonData :: Spark2 Examples #3218
Date Tue, 11 Dec 2018 17:29:23 GMT
See <https://builds.apache.org/job/carbondata-master-spark-2.1/org.apache.carbondata$carbondata-examples-spark2/3218/display/redirect>

------------------------------------------
[...truncated 152.32 KB...]
	at org.scalatest.SuperEngine.org$scalatest$SuperEngine$$runTestsInBranch(Engine.scala:396)
	at org.scalatest.SuperEngine.runTestsImpl(Engine.scala:483)
	at org.scalatest.FunSuiteLike$class.runTests(FunSuiteLike.scala:208)
	at org.scalatest.FunSuite.runTests(FunSuite.scala:1555)
	at org.scalatest.Suite$class.run(Suite.scala:1424)
	at org.scalatest.FunSuite.org$scalatest$FunSuiteLike$$super$run(FunSuite.scala:1555)
	at org.scalatest.FunSuiteLike$$anonfun$run$1.apply(FunSuiteLike.scala:212)
	at org.scalatest.FunSuiteLike$$anonfun$run$1.apply(FunSuiteLike.scala:212)
	at org.scalatest.SuperEngine.runImpl(Engine.scala:545)
	at org.scalatest.FunSuiteLike$class.run(FunSuiteLike.scala:212)
	at org.apache.carbondata.examplesCI.RunExamples.org$scalatest$BeforeAndAfterAll$$super$run(RunExamples.scala:33)
	at org.scalatest.BeforeAndAfterAll$class.liftedTree1$1(BeforeAndAfterAll.scala:257)
	at org.scalatest.BeforeAndAfterAll$class.run(BeforeAndAfterAll.scala:256)
	at org.apache.carbondata.examplesCI.RunExamples.run(RunExamples.scala:33)
	at org.scalatest.Suite$class.callExecuteOnSuite$1(Suite.scala:1492)
	at org.scalatest.Suite$$anonfun$runNestedSuites$1.apply(Suite.scala:1528)
	at org.scalatest.Suite$$anonfun$runNestedSuites$1.apply(Suite.scala:1526)
	at scala.collection.IndexedSeqOptimized$class.foreach(IndexedSeqOptimized.scala:33)
	at scala.collection.mutable.ArrayOps$ofRef.foreach(ArrayOps.scala:186)
	at org.scalatest.Suite$class.runNestedSuites(Suite.scala:1526)
	at org.scalatest.tools.DiscoverySuite.runNestedSuites(DiscoverySuite.scala:29)
	at org.scalatest.Suite$class.run(Suite.scala:1421)
	at org.scalatest.tools.DiscoverySuite.run(DiscoverySuite.scala:29)
	at org.scalatest.tools.SuiteRunner.run(SuiteRunner.scala:55)
	at org.scalatest.tools.Runner$$anonfun$doRunRunRunDaDoRunRun$3.apply(Runner.scala:2563)
	at org.scalatest.tools.Runner$$anonfun$doRunRunRunDaDoRunRun$3.apply(Runner.scala:2557)
	at scala.collection.immutable.List.foreach(List.scala:381)
	at org.scalatest.tools.Runner$.doRunRunRunDaDoRunRun(Runner.scala:2557)
	at org.scalatest.tools.Runner$$anonfun$runOptionallyWithPassFailReporter$2.apply(Runner.scala:1044)
	at org.scalatest.tools.Runner$$anonfun$runOptionallyWithPassFailReporter$2.apply(Runner.scala:1043)
	at org.scalatest.tools.Runner$.withClassLoaderAndDispatchReporter(Runner.scala:2722)
	at org.scalatest.tools.Runner$.runOptionallyWithPassFailReporter(Runner.scala:1043)
	at org.scalatest.tools.Runner$.main(Runner.scala:860)
	at org.scalatest.tools.Runner.main(Runner.scala)
2018-12-11 17:28:05 ERROR CarbonDataRDDFactory$:414 - java.io.IOException: Failed to create
local dir in /tmp/blockmgr-9cfa6777-4d30-4093-8b4f-d6b5428d8e1b/22.
2018-12-11 17:28:05 ERROR CarbonLoadDataCommand:350 - java.lang.Exception: DataLoad failure
2018-12-11 17:28:05 ERROR CarbonLoadDataCommand:165 - Got exception java.lang.Exception: DataLoad
failure when processing data. But this command does not support undo yet, skipping the undo
part.
2018-12-11 17:28:05 AUDIT audit:93 - {"time":"December 11, 2018 9:28:05 AM PST","username":"jenkins","opName":"LOAD
DATA","opId":"1185519573258621","opStatus":"FAILED","opTime":"237 ms","table":"default.timeSeriesTable","extraInfo":{"Exception":"java.lang.Exception","Message":"DataLoad
failure"}}
- TimeSeriesPreAggregateTableExample *** FAILED ***
  java.lang.Exception: DataLoad failure
  at org.apache.carbondata.spark.rdd.CarbonDataRDDFactory$.loadCarbonData(CarbonDataRDDFactory.scala:477)
  at org.apache.spark.sql.execution.command.management.CarbonLoadDataCommand.loadData(CarbonLoadDataCommand.scala:589)
  at org.apache.spark.sql.execution.command.management.CarbonLoadDataCommand.processData(CarbonLoadDataCommand.scala:316)
  at org.apache.spark.sql.execution.command.AtomicRunnableCommand$$anonfun$run$3.apply(package.scala:147)
  at org.apache.spark.sql.execution.command.AtomicRunnableCommand$$anonfun$run$3.apply(package.scala:144)
  at org.apache.spark.sql.execution.command.Auditable$class.runWithAudit(package.scala:104)
  at org.apache.spark.sql.execution.command.AtomicRunnableCommand.runWithAudit(package.scala:140)
  at org.apache.spark.sql.execution.command.AtomicRunnableCommand.run(package.scala:144)
  at org.apache.spark.sql.CarbonDataFrameWriter.loadDataFrame(CarbonDataFrameWriter.scala:62)
  at org.apache.spark.sql.CarbonDataFrameWriter.writeToCarbonFile(CarbonDataFrameWriter.scala:46)
  ...
2018-12-11 17:28:05 AUDIT audit:72 - {"time":"December 11, 2018 9:28:05 AM PST","username":"jenkins","opName":"CREATE
TABLE","opId":"1185519866451926","opStatus":"START"}
2018-12-11 17:28:05 AUDIT audit:93 - {"time":"December 11, 2018 9:28:05 AM PST","username":"jenkins","opName":"CREATE
TABLE","opId":"1185519866451926","opStatus":"SUCCESS","opTime":"88 ms","table":"default.persontable","extraInfo":{"bad_record_path":"","streaming":"false","local_dictionary_enable":"true","external":"false","sort_columns":"id,name,city","comment":""}}
2018-12-11 17:28:05 AUDIT audit:72 - {"time":"December 11, 2018 9:28:05 AM PST","username":"jenkins","opName":"LOAD
DATA OVERWRITE","opId":"1185519958631998","opStatus":"START"}
2018-12-11 17:28:05 ERROR CarbonDataRDDFactory$:1106 - load data frame failed
java.io.IOException: Failed to create local dir in /tmp/blockmgr-9cfa6777-4d30-4093-8b4f-d6b5428d8e1b/23.
	at org.apache.spark.storage.DiskBlockManager.getFile(DiskBlockManager.scala:70)
	at org.apache.spark.storage.DiskStore.remove(DiskStore.scala:111)
	at org.apache.spark.storage.BlockManager.removeBlockInternal(BlockManager.scala:1339)
	at org.apache.spark.storage.BlockManager.doPut(BlockManager.scala:910)
	at org.apache.spark.storage.BlockManager.doPutIterator(BlockManager.scala:948)
	at org.apache.spark.storage.BlockManager.putIterator(BlockManager.scala:726)
	at org.apache.spark.storage.BlockManager.putSingle(BlockManager.scala:1233)
	at org.apache.spark.broadcast.TorrentBroadcast.writeBlocks(TorrentBroadcast.scala:122)
	at org.apache.spark.broadcast.TorrentBroadcast.<init>(TorrentBroadcast.scala:88)
	at org.apache.spark.broadcast.TorrentBroadcastFactory.newBroadcast(TorrentBroadcastFactory.scala:34)
	at org.apache.spark.broadcast.BroadcastManager.newBroadcast(BroadcastManager.scala:56)
	at org.apache.spark.SparkContext.broadcast(SparkContext.scala:1411)
	at org.apache.spark.sql.util.SparkSQLUtil$.broadCastHadoopConf(SparkSQLUtil.scala:115)
	at org.apache.carbondata.spark.rdd.CarbonRDD.<init>(CarbonRDD.scala:56)
	at org.apache.spark.rdd.DataLoadCoalescedRDD.<init>(DataLoadCoalescedRDD.scala:34)
	at org.apache.carbondata.spark.rdd.CarbonDataRDDFactory$.loadDataFrame(CarbonDataRDDFactory.scala:1095)
	at org.apache.carbondata.spark.rdd.CarbonDataRDDFactory$.loadCarbonData(CarbonDataRDDFactory.scala:358)
	at org.apache.spark.sql.execution.command.management.CarbonLoadDataCommand.loadData(CarbonLoadDataCommand.scala:589)
	at org.apache.spark.sql.execution.command.management.CarbonLoadDataCommand.processData(CarbonLoadDataCommand.scala:316)
	at org.apache.spark.sql.execution.command.AtomicRunnableCommand$$anonfun$run$3.apply(package.scala:147)
	at org.apache.spark.sql.execution.command.AtomicRunnableCommand$$anonfun$run$3.apply(package.scala:144)
	at org.apache.spark.sql.execution.command.Auditable$class.runWithAudit(package.scala:104)
	at org.apache.spark.sql.execution.command.AtomicRunnableCommand.runWithAudit(package.scala:140)
	at org.apache.spark.sql.execution.command.AtomicRunnableCommand.run(package.scala:144)
	at org.apache.spark.sql.CarbonDataFrameWriter.loadDataFrame(CarbonDataFrameWriter.scala:62)
	at org.apache.spark.sql.CarbonDataFrameWriter.writeToCarbonFile(CarbonDataFrameWriter.scala:46)
	at org.apache.spark.sql.CarbonDataFrameWriter.saveAsCarbonFile(CarbonDataFrameWriter.scala:37)
	at org.apache.spark.sql.CarbonSource.createRelation(CarbonSource.scala:113)
	at org.apache.spark.sql.execution.datasources.DataSource.write(DataSource.scala:426)
	at org.apache.spark.sql.DataFrameWriter.save(DataFrameWriter.scala:215)
	at org.apache.carbondata.examples.LuceneDataMapExample$.exampleBody(LuceneDataMapExample.scala:54)
	at org.apache.carbondata.examplesCI.RunExamples$$anonfun$17.apply$mcV$sp(RunExamples.scala:116)
	at org.apache.carbondata.examplesCI.RunExamples$$anonfun$17.apply(RunExamples.scala:116)
	at org.apache.carbondata.examplesCI.RunExamples$$anonfun$17.apply(RunExamples.scala:116)
	at org.scalatest.Transformer$$anonfun$apply$1.apply$mcV$sp(Transformer.scala:22)
	at org.scalatest.OutcomeOf$class.outcomeOf(OutcomeOf.scala:85)
	at org.scalatest.OutcomeOf$.outcomeOf(OutcomeOf.scala:104)
	at org.scalatest.Transformer.apply(Transformer.scala:22)
	at org.scalatest.Transformer.apply(Transformer.scala:20)
	at org.scalatest.FunSuiteLike$$anon$1.apply(FunSuiteLike.scala:166)
	at org.apache.spark.sql.test.util.CarbonFunSuite.withFixture(CarbonFunSuite.scala:41)
	at org.scalatest.FunSuiteLike$class.invokeWithFixture$1(FunSuiteLike.scala:163)
	at org.scalatest.FunSuiteLike$$anonfun$runTest$1.apply(FunSuiteLike.scala:175)
	at org.scalatest.FunSuiteLike$$anonfun$runTest$1.apply(FunSuiteLike.scala:175)
	at org.scalatest.SuperEngine.runTestImpl(Engine.scala:306)
	at org.scalatest.FunSuiteLike$class.runTest(FunSuiteLike.scala:175)
	at org.scalatest.FunSuite.runTest(FunSuite.scala:1555)
	at org.scalatest.FunSuiteLike$$anonfun$runTests$1.apply(FunSuiteLike.scala:208)
	at org.scalatest.FunSuiteLike$$anonfun$runTests$1.apply(FunSuiteLike.scala:208)
	at org.scalatest.SuperEngine$$anonfun$traverseSubNodes$1$1.apply(Engine.scala:413)
	at org.scalatest.SuperEngine$$anonfun$traverseSubNodes$1$1.apply(Engine.scala:401)
	at scala.collection.immutable.List.foreach(List.scala:381)
	at org.scalatest.SuperEngine.traverseSubNodes$1(Engine.scala:401)
	at org.scalatest.SuperEngine.org$scalatest$SuperEngine$$runTestsInBranch(Engine.scala:396)
	at org.scalatest.SuperEngine.runTestsImpl(Engine.scala:483)
	at org.scalatest.FunSuiteLike$class.runTests(FunSuiteLike.scala:208)
	at org.scalatest.FunSuite.runTests(FunSuite.scala:1555)
	at org.scalatest.Suite$class.run(Suite.scala:1424)
	at org.scalatest.FunSuite.org$scalatest$FunSuiteLike$$super$run(FunSuite.scala:1555)
	at org.scalatest.FunSuiteLike$$anonfun$run$1.apply(FunSuiteLike.scala:212)
	at org.scalatest.FunSuiteLike$$anonfun$run$1.apply(FunSuiteLike.scala:212)
	at org.scalatest.SuperEngine.runImpl(Engine.scala:545)
	at org.scalatest.FunSuiteLike$class.run(FunSuiteLike.scala:212)
	at org.apache.carbondata.examplesCI.RunExamples.org$scalatest$BeforeAndAfterAll$$super$run(RunExamples.scala:33)
	at org.scalatest.BeforeAndAfterAll$class.liftedTree1$1(BeforeAndAfterAll.scala:257)
	at org.scalatest.BeforeAndAfterAll$class.run(BeforeAndAfterAll.scala:256)
	at org.apache.carbondata.examplesCI.RunExamples.run(RunExamples.scala:33)
	at org.scalatest.Suite$class.callExecuteOnSuite$1(Suite.scala:1492)
	at org.scalatest.Suite$$anonfun$runNestedSuites$1.apply(Suite.scala:1528)
	at org.scalatest.Suite$$anonfun$runNestedSuites$1.apply(Suite.scala:1526)
	at scala.collection.IndexedSeqOptimized$class.foreach(IndexedSeqOptimized.scala:33)
	at scala.collection.mutable.ArrayOps$ofRef.foreach(ArrayOps.scala:186)
	at org.scalatest.Suite$class.runNestedSuites(Suite.scala:1526)
	at org.scalatest.tools.DiscoverySuite.runNestedSuites(DiscoverySuite.scala:29)
	at org.scalatest.Suite$class.run(Suite.scala:1421)
	at org.scalatest.tools.DiscoverySuite.run(DiscoverySuite.scala:29)
	at org.scalatest.tools.SuiteRunner.run(SuiteRunner.scala:55)
	at org.scalatest.tools.Runner$$anonfun$doRunRunRunDaDoRunRun$3.apply(Runner.scala:2563)
	at org.scalatest.tools.Runner$$anonfun$doRunRunRunDaDoRunRun$3.apply(Runner.scala:2557)
	at scala.collection.immutable.List.foreach(List.scala:381)
	at org.scalatest.tools.Runner$.doRunRunRunDaDoRunRun(Runner.scala:2557)
	at org.scalatest.tools.Runner$$anonfun$runOptionallyWithPassFailReporter$2.apply(Runner.scala:1044)
	at org.scalatest.tools.Runner$$anonfun$runOptionallyWithPassFailReporter$2.apply(Runner.scala:1043)
	at org.scalatest.tools.Runner$.withClassLoaderAndDispatchReporter(Runner.scala:2722)
	at org.scalatest.tools.Runner$.runOptionallyWithPassFailReporter(Runner.scala:1043)
	at org.scalatest.tools.Runner$.main(Runner.scala:860)
	at org.scalatest.tools.Runner.main(Runner.scala)
2018-12-11 17:28:05 ERROR CarbonDataRDDFactory$:414 - java.io.IOException: Failed to create
local dir in /tmp/blockmgr-9cfa6777-4d30-4093-8b4f-d6b5428d8e1b/23.
2018-12-11 17:28:05 ERROR CarbonLoadDataCommand:350 - java.lang.Exception: DataLoad failure
2018-12-11 17:28:05 ERROR CarbonLoadDataCommand:165 - Got exception java.lang.Exception: DataLoad
failure when processing data. But this command does not support undo yet, skipping the undo
part.
2018-12-11 17:28:05 AUDIT audit:93 - {"time":"December 11, 2018 9:28:05 AM PST","username":"jenkins","opName":"LOAD
DATA OVERWRITE","opId":"1185519958631998","opStatus":"FAILED","opTime":"96 ms","table":"default.personTable","extraInfo":{"Exception":"java.lang.Exception","Message":"DataLoad
failure"}}
- LuceneDataMapExample *** FAILED ***
  java.lang.Exception: DataLoad failure
  at org.apache.carbondata.spark.rdd.CarbonDataRDDFactory$.loadCarbonData(CarbonDataRDDFactory.scala:477)
  at org.apache.spark.sql.execution.command.management.CarbonLoadDataCommand.loadData(CarbonLoadDataCommand.scala:589)
  at org.apache.spark.sql.execution.command.management.CarbonLoadDataCommand.processData(CarbonLoadDataCommand.scala:316)
  at org.apache.spark.sql.execution.command.AtomicRunnableCommand$$anonfun$run$3.apply(package.scala:147)
  at org.apache.spark.sql.execution.command.AtomicRunnableCommand$$anonfun$run$3.apply(package.scala:144)
  at org.apache.spark.sql.execution.command.Auditable$class.runWithAudit(package.scala:104)
  at org.apache.spark.sql.execution.command.AtomicRunnableCommand.runWithAudit(package.scala:140)
  at org.apache.spark.sql.execution.command.AtomicRunnableCommand.run(package.scala:144)
  at org.apache.spark.sql.CarbonDataFrameWriter.loadDataFrame(CarbonDataFrameWriter.scala:62)
  at org.apache.spark.sql.CarbonDataFrameWriter.writeToCarbonFile(CarbonDataFrameWriter.scala:46)
  ...
2018-12-11 17:28:05 AUDIT audit:72 - {"time":"December 11, 2018 9:28:05 AM PST","username":"jenkins","opName":"CREATE
TABLE","opId":"1185520071393214","opStatus":"START"}
2018-12-11 17:28:05 AUDIT audit:93 - {"time":"December 11, 2018 9:28:05 AM PST","username":"jenkins","opName":"CREATE
TABLE","opId":"1185520071393214","opStatus":"SUCCESS","opTime":"57 ms","table":"default.origin_table","extraInfo":{"bad_record_path":"","local_dictionary_enable":"true","external":"false","sort_columns":"stringfield,timestampfield,datefield,charfield","comment":""}}
2018-12-11 17:28:05 AUDIT audit:72 - {"time":"December 11, 2018 9:28:05 AM PST","username":"jenkins","opName":"LOAD
DATA","opId":"1185520134575783","opStatus":"START"}
2018-12-11 17:28:05 ERROR CarbonDataRDDFactory$:414 - java.io.IOException: Failed to create
local dir in /tmp/blockmgr-9cfa6777-4d30-4093-8b4f-d6b5428d8e1b/24.
2018-12-11 17:28:05 ERROR CarbonLoadDataCommand:350 - java.lang.Exception: DataLoad failure
2018-12-11 17:28:05 ERROR CarbonLoadDataCommand:165 - Got exception java.lang.Exception: DataLoad
failure when processing data. But this command does not support undo yet, skipping the undo
part.
2018-12-11 17:28:05 AUDIT audit:93 - {"time":"December 11, 2018 9:28:05 AM PST","username":"jenkins","opName":"LOAD
DATA","opId":"1185520134575783","opStatus":"FAILED","opTime":"38 ms","table":"default.origin_table","extraInfo":{"Exception":"java.lang.Exception","Message":"DataLoad
failure"}}
- ExternalTableExample *** FAILED ***
  java.lang.Exception: DataLoad failure
  at org.apache.carbondata.spark.rdd.CarbonDataRDDFactory$.loadCarbonData(CarbonDataRDDFactory.scala:477)
  at org.apache.spark.sql.execution.command.management.CarbonLoadDataCommand.loadData(CarbonLoadDataCommand.scala:589)
  at org.apache.spark.sql.execution.command.management.CarbonLoadDataCommand.processData(CarbonLoadDataCommand.scala:316)
  at org.apache.spark.sql.execution.command.AtomicRunnableCommand$$anonfun$run$3.apply(package.scala:147)
  at org.apache.spark.sql.execution.command.AtomicRunnableCommand$$anonfun$run$3.apply(package.scala:144)
  at org.apache.spark.sql.execution.command.Auditable$class.runWithAudit(package.scala:104)
  at org.apache.spark.sql.execution.command.AtomicRunnableCommand.runWithAudit(package.scala:140)
  at org.apache.spark.sql.execution.command.AtomicRunnableCommand.run(package.scala:144)
  at org.apache.spark.sql.execution.command.ExecutedCommandExec.sideEffectResult$lzycompute(commands.scala:58)
  at org.apache.spark.sql.execution.command.ExecutedCommandExec.sideEffectResult(commands.scala:56)
  ...
2018-12-11 17:28:05 ERROR DataLoadExecutor:55 - Data Load is partially success for table _tempTable_1185520187717054

Data:
java.lang.NullPointerException
	at org.apache.carbondata.examples.sdk.CarbonReaderExample.main(CarbonReaderExample.java:120)
	at org.apache.carbondata.examplesCI.RunExamples$$anonfun$19.apply$mcV$sp(RunExamples.scala:124)
	at org.apache.carbondata.examplesCI.RunExamples$$anonfun$19.apply(RunExamples.scala:124)
	at org.apache.carbondata.examplesCI.RunExamples$$anonfun$19.apply(RunExamples.scala:124)
	at org.scalatest.Transformer$$anonfun$apply$1.apply$mcV$sp(Transformer.scala:22)
	at org.scalatest.OutcomeOf$class.outcomeOf(OutcomeOf.scala:85)
	at org.scalatest.OutcomeOf$.outcomeOf(OutcomeOf.scala:104)
	at org.scalatest.Transformer.apply(Transformer.scala:22)
	at org.scalatest.Transformer.apply(Transformer.scala:20)
	at org.scalatest.FunSuiteLike$$anon$1.apply(FunSuiteLike.scala:166)
	at org.apache.spark.sql.test.util.CarbonFunSuite.withFixture(CarbonFunSuite.scala:41)
	at org.scalatest.FunSuiteLike$class.invokeWithFixture$1(FunSuiteLike.scala:163)
	at org.scalatest.FunSuiteLike$$anonfun$runTest$1.apply(FunSuiteLike.scala:175)
	at org.scalatest.FunSuiteLike$$anonfun$runTest$1.apply(FunSuiteLike.scala:175)
	at org.scalatest.SuperEngine.runTestImpl(Engine.scala:306)
	at org.scalatest.FunSuiteLike$class.runTest(FunSuiteLike.scala:175)
	at org.scalatest.FunSuite.runTest(FunSuite.scala:1555)
	at org.scalatest.FunSuiteLike$$anonfun$runTests$1.apply(FunSuiteLike.scala:208)
	at org.scalatest.FunSuiteLike$$anonfun$runTests$1.apply(FunSuiteLike.scala:208)
	at org.scalatest.SuperEngine$$anonfun$traverseSubNodes$1$1.apply(Engine.scala:413)
	at org.scalatest.SuperEngine$$anonfun$traverseSubNodes$1$1.apply(Engine.scala:401)
	at scala.collection.immutable.List.foreach(List.scala:381)
	at org.scalatest.SuperEngine.traverseSubNodes$1(Engine.scala:401)
	at org.scalatest.SuperEngine.org$scalatest$SuperEngine$$runTestsInBranch(Engine.scala:396)
	at org.scalatest.SuperEngine.runTestsImpl(Engine.scala:483)
	at org.scalatest.FunSuiteLike$class.runTests(FunSuiteLike.scala:208)
	at org.scalatest.FunSuite.runTests(FunSuite.scala:1555)
	at org.scalatest.Suite$class.run(Suite.scala:1424)
	at org.scalatest.FunSuite.org$scalatest$FunSuiteLike$$super$run(FunSuite.scala:1555)
	at org.scalatest.FunSuiteLike$$anonfun$run$1.apply(FunSuiteLike.scala:212)
	at org.scalatest.FunSuiteLike$$anonfun$run$1.apply(FunSuiteLike.scala:212)
	at org.scalatest.SuperEngine.runImpl(Engine.scala:545)
	at org.scalatest.FunSuiteLike$class.run(FunSuiteLike.scala:212)
	at org.apache.carbondata.examplesCI.RunExamples.org$scalatest$BeforeAndAfterAll$$super$run(RunExamples.scala:33)
	at org.scalatest.BeforeAndAfterAll$class.liftedTree1$1(BeforeAndAfterAll.scala:257)
	at org.scalatest.BeforeAndAfterAll$class.run(BeforeAndAfterAll.scala:256)
	at org.apache.carbondata.examplesCI.RunExamples.run(RunExamples.scala:33)
	at org.scalatest.Suite$class.callExecuteOnSuite$1(Suite.scala:1492)
	at org.scalatest.Suite$$anonfun$runNestedSuites$1.apply(Suite.scala:1528)
	at org.scalatest.Suite$$anonfun$runNestedSuites$1.apply(Suite.scala:1526)
	at scala.collection.IndexedSeqOptimized$class.foreach(IndexedSeqOptimized.scala:33)
	at scala.collection.mutable.ArrayOps$ofRef.foreach(ArrayOps.scala:186)
	at org.scalatest.Suite$class.runNestedSuites(Suite.scala:1526)
	at org.scalatest.tools.DiscoverySuite.runNestedSuites(DiscoverySuite.scala:29)
	at org.scalatest.Suite$class.run(Suite.scala:1421)
	at org.scalatest.tools.DiscoverySuite.run(DiscoverySuite.scala:29)
	at org.scalatest.tools.SuiteRunner.run(SuiteRunner.scala:55)
	at org.scalatest.tools.Runner$$anonfun$doRunRunRunDaDoRunRun$3.apply(Runner.scala:2563)
	at org.scalatest.tools.Runner$$anonfun$doRunRunRunDaDoRunRun$3.apply(Runner.scala:2557)
	at scala.collection.immutable.List.foreach(List.scala:381)
	at org.scalatest.tools.Runner$.doRunRunRunDaDoRunRun(Runner.scala:2557)
	at org.scalatest.tools.Runner$$anonfun$runOptionallyWithPassFailReporter$2.apply(Runner.scala:1044)
	at org.scalatest.tools.Runner$$anonfun$runOptionallyWithPassFailReporter$2.apply(Runner.scala:1043)
	at org.scalatest.tools.Runner$.withClassLoaderAndDispatchReporter(Runner.scala:2722)
	at org.scalatest.tools.Runner$.runOptionallyWithPassFailReporter(Runner.scala:1043)
	at org.scalatest.tools.Runner$.main(Runner.scala:860)
	at org.scalatest.tools.Runner.main(Runner.scala)
null
- CarbonReaderExample
Run completed in 42 seconds, 301 milliseconds.
Total number of tests run: 19
Suites: completed 2, aborted 0
Tests: succeeded 1, failed 18, canceled 0, ignored 0, pending 0
*** 18 TESTS FAILED ***
[JENKINS] Recording test results

Mime
View raw message