carbondata-commits mailing list archives

Site index · List index
Message view « Date » · « Thread »
Top « Date » · « Thread »
From Apache Jenkins Server <jenk...@builds.apache.org>
Subject Build failed in Jenkins: carbondata-master-spark-2.2 #1508
Date Mon, 28 Jan 2019 16:00:21 GMT
See <https://builds.apache.org/job/carbondata-master-spark-2.2/1508/display/redirect?page=changes>

Changes:

[ravipesala] [CARBONDATA-3269] Fix ArrayIndexOutOfBoundsException of Range_Column

------------------------------------------
[...truncated 8.36 MB...]
	at org.scalatest.Suite$class.runNestedSuites(Suite.scala:1526)
	at org.scalatest.tools.DiscoverySuite.runNestedSuites(DiscoverySuite.scala:29)
	at org.scalatest.Suite$class.run(Suite.scala:1421)
	at org.scalatest.tools.DiscoverySuite.run(DiscoverySuite.scala:29)
	at org.scalatest.tools.SuiteRunner.run(SuiteRunner.scala:55)
	at org.scalatest.tools.Runner$$anonfun$doRunRunRunDaDoRunRun$3.apply(Runner.scala:2563)
	at org.scalatest.tools.Runner$$anonfun$doRunRunRunDaDoRunRun$3.apply(Runner.scala:2557)
	at scala.collection.immutable.List.foreach(List.scala:381)
	at org.scalatest.tools.Runner$.doRunRunRunDaDoRunRun(Runner.scala:2557)
	at org.scalatest.tools.Runner$$anonfun$runOptionallyWithPassFailReporter$2.apply(Runner.scala:1044)
	at org.scalatest.tools.Runner$$anonfun$runOptionallyWithPassFailReporter$2.apply(Runner.scala:1043)
	at org.scalatest.tools.Runner$.withClassLoaderAndDispatchReporter(Runner.scala:2722)
	at org.scalatest.tools.Runner$.runOptionallyWithPassFailReporter(Runner.scala:1043)
	at org.scalatest.tools.Runner$.main(Runner.scala:860)
	at org.scalatest.tools.Runner.main(Runner.scala)
2019-01-28 15:59:10 ERROR CarbonDataRDDFactory$:420 - java.io.IOException: Failed to create
local dir in /tmp/blockmgr-ce74bf3c-149c-4744-8276-e7a76b0f5b36/23.
2019-01-28 15:59:10 ERROR CarbonLoadDataCommand:391 - java.lang.Exception: DataLoad failure
2019-01-28 15:59:10 ERROR CarbonLoadDataCommand:166 - Got exception java.lang.Exception: DataLoad
failure when processing data. But this command does not support undo yet, skipping the undo
part.
2019-01-28 15:59:10 AUDIT audit:93 - {"time":"January 28, 2019 7:59:10 AM PST","username":"jenkins","opName":"LOAD
DATA OVERWRITE","opId":"8448118681915381","opStatus":"FAILED","opTime":"244 ms","table":"default.personTable","extraInfo":{"Exception":"java.lang.Exception","Message":"DataLoad
failure"}}
- LuceneDataMapExample *** FAILED ***
  java.lang.Exception: DataLoad failure
  at org.apache.carbondata.spark.rdd.CarbonDataRDDFactory$.loadCarbonData(CarbonDataRDDFactory.scala:483)
  at org.apache.spark.sql.execution.command.management.CarbonLoadDataCommand.loadData(CarbonLoadDataCommand.scala:630)
  at org.apache.spark.sql.execution.command.management.CarbonLoadDataCommand.processData(CarbonLoadDataCommand.scala:357)
  at org.apache.spark.sql.execution.command.AtomicRunnableCommand$$anonfun$run$3.apply(package.scala:148)
  at org.apache.spark.sql.execution.command.AtomicRunnableCommand$$anonfun$run$3.apply(package.scala:145)
  at org.apache.spark.sql.execution.command.Auditable$class.runWithAudit(package.scala:104)
  at org.apache.spark.sql.execution.command.AtomicRunnableCommand.runWithAudit(package.scala:141)
  at org.apache.spark.sql.execution.command.AtomicRunnableCommand.run(package.scala:145)
  at org.apache.spark.sql.CarbonDataFrameWriter.loadDataFrame(CarbonDataFrameWriter.scala:62)
  at org.apache.spark.sql.CarbonDataFrameWriter.writeToCarbonFile(CarbonDataFrameWriter.scala:46)
  ...
2019-01-28 15:59:10 AUDIT audit:72 - {"time":"January 28, 2019 7:59:10 AM PST","username":"jenkins","opName":"CREATE
TABLE","opId":"8448118962718412","opStatus":"START"}
2019-01-28 15:59:10 AUDIT audit:93 - {"time":"January 28, 2019 7:59:10 AM PST","username":"jenkins","opName":"CREATE
TABLE","opId":"8448118962718412","opStatus":"SUCCESS","opTime":"89 ms","table":"default.origin_table","extraInfo":{"bad_record_path":"","local_dictionary_enable":"true","external":"false","sort_columns":"","comment":""}}
2019-01-28 15:59:10 AUDIT audit:72 - {"time":"January 28, 2019 7:59:10 AM PST","username":"jenkins","opName":"LOAD
DATA","opId":"8448119060460784","opStatus":"START"}
2019-01-28 15:59:10 ERROR CarbonDataRDDFactory$:420 - java.io.IOException: Failed to create
local dir in /tmp/blockmgr-ce74bf3c-149c-4744-8276-e7a76b0f5b36/24.
2019-01-28 15:59:10 ERROR CarbonLoadDataCommand:391 - java.lang.Exception: DataLoad failure
2019-01-28 15:59:10 ERROR CarbonLoadDataCommand:166 - Got exception java.lang.Exception: DataLoad
failure when processing data. But this command does not support undo yet, skipping the undo
part.
2019-01-28 15:59:10 AUDIT audit:93 - {"time":"January 28, 2019 7:59:10 AM PST","username":"jenkins","opName":"LOAD
DATA","opId":"8448119060460784","opStatus":"FAILED","opTime":"44 ms","table":"default.origin_table","extraInfo":{"Exception":"java.lang.Exception","Message":"DataLoad
failure"}}
- ExternalTableExample *** FAILED ***
  java.lang.Exception: DataLoad failure
  at org.apache.carbondata.spark.rdd.CarbonDataRDDFactory$.loadCarbonData(CarbonDataRDDFactory.scala:483)
  at org.apache.spark.sql.execution.command.management.CarbonLoadDataCommand.loadData(CarbonLoadDataCommand.scala:630)
  at org.apache.spark.sql.execution.command.management.CarbonLoadDataCommand.processData(CarbonLoadDataCommand.scala:357)
  at org.apache.spark.sql.execution.command.AtomicRunnableCommand$$anonfun$run$3.apply(package.scala:148)
  at org.apache.spark.sql.execution.command.AtomicRunnableCommand$$anonfun$run$3.apply(package.scala:145)
  at org.apache.spark.sql.execution.command.Auditable$class.runWithAudit(package.scala:104)
  at org.apache.spark.sql.execution.command.AtomicRunnableCommand.runWithAudit(package.scala:141)
  at org.apache.spark.sql.execution.command.AtomicRunnableCommand.run(package.scala:145)
  at org.apache.spark.sql.execution.command.ExecutedCommandExec.sideEffectResult$lzycompute(commands.scala:58)
  at org.apache.spark.sql.execution.command.ExecutedCommandExec.sideEffectResult(commands.scala:56)
  ...

Data:
0	robot0	0	0	9223372036854775807	0.0	true	2019-03-01	2019-02-12 03:03:34.0	12.35	varchar	
Hello World From Carbon 
1	robot1	1	1	9223372036854775806	0.5	true	2019-03-01	2019-02-12 03:03:34.0	12.35	varchar	
Hello World From Carbon 
2	robot2	2	2	9223372036854775805	1.0	true	2019-03-01	2019-02-12 03:03:34.0	12.35	varchar	
Hello World From Carbon 
3	robot3	3	3	9223372036854775804	1.5	true	2019-03-01	2019-02-12 03:03:34.0	12.35	varchar	
Hello World From Carbon 
4	robot4	4	4	9223372036854775803	2.0	true	2019-03-01	2019-02-12 03:03:34.0	12.35	varchar	
Hello World From Carbon 
5	robot5	5	5	9223372036854775802	2.5	true	2019-03-01	2019-02-12 03:03:34.0	12.35	varchar	
Hello World From Carbon 
6	robot6	6	6	9223372036854775801	3.0	true	2019-03-01	2019-02-12 03:03:34.0	12.35	varchar	
Hello World From Carbon 
7	robot7	7	7	9223372036854775800	3.5	true	2019-03-01	2019-02-12 03:03:34.0	12.35	varchar	
Hello World From Carbon 
8	robot8	8	8	9223372036854775799	4.0	true	2019-03-01	2019-02-12 03:03:34.0	12.35	varchar	
Hello World From Carbon 
9	robot9	9	9	9223372036854775798	4.5	true	2019-03-01	2019-02-12 03:03:34.0	12.35	varchar	
Hello World From Carbon 

Data:
0	robot0	2019-03-01	2019-02-12 03:03:34.0	varchar	Hello World From Carbon 	0	0	9223372036854775807
0.0	true	12.35	
1	robot1	2019-03-01	2019-02-12 03:03:34.0	varchar	Hello World From Carbon 	1	1	9223372036854775806
0.5	true	12.35	
2	robot2	2019-03-01	2019-02-12 03:03:34.0	varchar	Hello World From Carbon 	2	2	9223372036854775805
1.0	true	12.35	
3	robot3	2019-03-01	2019-02-12 03:03:34.0	varchar	Hello World From Carbon 	3	3	9223372036854775804
1.5	true	12.35	
4	robot4	2019-03-01	2019-02-12 03:03:34.0	varchar	Hello World From Carbon 	4	4	9223372036854775803
2.0	true	12.35	
5	robot5	2019-03-01	2019-02-12 03:03:34.0	varchar	Hello World From Carbon 	5	5	9223372036854775802
2.5	true	12.35	
6	robot6	2019-03-01	2019-02-12 03:03:34.0	varchar	Hello World From Carbon 	6	6	9223372036854775801
3.0	true	12.35	
7	robot7	2019-03-01	2019-02-12 03:03:34.0	varchar	Hello World From Carbon 	7	7	9223372036854775800
3.5	true	12.35	
8	robot8	2019-03-01	2019-02-12 03:03:34.0	varchar	Hello World From Carbon 	8	8	9223372036854775799
4.0	true	12.35	
9	robot9	2019-03-01	2019-02-12 03:03:34.0	varchar	Hello World From Carbon 	9	9	9223372036854775798
4.5	true	12.35	
- CarbonReaderExample
2019-01-28 15:59:11 AUDIT audit:72 - {"time":"January 28, 2019 7:59:11 AM PST","username":"jenkins","opName":"CREATE
TABLE","opId":"8448119882235366","opStatus":"START"}
2019-01-28 15:59:11 AUDIT audit:93 - {"time":"January 28, 2019 7:59:11 AM PST","username":"jenkins","opName":"CREATE
TABLE","opId":"8448119882235366","opStatus":"SUCCESS","opTime":"87 ms","table":"default.hive_carbon_example","extraInfo":{"bad_record_path":"","local_dictionary_enable":"true","external":"false","sort_columns":"","comment":""}}
2019-01-28 15:59:11 AUDIT audit:72 - {"time":"January 28, 2019 7:59:11 AM PST","username":"jenkins","opName":"LOAD
DATA","opId":"8448119997530309","opStatus":"START"}
2019-01-28 15:59:11 ERROR CarbonDataRDDFactory$:420 - java.io.IOException: Failed to create
local dir in /tmp/blockmgr-ce74bf3c-149c-4744-8276-e7a76b0f5b36/25.
2019-01-28 15:59:11 ERROR CarbonLoadDataCommand:391 - java.lang.Exception: DataLoad failure
2019-01-28 15:59:11 ERROR CarbonLoadDataCommand:166 - Got exception java.lang.Exception: DataLoad
failure when processing data. But this command does not support undo yet, skipping the undo
part.
2019-01-28 15:59:11 AUDIT audit:93 - {"time":"January 28, 2019 7:59:11 AM PST","username":"jenkins","opName":"LOAD
DATA","opId":"8448119997530309","opStatus":"FAILED","opTime":"39 ms","table":"default.hive_carbon_example","extraInfo":{"Exception":"java.lang.Exception","Message":"DataLoad
failure"}}
- HiveExample *** FAILED ***
  java.lang.Exception: DataLoad failure
  at org.apache.carbondata.spark.rdd.CarbonDataRDDFactory$.loadCarbonData(CarbonDataRDDFactory.scala:483)
  at org.apache.spark.sql.execution.command.management.CarbonLoadDataCommand.loadData(CarbonLoadDataCommand.scala:630)
  at org.apache.spark.sql.execution.command.management.CarbonLoadDataCommand.processData(CarbonLoadDataCommand.scala:357)
  at org.apache.spark.sql.execution.command.AtomicRunnableCommand$$anonfun$run$3.apply(package.scala:148)
  at org.apache.spark.sql.execution.command.AtomicRunnableCommand$$anonfun$run$3.apply(package.scala:145)
  at org.apache.spark.sql.execution.command.Auditable$class.runWithAudit(package.scala:104)
  at org.apache.spark.sql.execution.command.AtomicRunnableCommand.runWithAudit(package.scala:141)
  at org.apache.spark.sql.execution.command.AtomicRunnableCommand.run(package.scala:145)
  at org.apache.spark.sql.execution.command.ExecutedCommandExec.sideEffectResult$lzycompute(commands.scala:58)
  at org.apache.spark.sql.execution.command.ExecutedCommandExec.sideEffectResult(commands.scala:56)
  ...
Run completed in 59 seconds, 407 milliseconds.
Total number of tests run: 20
Suites: completed 2, aborted 0
Tests: succeeded 1, failed 19, canceled 0, ignored 0, pending 0
*** 19 TESTS FAILED ***
[JENKINS] Recording test results
[INFO]                                                                         
[INFO] ------------------------------------------------------------------------
[INFO] Skipping Apache CarbonData :: Parent
[INFO] This project has been banned from the build due to previous failures.
[INFO] ------------------------------------------------------------------------
[INFO] ------------------------------------------------------------------------
[INFO] Reactor Summary:
[INFO] 
[INFO] Apache CarbonData :: Parent ........................ SUCCESS [ 11.347 s]
[INFO] Apache CarbonData :: Common ........................ SUCCESS [ 19.166 s]
[INFO] Apache CarbonData :: Core .......................... SUCCESS [03:20 min]
[INFO] Apache CarbonData :: Processing .................... SUCCESS [ 42.095 s]
[INFO] Apache CarbonData :: Hadoop ........................ SUCCESS [ 32.946 s]
[INFO] Apache CarbonData :: Streaming ..................... SUCCESS [ 40.595 s]
[INFO] Apache CarbonData :: Store SDK ..................... SUCCESS [ 56.864 s]
[INFO] Apache CarbonData :: Spark Datasource .............. SUCCESS [04:18 min]
[INFO] Apache CarbonData :: Spark Common .................. SUCCESS [02:00 min]
[INFO] Apache CarbonData :: CLI ........................... SUCCESS [04:00 min]
[INFO] Apache CarbonData :: Lucene Index DataMap .......... SUCCESS [ 22.395 s]
[INFO] Apache CarbonData :: Bloom Index DataMap ........... SUCCESS [ 19.059 s]
[INFO] Apache CarbonData :: Spark2 ........................ SUCCESS [23:43 min]
[INFO] Apache CarbonData :: Spark Common Test ............. SUCCESS [  01:24 h]
[INFO] Apache CarbonData :: DataMap Examples .............. SUCCESS [ 17.141 s]
[INFO] Apache CarbonData :: Assembly ...................... SUCCESS [ 22.285 s]
[INFO] Apache CarbonData :: Hive .......................... SUCCESS [ 47.940 s]
[INFO] Apache CarbonData :: presto ........................ SUCCESS [02:27 min]
[INFO] Apache CarbonData :: Examples ...................... FAILURE [02:16 min]
[INFO] ------------------------------------------------------------------------
[INFO] BUILD FAILURE
[INFO] ------------------------------------------------------------------------
[INFO] Total time: 02:13 h
[INFO] Finished at: 2019-01-28T15:59:34+00:00
[INFO] Final Memory: 198M/2081M
[INFO] ------------------------------------------------------------------------
Waiting for Jenkins to finish collecting data
[ERROR] Failed to execute goal org.scalatest:scalatest-maven-plugin:1.0:test (test) on project
carbondata-examples: There are test failures -> [Help 1]
org.apache.maven.lifecycle.LifecycleExecutionException: Failed to execute goal org.scalatest:scalatest-maven-plugin:1.0:test
(test) on project carbondata-examples: There are test failures
	at org.apache.maven.lifecycle.internal.MojoExecutor.execute(MojoExecutor.java:212)
	at org.apache.maven.lifecycle.internal.MojoExecutor.execute(MojoExecutor.java:153)
	at org.apache.maven.lifecycle.internal.MojoExecutor.execute(MojoExecutor.java:145)
	at org.apache.maven.lifecycle.internal.LifecycleModuleBuilder.buildProject(LifecycleModuleBuilder.java:116)
	at org.apache.maven.lifecycle.internal.LifecycleModuleBuilder.buildProject(LifecycleModuleBuilder.java:80)
	at org.apache.maven.lifecycle.internal.builder.singlethreaded.SingleThreadedBuilder.build(SingleThreadedBuilder.java:51)
	at org.apache.maven.lifecycle.internal.LifecycleStarter.execute(LifecycleStarter.java:128)
	at org.apache.maven.DefaultMaven.doExecute(DefaultMaven.java:307)
	at org.apache.maven.DefaultMaven.doExecute(DefaultMaven.java:193)
	at org.apache.maven.DefaultMaven.execute(DefaultMaven.java:106)
	at org.jvnet.hudson.maven3.launcher.Maven33Launcher.main(Maven33Launcher.java:129)
	at sun.reflect.NativeMethodAccessorImpl.invoke0(Native Method)
	at sun.reflect.NativeMethodAccessorImpl.invoke(NativeMethodAccessorImpl.java:62)
	at sun.reflect.DelegatingMethodAccessorImpl.invoke(DelegatingMethodAccessorImpl.java:43)
	at java.lang.reflect.Method.invoke(Method.java:498)
	at org.codehaus.plexus.classworlds.launcher.Launcher.launchStandard(Launcher.java:330)
	at org.codehaus.plexus.classworlds.launcher.Launcher.launch(Launcher.java:238)
	at jenkins.maven3.agent.Maven33Main.launch(Maven33Main.java:176)
	at sun.reflect.NativeMethodAccessorImpl.invoke0(Native Method)
	at sun.reflect.NativeMethodAccessorImpl.invoke(NativeMethodAccessorImpl.java:62)
	at sun.reflect.DelegatingMethodAccessorImpl.invoke(DelegatingMethodAccessorImpl.java:43)
	at java.lang.reflect.Method.invoke(Method.java:498)
	at hudson.maven.Maven3Builder.call(Maven3Builder.java:139)
	at hudson.maven.Maven3Builder.call(Maven3Builder.java:70)
	at hudson.remoting.UserRequest.perform(UserRequest.java:212)
	at hudson.remoting.UserRequest.perform(UserRequest.java:54)
	at hudson.remoting.Request$2.run(Request.java:369)
	at hudson.remoting.InterceptingExecutorService$1.call(InterceptingExecutorService.java:72)
	at java.util.concurrent.FutureTask.run(FutureTask.java:266)
	at java.util.concurrent.ThreadPoolExecutor.runWorker(ThreadPoolExecutor.java:1149)
	at java.util.concurrent.ThreadPoolExecutor$Worker.run(ThreadPoolExecutor.java:624)
	at java.lang.Thread.run(Thread.java:748)
Caused by: org.apache.maven.plugin.MojoFailureException: There are test failures
	at org.scalatest.tools.maven.TestMojo.execute(TestMojo.java:107)
	at org.apache.maven.plugin.DefaultBuildPluginManager.executeMojo(DefaultBuildPluginManager.java:134)
	at org.apache.maven.lifecycle.internal.MojoExecutor.execute(MojoExecutor.java:207)
	... 31 more
[ERROR] 
[ERROR] Re-run Maven using the -X switch to enable full debug logging.
[ERROR] 
[ERROR] For more information about the errors and possible solutions, please read the following
articles:
[ERROR] [Help 1] http://cwiki.apache.org/confluence/display/MAVEN/MojoFailureException
[ERROR] 
[ERROR] After correcting the problems, you can resume the build with the command
[ERROR]   mvn <goals> -rf :carbondata-examples
[JENKINS] Archiving <https://builds.apache.org/job/carbondata-master-spark-2.2/ws/processing/pom.xml>
to org.apache.carbondata/carbondata-processing/1.6.0-SNAPSHOT/carbondata-processing-1.6.0-SNAPSHOT.pom
[JENKINS] Archiving <https://builds.apache.org/job/carbondata-master-spark-2.2/ws/processing/target/carbondata-processing-1.6.0-SNAPSHOT.jar>
to org.apache.carbondata/carbondata-processing/1.6.0-SNAPSHOT/carbondata-processing-1.6.0-SNAPSHOT.jar
[Fast Archiver] No artifacts from carbondata-master-spark-2.2 » Apache CarbonData :: Processing
#1509 to compare, so performing full copy of artifacts
[JENKINS] Archiving <https://builds.apache.org/job/carbondata-master-spark-2.2/ws/datamap/examples/pom.xml>
to org.apache.carbondata/carbondata-datamap-examples/1.6.0-SNAPSHOT/carbondata-datamap-examples-1.6.0-SNAPSHOT.pom
[JENKINS] Archiving <https://builds.apache.org/job/carbondata-master-spark-2.2/ws/datamap/examples/target/carbondata-datamap-examples-1.6.0-SNAPSHOT.jar>
to org.apache.carbondata/carbondata-datamap-examples/1.6.0-SNAPSHOT/carbondata-datamap-examples-1.6.0-SNAPSHOT.jar
[JENKINS] Archiving <https://builds.apache.org/job/carbondata-master-spark-2.2/ws/streaming/pom.xml>
to org.apache.carbondata/carbondata-streaming/1.6.0-SNAPSHOT/carbondata-streaming-1.6.0-SNAPSHOT.pom
[JENKINS] Archiving <https://builds.apache.org/job/carbondata-master-spark-2.2/ws/streaming/target/carbondata-streaming-1.6.0-SNAPSHOT.jar>
to org.apache.carbondata/carbondata-streaming/1.6.0-SNAPSHOT/carbondata-streaming-1.6.0-SNAPSHOT.jar
[Fast Archiver] No artifacts from carbondata-master-spark-2.2 » Apache CarbonData :: Streaming
#1509 to compare, so performing full copy of artifacts
[JENKINS] Archiving <https://builds.apache.org/job/carbondata-master-spark-2.2/ws/integration/spark-common/pom.xml>
to org.apache.carbondata/carbondata-spark-common/1.6.0-SNAPSHOT/carbondata-spark-common-1.6.0-SNAPSHOT.pom
[JENKINS] Archiving <https://builds.apache.org/job/carbondata-master-spark-2.2/ws/integration/spark-common/target/carbondata-spark-common-1.6.0-SNAPSHOT.jar>
to org.apache.carbondata/carbondata-spark-common/1.6.0-SNAPSHOT/carbondata-spark-common-1.6.0-SNAPSHOT.jar
[Fast Archiver] No artifacts from carbondata-master-spark-2.2 » Apache CarbonData :: Spark
Common #1509 to compare, so performing full copy of artifacts
[JENKINS] Archiving <https://builds.apache.org/job/carbondata-master-spark-2.2/ws/datamap/lucene/pom.xml>
to org.apache.carbondata/carbondata-lucene/1.6.0-SNAPSHOT/carbondata-lucene-1.6.0-SNAPSHOT.pom
[JENKINS] Archiving <https://builds.apache.org/job/carbondata-master-spark-2.2/ws/datamap/lucene/target/carbondata-lucene-1.6.0-SNAPSHOT.jar>
to org.apache.carbondata/carbondata-lucene/1.6.0-SNAPSHOT/carbondata-lucene-1.6.0-SNAPSHOT.jar
[Fast Archiver] No artifacts from carbondata-master-spark-2.2 » Apache CarbonData :: Lucene
Index DataMap #1509 to compare, so performing full copy of artifacts
[JENKINS] Archiving <https://builds.apache.org/job/carbondata-master-spark-2.2/ws/integration/hive/pom.xml>
to org.apache.carbondata/carbondata-hive/1.6.0-SNAPSHOT/carbondata-hive-1.6.0-SNAPSHOT.pom
[JENKINS] Archiving <https://builds.apache.org/job/carbondata-master-spark-2.2/ws/integration/hive/target/carbondata-hive-1.6.0-SNAPSHOT.jar>
to org.apache.carbondata/carbondata-hive/1.6.0-SNAPSHOT/carbondata-hive-1.6.0-SNAPSHOT.jar
[JENKINS] Archiving <https://builds.apache.org/job/carbondata-master-spark-2.2/ws/examples/spark2/pom.xml>
to org.apache.carbondata/carbondata-examples/1.6.0-SNAPSHOT/carbondata-examples-1.6.0-SNAPSHOT.pom
[JENKINS] Archiving <https://builds.apache.org/job/carbondata-master-spark-2.2/ws/common/pom.xml>
to org.apache.carbondata/carbondata-common/1.6.0-SNAPSHOT/carbondata-common-1.6.0-SNAPSHOT.pom
[JENKINS] Archiving <https://builds.apache.org/job/carbondata-master-spark-2.2/ws/common/target/carbondata-common-1.6.0-SNAPSHOT.jar>
to org.apache.carbondata/carbondata-common/1.6.0-SNAPSHOT/carbondata-common-1.6.0-SNAPSHOT.jar
[Fast Archiver] No artifacts from carbondata-master-spark-2.2 » Apache CarbonData :: Common
#1509 to compare, so performing full copy of artifacts
[JENKINS] Archiving <https://builds.apache.org/job/carbondata-master-spark-2.2/ws/integration/spark2/pom.xml>
to org.apache.carbondata/carbondata-spark2/1.6.0-SNAPSHOT/carbondata-spark2-1.6.0-SNAPSHOT.pom
[JENKINS] Archiving <https://builds.apache.org/job/carbondata-master-spark-2.2/ws/integration/spark2/target/carbondata-spark2-1.6.0-SNAPSHOT.jar>
to org.apache.carbondata/carbondata-spark2/1.6.0-SNAPSHOT/carbondata-spark2-1.6.0-SNAPSHOT.jar
[Fast Archiver] No artifacts from carbondata-master-spark-2.2 » Apache CarbonData :: Spark2
#1509 to compare, so performing full copy of artifacts
[JENKINS] Archiving <https://builds.apache.org/job/carbondata-master-spark-2.2/ws/tools/cli/pom.xml>
to org.apache.carbondata/carbondata-cli/1.6.0-SNAPSHOT/carbondata-cli-1.6.0-SNAPSHOT.pom
[JENKINS] Archiving <https://builds.apache.org/job/carbondata-master-spark-2.2/ws/tools/cli/target/carbondata-cli-1.6.0-SNAPSHOT.jar>
to org.apache.carbondata/carbondata-cli/1.6.0-SNAPSHOT/carbondata-cli-1.6.0-SNAPSHOT.jar
[Fast Archiver] No artifacts from carbondata-master-spark-2.2 » Apache CarbonData :: CLI
#1509 to compare, so performing full copy of artifacts
[JENKINS] Archiving <https://builds.apache.org/job/carbondata-master-spark-2.2/ws/datamap/bloom/pom.xml>
to org.apache.carbondata/carbondata-bloom/1.6.0-SNAPSHOT/carbondata-bloom-1.6.0-SNAPSHOT.pom
[JENKINS] Archiving <https://builds.apache.org/job/carbondata-master-spark-2.2/ws/datamap/bloom/target/carbondata-bloom-1.6.0-SNAPSHOT.jar>
to org.apache.carbondata/carbondata-bloom/1.6.0-SNAPSHOT/carbondata-bloom-1.6.0-SNAPSHOT.jar
[Fast Archiver] No artifacts from carbondata-master-spark-2.2 » Apache CarbonData :: Bloom
Index DataMap #1509 to compare, so performing full copy of artifacts
[JENKINS] Archiving <https://builds.apache.org/job/carbondata-master-spark-2.2/ws/assembly/pom.xml>
to org.apache.carbondata/carbondata-assembly/1.6.0-SNAPSHOT/carbondata-assembly-1.6.0-SNAPSHOT.pom
[JENKINS] Archiving <https://builds.apache.org/job/carbondata-master-spark-2.2/ws/pom.xml>
to org.apache.carbondata/carbondata-parent/1.6.0-SNAPSHOT/carbondata-parent-1.6.0-SNAPSHOT.pom
[Fast Archiver] No artifacts from carbondata-master-spark-2.2 » Apache CarbonData :: Parent
#1509 to compare, so performing full copy of artifacts
[JENKINS] Archiving <https://builds.apache.org/job/carbondata-master-spark-2.2/ws/core/pom.xml>
to org.apache.carbondata/carbondata-core/1.6.0-SNAPSHOT/carbondata-core-1.6.0-SNAPSHOT.pom
[JENKINS] Archiving <https://builds.apache.org/job/carbondata-master-spark-2.2/ws/core/target/carbondata-core-1.6.0-SNAPSHOT.jar>
to org.apache.carbondata/carbondata-core/1.6.0-SNAPSHOT/carbondata-core-1.6.0-SNAPSHOT.jar
[Fast Archiver] No artifacts from carbondata-master-spark-2.2 » Apache CarbonData :: Core
#1509 to compare, so performing full copy of artifacts
[JENKINS] Archiving <https://builds.apache.org/job/carbondata-master-spark-2.2/ws/hadoop/pom.xml>
to org.apache.carbondata/carbondata-hadoop/1.6.0-SNAPSHOT/carbondata-hadoop-1.6.0-SNAPSHOT.pom
[JENKINS] Archiving <https://builds.apache.org/job/carbondata-master-spark-2.2/ws/hadoop/target/carbondata-hadoop-1.6.0-SNAPSHOT.jar>
to org.apache.carbondata/carbondata-hadoop/1.6.0-SNAPSHOT/carbondata-hadoop-1.6.0-SNAPSHOT.jar
[Fast Archiver] No artifacts from carbondata-master-spark-2.2 » Apache CarbonData :: Hadoop
#1509 to compare, so performing full copy of artifacts
[JENKINS] Archiving <https://builds.apache.org/job/carbondata-master-spark-2.2/ws/integration/spark-datasource/pom.xml>
to org.apache.carbondata/carbondata-spark-datasource/1.6.0-SNAPSHOT/carbondata-spark-datasource-1.6.0-SNAPSHOT.pom
[JENKINS] Archiving <https://builds.apache.org/job/carbondata-master-spark-2.2/ws/integration/spark-datasource/target/carbondata-spark-datasource-1.6.0-SNAPSHOT.jar>
to org.apache.carbondata/carbondata-spark-datasource/1.6.0-SNAPSHOT/carbondata-spark-datasource-1.6.0-SNAPSHOT.jar
[Fast Archiver] No artifacts from carbondata-master-spark-2.2 » Apache CarbonData :: Spark
Datasource #1509 to compare, so performing full copy of artifacts
[JENKINS] Archiving <https://builds.apache.org/job/carbondata-master-spark-2.2/ws/integration/presto/pom.xml>
to org.apache.carbondata/carbondata-presto/1.6.0-SNAPSHOT/carbondata-presto-1.6.0-SNAPSHOT.pom
[JENKINS] Archiving <https://builds.apache.org/job/carbondata-master-spark-2.2/ws/integration/presto/target/carbondata-presto-1.6.0-SNAPSHOT.zip>
to org.apache.carbondata/carbondata-presto/1.6.0-SNAPSHOT/carbondata-presto-1.6.0-SNAPSHOT.zip
[JENKINS] Archiving <https://builds.apache.org/job/carbondata-master-spark-2.2/ws/integration/presto/target/carbondata-presto-1.6.0-SNAPSHOT.jar>
to org.apache.carbondata/carbondata-presto/1.6.0-SNAPSHOT/carbondata-presto-1.6.0-SNAPSHOT.jar
[Fast Archiver] Compressed 142.84 MB of artifacts by 95.6% relative to #1507
[JENKINS] Archiving <https://builds.apache.org/job/carbondata-master-spark-2.2/ws/integration/spark-common-test/pom.xml>
to org.apache.carbondata/carbondata-spark-common-test/1.6.0-SNAPSHOT/carbondata-spark-common-test-1.6.0-SNAPSHOT.pom
[JENKINS] Archiving <https://builds.apache.org/job/carbondata-master-spark-2.2/ws/integration/spark-common-test/target/carbondata-spark-common-test-1.6.0-SNAPSHOT.jar>
to org.apache.carbondata/carbondata-spark-common-test/1.6.0-SNAPSHOT/carbondata-spark-common-test-1.6.0-SNAPSHOT.jar
[JENKINS] Archiving <https://builds.apache.org/job/carbondata-master-spark-2.2/ws/store/sdk/pom.xml>
to org.apache.carbondata/carbondata-store-sdk/1.6.0-SNAPSHOT/carbondata-store-sdk-1.6.0-SNAPSHOT.pom
[JENKINS] Archiving <https://builds.apache.org/job/carbondata-master-spark-2.2/ws/store/sdk/target/carbondata-store-sdk-1.6.0-SNAPSHOT.jar>
to org.apache.carbondata/carbondata-store-sdk/1.6.0-SNAPSHOT/carbondata-store-sdk-1.6.0-SNAPSHOT.jar
[Fast Archiver] No artifacts from carbondata-master-spark-2.2 » Apache CarbonData :: Store
SDK #1509 to compare, so performing full copy of artifacts
Sending e-mails to: commits@carbondata.apache.org
Sending e-mails to: commits@carbondata.apache.org
Sending e-mails to: commits@carbondata.apache.org
channel stopped

Mime
View raw message