carbondata-commits mailing list archives

Site index · List index
Message view « Date » · « Thread »
Top « Date » · « Thread »
From Apache Jenkins Server <jenk...@builds.apache.org>
Subject Build failed in Jenkins: carbondata-master-spark-2.1 #3281
Date Tue, 01 Jan 2019 09:42:57 GMT
See <https://builds.apache.org/job/carbondata-master-spark-2.1/3281/display/redirect>

------------------------------------------
[...truncated 8.37 MB...]
	at org.scalatest.tools.DiscoverySuite.runNestedSuites(DiscoverySuite.scala:29)
	at org.scalatest.Suite$class.run(Suite.scala:1421)
	at org.scalatest.tools.DiscoverySuite.run(DiscoverySuite.scala:29)
	at org.scalatest.tools.SuiteRunner.run(SuiteRunner.scala:55)
	at org.scalatest.tools.Runner$$anonfun$doRunRunRunDaDoRunRun$3.apply(Runner.scala:2563)
	at org.scalatest.tools.Runner$$anonfun$doRunRunRunDaDoRunRun$3.apply(Runner.scala:2557)
	at scala.collection.immutable.List.foreach(List.scala:381)
	at org.scalatest.tools.Runner$.doRunRunRunDaDoRunRun(Runner.scala:2557)
	at org.scalatest.tools.Runner$$anonfun$runOptionallyWithPassFailReporter$2.apply(Runner.scala:1044)
	at org.scalatest.tools.Runner$$anonfun$runOptionallyWithPassFailReporter$2.apply(Runner.scala:1043)
	at org.scalatest.tools.Runner$.withClassLoaderAndDispatchReporter(Runner.scala:2722)
	at org.scalatest.tools.Runner$.runOptionallyWithPassFailReporter(Runner.scala:1043)
	at org.scalatest.tools.Runner$.main(Runner.scala:860)
	at org.scalatest.tools.Runner.main(Runner.scala)
null
- CarbonReaderExample
2019-01-01 09:41:22 AUDIT audit:72 - {"time":"January 1, 2019 1:41:22 AM PST","username":"jenkins","opName":"CREATE
TABLE","opId":"6092763544965522","opStatus":"START"}
2019-01-01 09:41:22 AUDIT audit:93 - {"time":"January 1, 2019 1:41:22 AM PST","username":"jenkins","opName":"CREATE
TABLE","opId":"6092763544965522","opStatus":"SUCCESS","opTime":"93 ms","table":"default.hive_carbon_example","extraInfo":{"bad_record_path":"","local_dictionary_enable":"true","external":"false","sort_columns":"","comment":""}}
2019-01-01 09:41:22 AUDIT audit:72 - {"time":"January 1, 2019 1:41:22 AM PST","username":"jenkins","opName":"LOAD
DATA","opId":"6092763662561174","opStatus":"START"}
2019-01-01 09:41:23 AUDIT audit:93 - {"time":"January 1, 2019 1:41:23 AM PST","username":"jenkins","opName":"LOAD
DATA","opId":"6092763662561174","opStatus":"SUCCESS","opTime":"179 ms","table":"default.hive_carbon_example","extraInfo":{"SegmentId":"0","DataSize":"921.0B","IndexSize":"498.0B"}}
+---+---------+--------+
| id|     name|  salary|
+---+---------+--------+
|  1|  'liang'|200000.0|
|  2|'anubhav'| 20000.0|
+---+---------+--------+

OK
OK
OK
OK
+---++-------++--------------+
| ID|| NAME || SALARY        |
+---++-------++--------------+
| 1 || 'liang' || 200000.0  |
+---++-------++--------------+
| 2 || 'anubhav' || 20000.0   |
+---++-------++--------------+
******Total Number Of Rows Fetched ****** 2
OK
+--------------+
| NAME         |
+---++---------+
| 'liang'    |
+---++---------+
| 'anubhav'      |
+---++---------+
 ********** Total Rows Fetched When Quering The Individual Columns **********2
OK
+---++-------++--------------+
| Salary|| ID || NAME        |
+---++-------++--------------+
| 200000.0 || 1 || 'liang'  |
+---++-------++--------------+
| 20000.0 || 2 || 'anubhav'   |
+---++-------++--------------+
 ********** Total Rows Fetched When Quering The Out Of Order Columns **********2
- HiveExample
Exception encountered when invoking run on a nested suite - Cannot call methods on a
stopped SparkContext.
This stopped SparkContext was created at:

org.apache.spark.sql.test.util.QueryTest.<init>(QueryTest.scala:115)
org.apache.carbondata.examplesCI.RunExamples.<init>(RunExamples.scala:35)
sun.reflect.NativeConstructorAccessorImpl.newInstance0(Native Method)
sun.reflect.NativeConstructorAccessorImpl.newInstance(NativeConstructorAccessorImpl.java:62)
sun.reflect.DelegatingConstructorAccessorImpl.newInstance(DelegatingConstructorAccessorImpl.java:45)
java.lang.reflect.Constructor.newInstance(Constructor.java:423)
java.lang.Class.newInstance(Class.java:442)
org.scalatest.tools.DiscoverySuite$.getSuiteInstance(DiscoverySuite.scala:69)
org.scalatest.tools.DiscoverySuite$$anonfun$1.apply(DiscoverySuite.scala:38)
org.scalatest.tools.DiscoverySuite$$anonfun$1.apply(DiscoverySuite.scala:37)
scala.collection.TraversableLike$$anonfun$map$1.apply(TraversableLike.scala:234)
scala.collection.TraversableLike$$anonfun$map$1.apply(TraversableLike.scala:234)
scala.collection.Iterator$class.foreach(Iterator.scala:893)
scala.collection.AbstractIterator.foreach(Iterator.scala:1336)
scala.collection.IterableLike$class.foreach(IterableLike.scala:72)
scala.collection.AbstractIterable.foreach(Iterable.scala:54)
scala.collection.TraversableLike$class.map(TraversableLike.scala:234)
scala.collection.AbstractTraversable.map(Traversable.scala:104)
org.scalatest.tools.DiscoverySuite.<init>(DiscoverySuite.scala:37)
org.scalatest.tools.Runner$.genDiscoSuites$1(Runner.scala:2390)

The currently active SparkContext was created at:

(No active SparkContext.)
          *** ABORTED ***
  java.lang.IllegalStateException: Cannot call methods on a stopped SparkContext.
This stopped SparkContext was created at:

org.apache.spark.sql.test.util.QueryTest.<init>(QueryTest.scala:115)
org.apache.carbondata.examplesCI.RunExamples.<init>(RunExamples.scala:35)
sun.reflect.NativeConstructorAccessorImpl.newInstance0(Native Method)
sun.reflect.NativeConstructorAccessorImpl.newInstance(NativeConstructorAccessorImpl.java:62)
sun.reflect.DelegatingConstructorAccessorImpl.newInstance(DelegatingConstructorAccessorImpl.java:45)
java.lang.reflect.Constructor.newInstance(Constructor.java:423)
java.lang.Class.newInstance(Class.java:442)
org.scalatest.tools.DiscoverySuite$.getSuiteInstance(DiscoverySuite.scala:69)
org.scalatest.tools.DiscoverySuite$$anonfun$1.apply(DiscoverySuite.scala:38)
org.scalatest.tools.DiscoverySuite$$anonfun$1.apply(DiscoverySuite.scala:37)
scala.collection.TraversableLike$$anonfun$map$1.apply(TraversableLike.scala:234)
scala.collection.TraversableLike$$anonfun$map$1.apply(TraversableLike.scala:234)
scala.collection.Iterator$class.foreach(Iterator.scala:893)
scala.collection.AbstractIterator.foreach(Iterator.scala:1336)
scala.collection.IterableLike$class.foreach(IterableLike.scala:72)
scala.collection.AbstractIterable.foreach(Iterable.scala:54)
scala.collection.TraversableLike$class.map(TraversableLike.scala:234)
scala.collection.AbstractTraversable.map(Traversable.scala:104)
org.scalatest.tools.DiscoverySuite.<init>(DiscoverySuite.scala:37)
org.scalatest.tools.Runner$.genDiscoSuites$1(Runner.scala:2390)

The currently active SparkContext was created at:

(No active SparkContext.)
  at org.apache.spark.SparkContext.assertNotStopped(SparkContext.scala:100)
  at org.apache.spark.SparkContext$$anonfun$parallelize$1.apply(SparkContext.scala:716)
  at org.apache.spark.SparkContext$$anonfun$parallelize$1.apply(SparkContext.scala:715)
  at org.apache.spark.rdd.RDDOperationScope$.withScope(RDDOperationScope.scala:151)
  at org.apache.spark.rdd.RDDOperationScope$.withScope(RDDOperationScope.scala:112)
  at org.apache.spark.SparkContext.withScope(SparkContext.scala:701)
  at org.apache.spark.SparkContext.parallelize(SparkContext.scala:715)
  at org.apache.spark.sql.execution.command.ExecutedCommandExec.doExecute(commands.scala:74)
  at org.apache.spark.sql.execution.SparkPlan$$anonfun$execute$1.apply(SparkPlan.scala:114)
  at org.apache.spark.sql.execution.SparkPlan$$anonfun$execute$1.apply(SparkPlan.scala:114)
  ...
Run completed in 3 minutes, 0 seconds.
Total number of tests run: 20
Suites: completed 1, aborted 1
Tests: succeeded 20, failed 0, canceled 0, ignored 0, pending 0
*** 1 SUITE ABORTED ***
[JENKINS] Recording test results
[INFO] ------------------------------------------------------------------------
[INFO] Reactor Summary:
[INFO] 
[INFO] Apache CarbonData :: Parent ........................ SUCCESS [ 10.886 s]
[INFO] Apache CarbonData :: Common ........................ SUCCESS [ 17.451 s]
[INFO] Apache CarbonData :: Core .......................... SUCCESS [03:14 min]
[INFO] Apache CarbonData :: Processing .................... SUCCESS [ 39.676 s]
[INFO] Apache CarbonData :: Hadoop ........................ SUCCESS [ 29.342 s]
[INFO] Apache CarbonData :: Streaming ..................... SUCCESS [ 39.648 s]
[INFO] Apache CarbonData :: Store SDK ..................... SUCCESS [ 53.815 s]
[INFO] Apache CarbonData :: Spark Datasource .............. SUCCESS [03:39 min]
[INFO] Apache CarbonData :: Spark Common .................. SUCCESS [01:49 min]
[INFO] Apache CarbonData :: CLI ........................... SUCCESS [04:14 min]
[INFO] Apache CarbonData :: Lucene Index DataMap .......... SUCCESS [ 20.156 s]
[INFO] Apache CarbonData :: Bloom Index DataMap ........... SUCCESS [ 18.179 s]
[INFO] Apache CarbonData :: Spark2 ........................ SUCCESS [22:52 min]
[INFO] Apache CarbonData :: Spark Common Test ............. SUCCESS [  01:22 h]
[INFO] Apache CarbonData :: DataMap Examples .............. SUCCESS [ 15.249 s]
[INFO] Apache CarbonData :: Assembly ...................... SUCCESS [ 19.956 s]
[INFO] Apache CarbonData :: Hive .......................... SUCCESS [ 44.599 s]
[INFO] Apache CarbonData :: presto ........................ SUCCESS [02:20 min]
[INFO] Apache CarbonData :: Examples ...................... FAILURE [04:11 min]
[INFO] ------------------------------------------------------------------------
[INFO] BUILD FAILURE
[INFO] ------------------------------------------------------------------------
[INFO] Total time: 02:11 h
[INFO] Finished at: 2019-01-01T09:42:24+00:00
[INFO] Final Memory: 193M/2186M
[INFO] ------------------------------------------------------------------------
Waiting for Jenkins to finish collecting data
[ERROR] Failed to execute goal org.scalatest:scalatest-maven-plugin:1.0:test (test) on project
carbondata-examples: There are test failures -> [Help 1]
org.apache.maven.lifecycle.LifecycleExecutionException: Failed to execute goal org.scalatest:scalatest-maven-plugin:1.0:test
(test) on project carbondata-examples: There are test failures
	at org.apache.maven.lifecycle.internal.MojoExecutor.execute(MojoExecutor.java:212)
	at org.apache.maven.lifecycle.internal.MojoExecutor.execute(MojoExecutor.java:153)
	at org.apache.maven.lifecycle.internal.MojoExecutor.execute(MojoExecutor.java:145)
	at org.apache.maven.lifecycle.internal.LifecycleModuleBuilder.buildProject(LifecycleModuleBuilder.java:116)
	at org.apache.maven.lifecycle.internal.LifecycleModuleBuilder.buildProject(LifecycleModuleBuilder.java:80)
	at org.apache.maven.lifecycle.internal.builder.singlethreaded.SingleThreadedBuilder.build(SingleThreadedBuilder.java:51)
	at org.apache.maven.lifecycle.internal.LifecycleStarter.execute(LifecycleStarter.java:128)
	at org.apache.maven.DefaultMaven.doExecute(DefaultMaven.java:307)
	at org.apache.maven.DefaultMaven.doExecute(DefaultMaven.java:193)
	at org.apache.maven.DefaultMaven.execute(DefaultMaven.java:106)
	at org.jvnet.hudson.maven3.launcher.Maven33Launcher.main(Maven33Launcher.java:129)
	at sun.reflect.NativeMethodAccessorImpl.invoke0(Native Method)
	at sun.reflect.NativeMethodAccessorImpl.invoke(NativeMethodAccessorImpl.java:62)
	at sun.reflect.DelegatingMethodAccessorImpl.invoke(DelegatingMethodAccessorImpl.java:43)
	at java.lang.reflect.Method.invoke(Method.java:498)
	at org.codehaus.plexus.classworlds.launcher.Launcher.launchStandard(Launcher.java:330)
	at org.codehaus.plexus.classworlds.launcher.Launcher.launch(Launcher.java:238)
	at jenkins.maven3.agent.Maven33Main.launch(Maven33Main.java:176)
	at sun.reflect.NativeMethodAccessorImpl.invoke0(Native Method)
	at sun.reflect.NativeMethodAccessorImpl.invoke(NativeMethodAccessorImpl.java:62)
	at sun.reflect.DelegatingMethodAccessorImpl.invoke(DelegatingMethodAccessorImpl.java:43)
	at java.lang.reflect.Method.invoke(Method.java:498)
	at hudson.maven.Maven3Builder.call(Maven3Builder.java:139)
	at hudson.maven.Maven3Builder.call(Maven3Builder.java:70)
	at hudson.remoting.UserRequest.perform(UserRequest.java:212)
	at hudson.remoting.UserRequest.perform(UserRequest.java:54)
	at hudson.remoting.Request$2.run(Request.java:369)
	at hudson.remoting.InterceptingExecutorService$1.call(InterceptingExecutorService.java:72)
	at java.util.concurrent.FutureTask.run(FutureTask.java:266)
	at java.util.concurrent.ThreadPoolExecutor.runWorker(ThreadPoolExecutor.java:1149)
	at java.util.concurrent.ThreadPoolExecutor$Worker.run(ThreadPoolExecutor.java:624)
	at java.lang.Thread.run(Thread.java:748)
Caused by: org.apache.maven.plugin.MojoFailureException: There are test failures
	at org.scalatest.tools.maven.TestMojo.execute(TestMojo.java:107)
	at org.apache.maven.plugin.DefaultBuildPluginManager.executeMojo(DefaultBuildPluginManager.java:134)
	at org.apache.maven.lifecycle.internal.MojoExecutor.execute(MojoExecutor.java:207)
	... 31 more
[ERROR] 
[ERROR] Re-run Maven using the -X switch to enable full debug logging.
[ERROR] 
[ERROR] For more information about the errors and possible solutions, please read the following
articles:
[ERROR] [Help 1] http://cwiki.apache.org/confluence/display/MAVEN/MojoFailureException
[ERROR] 
[ERROR] After correcting the problems, you can resume the build with the command
[ERROR]   mvn <goals> -rf :carbondata-examples
[JENKINS] Archiving <https://builds.apache.org/job/carbondata-master-spark-2.1/ws/processing/pom.xml>
to org.apache.carbondata/carbondata-processing/1.6.0-SNAPSHOT/carbondata-processing-1.6.0-SNAPSHOT.pom
[JENKINS] Archiving <https://builds.apache.org/job/carbondata-master-spark-2.1/ws/processing/target/carbondata-processing-1.6.0-SNAPSHOT.jar>
to org.apache.carbondata/carbondata-processing/1.6.0-SNAPSHOT/carbondata-processing-1.6.0-SNAPSHOT.jar
[JENKINS] Archiving <https://builds.apache.org/job/carbondata-master-spark-2.1/ws/datamap/examples/pom.xml>
to org.apache.carbondata/carbondata-datamap-examples/1.6.0-SNAPSHOT/carbondata-datamap-examples-1.6.0-SNAPSHOT.pom
[JENKINS] Archiving <https://builds.apache.org/job/carbondata-master-spark-2.1/ws/datamap/examples/target/carbondata-datamap-examples-1.6.0-SNAPSHOT.jar>
to org.apache.carbondata/carbondata-datamap-examples/1.6.0-SNAPSHOT/carbondata-datamap-examples-1.6.0-SNAPSHOT.jar
[JENKINS] Archiving <https://builds.apache.org/job/carbondata-master-spark-2.1/ws/streaming/pom.xml>
to org.apache.carbondata/carbondata-streaming/1.6.0-SNAPSHOT/carbondata-streaming-1.6.0-SNAPSHOT.pom
[JENKINS] Archiving <https://builds.apache.org/job/carbondata-master-spark-2.1/ws/streaming/target/carbondata-streaming-1.6.0-SNAPSHOT.jar>
to org.apache.carbondata/carbondata-streaming/1.6.0-SNAPSHOT/carbondata-streaming-1.6.0-SNAPSHOT.jar
[JENKINS] Archiving <https://builds.apache.org/job/carbondata-master-spark-2.1/ws/integration/spark-common/pom.xml>
to org.apache.carbondata/carbondata-spark-common/1.6.0-SNAPSHOT/carbondata-spark-common-1.6.0-SNAPSHOT.pom
[JENKINS] Archiving <https://builds.apache.org/job/carbondata-master-spark-2.1/ws/integration/spark-common/target/carbondata-spark-common-1.6.0-SNAPSHOT.jar>
to org.apache.carbondata/carbondata-spark-common/1.6.0-SNAPSHOT/carbondata-spark-common-1.6.0-SNAPSHOT.jar
[JENKINS] Archiving <https://builds.apache.org/job/carbondata-master-spark-2.1/ws/datamap/lucene/pom.xml>
to org.apache.carbondata/carbondata-lucene/1.6.0-SNAPSHOT/carbondata-lucene-1.6.0-SNAPSHOT.pom
[JENKINS] Archiving <https://builds.apache.org/job/carbondata-master-spark-2.1/ws/datamap/lucene/target/carbondata-lucene-1.6.0-SNAPSHOT.jar>
to org.apache.carbondata/carbondata-lucene/1.6.0-SNAPSHOT/carbondata-lucene-1.6.0-SNAPSHOT.jar
[JENKINS] Archiving <https://builds.apache.org/job/carbondata-master-spark-2.1/ws/integration/hive/pom.xml>
to org.apache.carbondata/carbondata-hive/1.6.0-SNAPSHOT/carbondata-hive-1.6.0-SNAPSHOT.pom
[JENKINS] Archiving <https://builds.apache.org/job/carbondata-master-spark-2.1/ws/integration/hive/target/carbondata-hive-1.6.0-SNAPSHOT.jar>
to org.apache.carbondata/carbondata-hive/1.6.0-SNAPSHOT/carbondata-hive-1.6.0-SNAPSHOT.jar
[JENKINS] Archiving <https://builds.apache.org/job/carbondata-master-spark-2.1/ws/examples/spark2/pom.xml>
to org.apache.carbondata/carbondata-examples/1.6.0-SNAPSHOT/carbondata-examples-1.6.0-SNAPSHOT.pom
[Fast Archiver] No prior successful build to compare, so performing full copy of artifacts
[JENKINS] Archiving <https://builds.apache.org/job/carbondata-master-spark-2.1/ws/common/pom.xml>
to org.apache.carbondata/carbondata-common/1.6.0-SNAPSHOT/carbondata-common-1.6.0-SNAPSHOT.pom
[JENKINS] Archiving <https://builds.apache.org/job/carbondata-master-spark-2.1/ws/common/target/carbondata-common-1.6.0-SNAPSHOT.jar>
to org.apache.carbondata/carbondata-common/1.6.0-SNAPSHOT/carbondata-common-1.6.0-SNAPSHOT.jar
[JENKINS] Archiving <https://builds.apache.org/job/carbondata-master-spark-2.1/ws/integration/spark2/pom.xml>
to org.apache.carbondata/carbondata-spark2/1.6.0-SNAPSHOT/carbondata-spark2-1.6.0-SNAPSHOT.pom
[JENKINS] Archiving <https://builds.apache.org/job/carbondata-master-spark-2.1/ws/integration/spark2/target/carbondata-spark2-1.6.0-SNAPSHOT.jar>
to org.apache.carbondata/carbondata-spark2/1.6.0-SNAPSHOT/carbondata-spark2-1.6.0-SNAPSHOT.jar
[JENKINS] Archiving <https://builds.apache.org/job/carbondata-master-spark-2.1/ws/tools/cli/pom.xml>
to org.apache.carbondata/carbondata-cli/1.6.0-SNAPSHOT/carbondata-cli-1.6.0-SNAPSHOT.pom
[JENKINS] Archiving <https://builds.apache.org/job/carbondata-master-spark-2.1/ws/tools/cli/target/carbondata-cli-1.6.0-SNAPSHOT.jar>
to org.apache.carbondata/carbondata-cli/1.6.0-SNAPSHOT/carbondata-cli-1.6.0-SNAPSHOT.jar
[JENKINS] Archiving <https://builds.apache.org/job/carbondata-master-spark-2.1/ws/datamap/bloom/pom.xml>
to org.apache.carbondata/carbondata-bloom/1.6.0-SNAPSHOT/carbondata-bloom-1.6.0-SNAPSHOT.pom
[JENKINS] Archiving <https://builds.apache.org/job/carbondata-master-spark-2.1/ws/datamap/bloom/target/carbondata-bloom-1.6.0-SNAPSHOT.jar>
to org.apache.carbondata/carbondata-bloom/1.6.0-SNAPSHOT/carbondata-bloom-1.6.0-SNAPSHOT.jar
[JENKINS] Archiving <https://builds.apache.org/job/carbondata-master-spark-2.1/ws/assembly/pom.xml>
to org.apache.carbondata/carbondata-assembly/1.6.0-SNAPSHOT/carbondata-assembly-1.6.0-SNAPSHOT.pom
[JENKINS] Archiving <https://builds.apache.org/job/carbondata-master-spark-2.1/ws/pom.xml>
to org.apache.carbondata/carbondata-parent/1.6.0-SNAPSHOT/carbondata-parent-1.6.0-SNAPSHOT.pom
[JENKINS] Archiving <https://builds.apache.org/job/carbondata-master-spark-2.1/ws/core/pom.xml>
to org.apache.carbondata/carbondata-core/1.6.0-SNAPSHOT/carbondata-core-1.6.0-SNAPSHOT.pom
[JENKINS] Archiving <https://builds.apache.org/job/carbondata-master-spark-2.1/ws/core/target/carbondata-core-1.6.0-SNAPSHOT.jar>
to org.apache.carbondata/carbondata-core/1.6.0-SNAPSHOT/carbondata-core-1.6.0-SNAPSHOT.jar
[JENKINS] Archiving <https://builds.apache.org/job/carbondata-master-spark-2.1/ws/hadoop/pom.xml>
to org.apache.carbondata/carbondata-hadoop/1.6.0-SNAPSHOT/carbondata-hadoop-1.6.0-SNAPSHOT.pom
[JENKINS] Archiving <https://builds.apache.org/job/carbondata-master-spark-2.1/ws/hadoop/target/carbondata-hadoop-1.6.0-SNAPSHOT.jar>
to org.apache.carbondata/carbondata-hadoop/1.6.0-SNAPSHOT/carbondata-hadoop-1.6.0-SNAPSHOT.jar
[JENKINS] Archiving <https://builds.apache.org/job/carbondata-master-spark-2.1/ws/integration/spark-datasource/pom.xml>
to org.apache.carbondata/carbondata-spark-datasource/1.6.0-SNAPSHOT/carbondata-spark-datasource-1.6.0-SNAPSHOT.pom
[JENKINS] Archiving <https://builds.apache.org/job/carbondata-master-spark-2.1/ws/integration/spark-datasource/target/carbondata-spark-datasource-1.6.0-SNAPSHOT.jar>
to org.apache.carbondata/carbondata-spark-datasource/1.6.0-SNAPSHOT/carbondata-spark-datasource-1.6.0-SNAPSHOT.jar
[JENKINS] Archiving <https://builds.apache.org/job/carbondata-master-spark-2.1/ws/integration/presto/pom.xml>
to org.apache.carbondata/carbondata-presto/1.6.0-SNAPSHOT/carbondata-presto-1.6.0-SNAPSHOT.pom
[JENKINS] Archiving <https://builds.apache.org/job/carbondata-master-spark-2.1/ws/integration/presto/target/carbondata-presto-1.6.0-SNAPSHOT.zip>
to org.apache.carbondata/carbondata-presto/1.6.0-SNAPSHOT/carbondata-presto-1.6.0-SNAPSHOT.zip
[JENKINS] Archiving <https://builds.apache.org/job/carbondata-master-spark-2.1/ws/integration/presto/target/carbondata-presto-1.6.0-SNAPSHOT.jar>
to org.apache.carbondata/carbondata-presto/1.6.0-SNAPSHOT/carbondata-presto-1.6.0-SNAPSHOT.jar
[Fast Archiver] Compressed 142.21 MB of artifacts by 95.8% relative to #3280
[JENKINS] Archiving <https://builds.apache.org/job/carbondata-master-spark-2.1/ws/integration/spark-common-test/pom.xml>
to org.apache.carbondata/carbondata-spark-common-test/1.6.0-SNAPSHOT/carbondata-spark-common-test-1.6.0-SNAPSHOT.pom
[JENKINS] Archiving <https://builds.apache.org/job/carbondata-master-spark-2.1/ws/integration/spark-common-test/target/carbondata-spark-common-test-1.6.0-SNAPSHOT.jar>
to org.apache.carbondata/carbondata-spark-common-test/1.6.0-SNAPSHOT/carbondata-spark-common-test-1.6.0-SNAPSHOT.jar
[JENKINS] Archiving <https://builds.apache.org/job/carbondata-master-spark-2.1/ws/store/sdk/pom.xml>
to org.apache.carbondata/carbondata-store-sdk/1.6.0-SNAPSHOT/carbondata-store-sdk-1.6.0-SNAPSHOT.pom
[JENKINS] Archiving <https://builds.apache.org/job/carbondata-master-spark-2.1/ws/store/sdk/target/carbondata-store-sdk-1.6.0-SNAPSHOT.jar>
to org.apache.carbondata/carbondata-store-sdk/1.6.0-SNAPSHOT/carbondata-store-sdk-1.6.0-SNAPSHOT.jar
Sending e-mails to: commits@carbondata.apache.org
Sending e-mails to: commits@carbondata.apache.org xubo29@huawei.com tomanishgupta18@gmail.com
channel stopped
Not sending mail to unregistered user jacky.likun@qq.com

Mime
View raw message