carbondata-commits mailing list archives

Site index · List index
Message view « Date » · « Thread »
Top « Date » · « Thread »
From Apache Jenkins Server <jenk...@builds.apache.org>
Subject Build failed in Jenkins: carbondata-master-spark-2.1 #3420
Date Tue, 12 Mar 2019 08:55:42 GMT
See <https://builds.apache.org/job/carbondata-master-spark-2.1/3420/display/redirect>

------------------------------------------
[...truncated 12.53 MB...]
INFO: Randomly choose index file location: /tmp/12074939436671802_attempt_638652e4-4dfb-43f5-836d-8d7a4c617a0f_0000_m_239750867_1876933668/Fact/Part0/Segment_null/12074939436660084
Mar 12, 2019 8:54:49 AM org.apache.carbondata.core.util.CarbonUtil copyCarbonDataFileToCarbonStorePath
INFO: Copying /tmp/12074939436671802_attempt_638652e4-4dfb-43f5-836d-8d7a4c617a0f_0000_m_239750867_1876933668/Fact/Part0/Segment_null/12074939436660084/12074939436660084_batchno0-0-null-12074939431528502.carbonindex
to <https://builds.apache.org/job/carbondata-master-spark-2.1/ws/integration/presto/target/store/sdk_output/files,>
operation id 1552380889590
Mar 12, 2019 8:54:49 AM org.apache.carbondata.core.util.CarbonUtil copyCarbonDataFileToCarbonStorePath
INFO: Total copy time is 1 ms, operation id 1552380889590
Mar 12, 2019 8:54:49 AM org.apache.carbondata.processing.loading.AbstractDataLoadProcessorStep
close
INFO: Total rows processed in step Data Writer: 3
Mar 12, 2019 8:54:49 AM org.apache.carbondata.processing.loading.AbstractDataLoadProcessorStep
close
INFO: Total rows processed in step Sort Processor: 3
Mar 12, 2019 8:54:49 AM org.apache.carbondata.processing.loading.AbstractDataLoadProcessorStep
close
INFO: Total rows processed in step Data Converter: 3
Mar 12, 2019 8:54:49 AM org.apache.carbondata.processing.loading.AbstractDataLoadProcessorStep
close
INFO: Total rows processed in step Input Processor: 3
Mar 12, 2019 8:54:49 AM org.apache.carbondata.hadoop.api.CarbonTableOutputFormat$CarbonRecordWriter
close
INFO: Closed writer task attempt_638652e4-4dfb-43f5-836d-8d7a4c617a0f_0000_m_239750867_1876933668
Mar 12, 2019 8:54:49 AM org.apache.carbondata.presto.server.PrestoServer$$anonfun$3 apply
INFO: ***** executing the query ***** 
 select max(length(address)) from files
Mar 12, 2019 8:54:49 AM org.apache.carbondata.processing.loading.TableProcessingOperations$2
call
INFO: Deleted the local store location: /tmp/12074939436671802_attempt_638652e4-4dfb-43f5-836d-8d7a4c617a0f_0000_m_239750867_1876933668
: Time taken: 1
Mar 12, 2019 8:54:49 AM org.apache.carbondata.hadoop.api.CarbonInputFormat getPrunedBlocklets
INFO: Started block pruning ...
Mar 12, 2019 8:54:49 AM org.apache.carbondata.hadoop.api.CarbonInputFormat getPrunedBlocklets
INFO: Finished block pruning ...
Mar 12, 2019 8:54:49 AM org.apache.carbondata.presto.impl.CarbonTableReader getInputSplits2
SEVERE: Size fo MultiblockList   1
Mar 12, 2019 8:54:49 AM org.apache.carbondata.core.scan.model.QueryModelBuilder projectColumns
INFO: Projection Columns: [address]
Mar 12, 2019 8:54:49 AM org.apache.carbondata.core.scan.executor.impl.AbstractQueryExecutor
initQuery
INFO: Query will be executed on table: files
Mar 12, 2019 8:54:49 AM org.apache.carbondata.core.scan.collector.ResultCollectorFactory getScannedResultCollector
INFO: Vector based dictionary collector is used to scan and collect the data
Mar 12, 2019 8:54:49 AM org.apache.carbondata.core.scan.collector.impl.DictionaryBasedVectorResultCollector
<init>
INFO: Direct pagewise vector fill collector is used to scan and collect the data
Mar 12, 2019 8:54:49 AM org.apache.carbondata.core.memory.UnsafeMemoryManager freeMemoryAll
INFO: Total offheap working memory used after task 72cbb35e-f9ff-4a13-902a-51c65baee5d0 is
0. Current running tasks are e06306d5-a098-4eab-a387-6d7d586c9aa6, 330a01dc-a621-4b24-8a0d-15c9fdf19123,
dd6c51a1-7acd-4f30-8bf1-f447ab273efd, 1c974d22-8cfe-435f-9615-de7901adbca9, d0f87211-9b75-47b6-8d3b-c414d9d5f3b0,
088795ea-1660-4111-8974-1d3619cb207e, bccd0188-1b6f-4600-89b1-118cf29289ed, b858fd34-5fbf-43c7-907d-2ac4366d05a0,
4e69d715-8993-4853-93e6-3a5b17dcb0bf, fa1f0cc0-3490-4e5b-be03-9232edc7f04b
- Test for query on Varchar columns
Mar 12, 2019 8:54:49 AM io.airlift.log.Logger info
INFO: Life cycle stopping...
Mar 12, 2019 8:54:49 AM io.airlift.log.Logger info
INFO: TIMELINE: Query 20190312_085449_00039_bdqbz :: Transaction:[e332a519-af96-41d9-9fa8-389eaee687cd]
:: elapsed 82ms :: planning 36ms :: scheduling 23ms :: running 16ms :: finishing 7ms :: begin
2019-03-12T08:54:49.601Z :: end 2019-03-12T08:54:49.683Z
Mar 12, 2019 8:54:49 AM org.eclipse.jetty.server.AbstractConnector doStop
INFO: Stopped http@1236926e{HTTP/1.1,[http/1.1, h2c]}{127.0.0.1:8086}
Mar 12, 2019 8:54:50 AM org.eclipse.jetty.server.handler.ContextHandler doStop
INFO: Stopped o.e.j.s.ServletContextHandler@4159c03b{/,null,UNAVAILABLE,@http}
Mar 12, 2019 8:54:50 AM org.eclipse.jetty.util.thread.QueuedThreadPool doStop
WARNING: QueuedThreadPool[http-worker]@1ae042f3{STOPPING,2<=24<=200,i=2,q=19}[org.eclipse.jetty.util.thread.TryExecutor$$Lambda$108/62309924@7a021f49]
Couldn't stop Thread[http-worker-1812,5,main]
Mar 12, 2019 8:54:50 AM org.eclipse.jetty.util.thread.QueuedThreadPool doStop
WARNING: QueuedThreadPool[http-worker]@1ae042f3{STOPPING,2<=24<=200,i=0,q=18}[org.eclipse.jetty.util.thread.TryExecutor$$Lambda$108/62309924@7a021f49]
Couldn't stop Thread[http-worker-1694,5,]
Mar 12, 2019 8:54:50 AM io.airlift.log.Logger info
INFO: Life cycle stopped.
Mar 12, 2019 8:54:50 AM io.airlift.log.Logger info
INFO: Life cycle stopping...
Mar 12, 2019 8:54:50 AM org.eclipse.jetty.server.AbstractConnector doStop
INFO: Stopped http@5b3915b{HTTP/1.1,[http/1.1, h2c]}{127.0.0.1:36229}
Mar 12, 2019 8:54:50 AM org.eclipse.jetty.server.handler.ContextHandler doStop
INFO: Stopped o.e.j.s.ServletContextHandler@18be5bce{/,null,UNAVAILABLE,@http}
Mar 12, 2019 8:54:50 AM org.eclipse.jetty.util.thread.QueuedThreadPool doStop
WARNING: QueuedThreadPool[http-worker]@7bfb5147{STOPPING,2<=24<=200,i=6,q=16}[org.eclipse.jetty.util.thread.TryExecutor$$Lambda$108/62309924@7a021f49]
Couldn't stop Thread[http-worker-1818,5,main]
Mar 12, 2019 8:54:50 AM org.eclipse.jetty.util.thread.QueuedThreadPool doStop
WARNING: QueuedThreadPool[http-worker]@7bfb5147{STOPPING,2<=24<=200,i=1,q=13}[org.eclipse.jetty.util.thread.TryExecutor$$Lambda$108/62309924@7a021f49]
Couldn't stop Thread[http-worker-1816,5,]
Mar 12, 2019 8:54:50 AM org.eclipse.jetty.util.thread.QueuedThreadPool doStop
WARNING: QueuedThreadPool[http-worker]@7bfb5147{STOPPING,2<=24<=200,i=0,q=13}[org.eclipse.jetty.util.thread.TryExecutor$$Lambda$108/62309924@7a021f49]
Couldn't stop Thread[http-worker-1397,5,]
Mar 12, 2019 8:54:50 AM io.airlift.log.Logger info
INFO: Life cycle stopped.
Mar 12, 2019 8:54:50 AM io.airlift.log.Logger info
INFO: Life cycle stopping...
Mar 12, 2019 8:54:50 AM org.eclipse.jetty.server.AbstractConnector doStop
INFO: Stopped http@9edb372{HTTP/1.1,[http/1.1, h2c]}{127.0.0.1:42079}
Mar 12, 2019 8:54:50 AM org.eclipse.jetty.server.handler.ContextHandler doStop
INFO: Stopped o.e.j.s.ServletContextHandler@7da298aa{/,null,UNAVAILABLE,@http}
Mar 12, 2019 8:54:50 AM org.eclipse.jetty.util.thread.QueuedThreadPool doStop
WARNING: QueuedThreadPool[http-worker]@a53f879{STOPPING,2<=24<=200,i=5,q=16}[org.eclipse.jetty.util.thread.TryExecutor$$Lambda$108/62309924@7a021f49]
Couldn't stop Thread[http-worker-1335,5,main]
Mar 12, 2019 8:54:50 AM org.eclipse.jetty.util.thread.QueuedThreadPool doStop
WARNING: QueuedThreadPool[http-worker]@a53f879{STOPPING,2<=24<=200,i=3,q=15}[org.eclipse.jetty.util.thread.TryExecutor$$Lambda$108/62309924@7a021f49]
Couldn't stop Thread[http-worker-1324,5,main]
Mar 12, 2019 8:54:50 AM org.eclipse.jetty.util.thread.QueuedThreadPool doStop
WARNING: QueuedThreadPool[http-worker]@a53f879{STOPPING,2<=24<=200,i=2,q=14}[org.eclipse.jetty.util.thread.TryExecutor$$Lambda$108/62309924@7a021f49]
Couldn't stop Thread[http-worker-1820,5,]
Mar 12, 2019 8:54:50 AM org.eclipse.jetty.util.thread.QueuedThreadPool doStop
WARNING: QueuedThreadPool[http-worker]@a53f879{STOPPING,2<=24<=200,i=0,q=13}[org.eclipse.jetty.util.thread.TryExecutor$$Lambda$108/62309924@7a021f49]
Couldn't stop Thread[http-worker-1821,5,]
Mar 12, 2019 8:54:50 AM io.airlift.log.Logger info
INFO: Life cycle stopped.
Mar 12, 2019 8:54:50 AM io.airlift.log.Logger info
INFO: Life cycle stopping...
Mar 12, 2019 8:54:50 AM org.eclipse.jetty.server.AbstractConnector doStop
INFO: Stopped http@6ef0a044{HTTP/1.1,[http/1.1, h2c]}{127.0.0.1:40073}
Mar 12, 2019 8:54:50 AM org.eclipse.jetty.server.handler.ContextHandler doStop
INFO: Stopped o.e.j.s.ServletContextHandler@7f930614{/,null,UNAVAILABLE,@http}
Mar 12, 2019 8:54:50 AM org.eclipse.jetty.util.thread.QueuedThreadPool doStop
WARNING: QueuedThreadPool[http-worker]@93231b2{STOPPING,2<=21<=200,i=9,q=20}[org.eclipse.jetty.util.thread.TryExecutor$$Lambda$108/62309924@7a021f49]
Couldn't stop Thread[http-worker-1271,5,]
Mar 12, 2019 8:54:50 AM org.eclipse.jetty.util.thread.QueuedThreadPool doStop
WARNING: QueuedThreadPool[http-worker]@93231b2{STOPPING,2<=21<=200,i=0,q=18}[org.eclipse.jetty.util.thread.TryExecutor$$Lambda$108/62309924@7a021f49]
Couldn't stop Thread[http-worker-1270,5,]
Mar 12, 2019 8:54:50 AM org.eclipse.jetty.util.thread.QueuedThreadPool doStop
WARNING: QueuedThreadPool[http-worker]@93231b2{STOPPING,2<=21<=200,i=0,q=18}[org.eclipse.jetty.util.thread.TryExecutor$$Lambda$108/62309924@7a021f49]
Couldn't stop Thread[http-worker-1272,5,]
Mar 12, 2019 8:54:50 AM io.airlift.log.Logger info
INFO: Life cycle stopped.
Mar 12, 2019 8:54:50 AM io.airlift.log.Logger info
INFO: Life cycle stopping...
Mar 12, 2019 8:54:50 AM org.eclipse.jetty.server.AbstractConnector doStop
INFO: Stopped http@22a7d2f2{HTTP/1.1,[http/1.1, h2c]}{127.0.0.1:34407}
Mar 12, 2019 8:54:50 AM org.eclipse.jetty.server.handler.ContextHandler doStop
INFO: Stopped o.e.j.s.ServletContextHandler@1565c047{/,null,UNAVAILABLE,@http}
Mar 12, 2019 8:54:50 AM org.eclipse.jetty.util.thread.QueuedThreadPool doStop
WARNING: QueuedThreadPool[http-worker]@5a342baf{STOPPING,2<=21<=200,i=8,q=18}[org.eclipse.jetty.util.thread.TryExecutor$$Lambda$108/62309924@7a021f49]
Couldn't stop Thread[http-worker-1211,5,main]
Mar 12, 2019 8:54:50 AM org.eclipse.jetty.util.thread.QueuedThreadPool doStop
WARNING: QueuedThreadPool[http-worker]@5a342baf{STOPPING,2<=21<=200,i=0,q=17}[org.eclipse.jetty.util.thread.TryExecutor$$Lambda$108/62309924@7a021f49]
Couldn't stop Thread[http-worker-1826,5,]
Mar 12, 2019 8:54:50 AM io.airlift.log.Logger info
INFO: Life cycle stopped.
Mar 12, 2019 8:54:50 AM org.apache.carbondata.presto.server.PrestoServer stopServer
INFO: ***** Stopping The Server *****
Run completed in 42 seconds, 550 milliseconds.
Total number of tests run: 56
Suites: completed 3, aborted 1
Tests: succeeded 56, failed 0, canceled 0, ignored 0, pending 0
*** 1 SUITE ABORTED ***
[JENKINS] Recording test results
[INFO] ------------------------------------------------------------------------
[INFO] Reactor Summary:
[INFO] 
[INFO] Apache CarbonData :: Parent ........................ SUCCESS [ 12.809 s]
[INFO] Apache CarbonData :: Common ........................ SUCCESS [ 16.160 s]
[INFO] Apache CarbonData :: Core .......................... SUCCESS [03:09 min]
[INFO] Apache CarbonData :: Processing .................... SUCCESS [ 32.111 s]
[INFO] Apache CarbonData :: Hadoop ........................ SUCCESS [ 24.894 s]
[INFO] Apache CarbonData :: Streaming ..................... SUCCESS [ 29.629 s]
[INFO] Apache CarbonData :: Store SDK ..................... SUCCESS [ 44.008 s]
[INFO] Apache CarbonData :: Spark Datasource .............. SUCCESS [02:49 min]
[INFO] Apache CarbonData :: Spark Common .................. SUCCESS [01:29 min]
[INFO] Apache CarbonData :: CLI ........................... SUCCESS [02:50 min]
[INFO] Apache CarbonData :: Lucene Index DataMap .......... SUCCESS [ 18.208 s]
[INFO] Apache CarbonData :: Bloom Index DataMap ........... SUCCESS [ 15.807 s]
[INFO] Apache CarbonData :: Spark2 ........................ SUCCESS [18:36 min]
[INFO] Apache CarbonData :: Spark Common Test ............. SUCCESS [47:58 min]
[INFO] Apache CarbonData :: DataMap Examples .............. SUCCESS [ 13.765 s]
[INFO] Apache CarbonData :: Assembly ...................... SUCCESS [ 17.721 s]
[INFO] Apache CarbonData :: Hive .......................... SUCCESS [ 38.800 s]
[INFO] Apache CarbonData :: presto ........................ FAILURE [01:33 min]
[INFO] Apache CarbonData :: Examples ...................... SKIPPED
[INFO] ------------------------------------------------------------------------
[INFO] BUILD FAILURE
[INFO] ------------------------------------------------------------------------
[INFO] Total time: 01:24 h
[INFO] Finished at: 2019-03-12T08:55:11+00:00
[INFO] Final Memory: 190M/2065M
[INFO] ------------------------------------------------------------------------
Waiting for Jenkins to finish collecting data
[ERROR] Failed to execute goal org.scalatest:scalatest-maven-plugin:1.0:test (test) on project
carbondata-presto: There are test failures -> [Help 1]
org.apache.maven.lifecycle.LifecycleExecutionException: Failed to execute goal org.scalatest:scalatest-maven-plugin:1.0:test
(test) on project carbondata-presto: There are test failures
	at org.apache.maven.lifecycle.internal.MojoExecutor.execute(MojoExecutor.java:212)
	at org.apache.maven.lifecycle.internal.MojoExecutor.execute(MojoExecutor.java:153)
	at org.apache.maven.lifecycle.internal.MojoExecutor.execute(MojoExecutor.java:145)
	at org.apache.maven.lifecycle.internal.LifecycleModuleBuilder.buildProject(LifecycleModuleBuilder.java:116)
	at org.apache.maven.lifecycle.internal.LifecycleModuleBuilder.buildProject(LifecycleModuleBuilder.java:80)
	at org.apache.maven.lifecycle.internal.builder.singlethreaded.SingleThreadedBuilder.build(SingleThreadedBuilder.java:51)
	at org.apache.maven.lifecycle.internal.LifecycleStarter.execute(LifecycleStarter.java:128)
	at org.apache.maven.DefaultMaven.doExecute(DefaultMaven.java:307)
	at org.apache.maven.DefaultMaven.doExecute(DefaultMaven.java:193)
	at org.apache.maven.DefaultMaven.execute(DefaultMaven.java:106)
	at org.jvnet.hudson.maven3.launcher.Maven33Launcher.main(Maven33Launcher.java:129)
	at sun.reflect.NativeMethodAccessorImpl.invoke0(Native Method)
	at sun.reflect.NativeMethodAccessorImpl.invoke(NativeMethodAccessorImpl.java:62)
	at sun.reflect.DelegatingMethodAccessorImpl.invoke(DelegatingMethodAccessorImpl.java:43)
	at java.lang.reflect.Method.invoke(Method.java:498)
	at org.codehaus.plexus.classworlds.launcher.Launcher.launchStandard(Launcher.java:330)
	at org.codehaus.plexus.classworlds.launcher.Launcher.launch(Launcher.java:238)
	at jenkins.maven3.agent.Maven33Main.launch(Maven33Main.java:176)
	at sun.reflect.NativeMethodAccessorImpl.invoke0(Native Method)
	at sun.reflect.NativeMethodAccessorImpl.invoke(NativeMethodAccessorImpl.java:62)
	at sun.reflect.DelegatingMethodAccessorImpl.invoke(DelegatingMethodAccessorImpl.java:43)
	at java.lang.reflect.Method.invoke(Method.java:498)
	at hudson.maven.Maven3Builder.call(Maven3Builder.java:139)
	at hudson.maven.Maven3Builder.call(Maven3Builder.java:70)
	at hudson.remoting.UserRequest.perform(UserRequest.java:212)
	at hudson.remoting.UserRequest.perform(UserRequest.java:54)
	at hudson.remoting.Request$2.run(Request.java:369)
	at hudson.remoting.InterceptingExecutorService$1.call(InterceptingExecutorService.java:72)
	at java.util.concurrent.FutureTask.run(FutureTask.java:266)
	at java.util.concurrent.ThreadPoolExecutor.runWorker(ThreadPoolExecutor.java:1149)
	at java.util.concurrent.ThreadPoolExecutor$Worker.run(ThreadPoolExecutor.java:624)
	at java.lang.Thread.run(Thread.java:748)
Caused by: org.apache.maven.plugin.MojoFailureException: There are test failures
	at org.scalatest.tools.maven.TestMojo.execute(TestMojo.java:107)
	at org.apache.maven.plugin.DefaultBuildPluginManager.executeMojo(DefaultBuildPluginManager.java:134)
	at org.apache.maven.lifecycle.internal.MojoExecutor.execute(MojoExecutor.java:207)
	... 31 more
[ERROR] 
[ERROR] Re-run Maven using the -X switch to enable full debug logging.
[ERROR] 
[ERROR] For more information about the errors and possible solutions, please read the following
articles:
[ERROR] [Help 1] http://cwiki.apache.org/confluence/display/MAVEN/MojoFailureException
[ERROR] 
[ERROR] After correcting the problems, you can resume the build with the command
[ERROR]   mvn <goals> -rf :carbondata-presto
[JENKINS] Archiving <https://builds.apache.org/job/carbondata-master-spark-2.1/ws/processing/pom.xml>
to org.apache.carbondata/carbondata-processing/1.6.0-SNAPSHOT/carbondata-processing-1.6.0-SNAPSHOT.pom
[JENKINS] Archiving <https://builds.apache.org/job/carbondata-master-spark-2.1/ws/processing/target/carbondata-processing-1.6.0-SNAPSHOT.jar>
to org.apache.carbondata/carbondata-processing/1.6.0-SNAPSHOT/carbondata-processing-1.6.0-SNAPSHOT.jar
[Fast Archiver] No artifacts from carbondata-master-spark-2.1 » Apache CarbonData :: Processing
#3419 to compare, so performing full copy of artifacts
[JENKINS] Archiving <https://builds.apache.org/job/carbondata-master-spark-2.1/ws/datamap/examples/pom.xml>
to org.apache.carbondata/carbondata-datamap-examples/1.6.0-SNAPSHOT/carbondata-datamap-examples-1.6.0-SNAPSHOT.pom
[JENKINS] Archiving <https://builds.apache.org/job/carbondata-master-spark-2.1/ws/datamap/examples/target/carbondata-datamap-examples-1.6.0-SNAPSHOT.jar>
to org.apache.carbondata/carbondata-datamap-examples/1.6.0-SNAPSHOT/carbondata-datamap-examples-1.6.0-SNAPSHOT.jar
[Fast Archiver] No artifacts from carbondata-master-spark-2.1 » Apache CarbonData :: DataMap
Examples #3419 to compare, so performing full copy of artifacts
[JENKINS] Archiving <https://builds.apache.org/job/carbondata-master-spark-2.1/ws/streaming/pom.xml>
to org.apache.carbondata/carbondata-streaming/1.6.0-SNAPSHOT/carbondata-streaming-1.6.0-SNAPSHOT.pom
[JENKINS] Archiving <https://builds.apache.org/job/carbondata-master-spark-2.1/ws/streaming/target/carbondata-streaming-1.6.0-SNAPSHOT.jar>
to org.apache.carbondata/carbondata-streaming/1.6.0-SNAPSHOT/carbondata-streaming-1.6.0-SNAPSHOT.jar
[Fast Archiver] No artifacts from carbondata-master-spark-2.1 » Apache CarbonData :: Streaming
#3419 to compare, so performing full copy of artifacts
[JENKINS] Archiving <https://builds.apache.org/job/carbondata-master-spark-2.1/ws/integration/spark-common/pom.xml>
to org.apache.carbondata/carbondata-spark-common/1.6.0-SNAPSHOT/carbondata-spark-common-1.6.0-SNAPSHOT.pom
[JENKINS] Archiving <https://builds.apache.org/job/carbondata-master-spark-2.1/ws/integration/spark-common/target/carbondata-spark-common-1.6.0-SNAPSHOT.jar>
to org.apache.carbondata/carbondata-spark-common/1.6.0-SNAPSHOT/carbondata-spark-common-1.6.0-SNAPSHOT.jar
[Fast Archiver] No artifacts from carbondata-master-spark-2.1 » Apache CarbonData :: Spark
Common #3419 to compare, so performing full copy of artifacts
[JENKINS] Archiving <https://builds.apache.org/job/carbondata-master-spark-2.1/ws/datamap/lucene/pom.xml>
to org.apache.carbondata/carbondata-lucene/1.6.0-SNAPSHOT/carbondata-lucene-1.6.0-SNAPSHOT.pom
[JENKINS] Archiving <https://builds.apache.org/job/carbondata-master-spark-2.1/ws/datamap/lucene/target/carbondata-lucene-1.6.0-SNAPSHOT.jar>
to org.apache.carbondata/carbondata-lucene/1.6.0-SNAPSHOT/carbondata-lucene-1.6.0-SNAPSHOT.jar
[Fast Archiver] No artifacts from carbondata-master-spark-2.1 » Apache CarbonData :: Lucene
Index DataMap #3419 to compare, so performing full copy of artifacts
[JENKINS] Archiving <https://builds.apache.org/job/carbondata-master-spark-2.1/ws/integration/hive/pom.xml>
to org.apache.carbondata/carbondata-hive/1.6.0-SNAPSHOT/carbondata-hive-1.6.0-SNAPSHOT.pom
[JENKINS] Archiving <https://builds.apache.org/job/carbondata-master-spark-2.1/ws/integration/hive/target/carbondata-hive-1.6.0-SNAPSHOT.jar>
to org.apache.carbondata/carbondata-hive/1.6.0-SNAPSHOT/carbondata-hive-1.6.0-SNAPSHOT.jar
[Fast Archiver] No artifacts from carbondata-master-spark-2.1 » Apache CarbonData :: Hive
#3419 to compare, so performing full copy of artifacts
[JENKINS] Archiving <https://builds.apache.org/job/carbondata-master-spark-2.1/ws/examples/spark2/pom.xml>
to org.apache.carbondata/carbondata-examples/1.6.0-SNAPSHOT/carbondata-examples-1.6.0-SNAPSHOT.pom
[JENKINS] Archiving <https://builds.apache.org/job/carbondata-master-spark-2.1/ws/common/pom.xml>
to org.apache.carbondata/carbondata-common/1.6.0-SNAPSHOT/carbondata-common-1.6.0-SNAPSHOT.pom
[JENKINS] Archiving <https://builds.apache.org/job/carbondata-master-spark-2.1/ws/common/target/carbondata-common-1.6.0-SNAPSHOT.jar>
to org.apache.carbondata/carbondata-common/1.6.0-SNAPSHOT/carbondata-common-1.6.0-SNAPSHOT.jar
[Fast Archiver] No artifacts from carbondata-master-spark-2.1 » Apache CarbonData :: Common
#3419 to compare, so performing full copy of artifacts
[JENKINS] Archiving <https://builds.apache.org/job/carbondata-master-spark-2.1/ws/integration/spark2/pom.xml>
to org.apache.carbondata/carbondata-spark2/1.6.0-SNAPSHOT/carbondata-spark2-1.6.0-SNAPSHOT.pom
[JENKINS] Archiving <https://builds.apache.org/job/carbondata-master-spark-2.1/ws/integration/spark2/target/carbondata-spark2-1.6.0-SNAPSHOT.jar>
to org.apache.carbondata/carbondata-spark2/1.6.0-SNAPSHOT/carbondata-spark2-1.6.0-SNAPSHOT.jar
[Fast Archiver] No artifacts from carbondata-master-spark-2.1 » Apache CarbonData :: Spark2
#3419 to compare, so performing full copy of artifacts
[JENKINS] Archiving <https://builds.apache.org/job/carbondata-master-spark-2.1/ws/tools/cli/pom.xml>
to org.apache.carbondata/carbondata-cli/1.6.0-SNAPSHOT/carbondata-cli-1.6.0-SNAPSHOT.pom
[JENKINS] Archiving <https://builds.apache.org/job/carbondata-master-spark-2.1/ws/tools/cli/target/carbondata-cli-1.6.0-SNAPSHOT.jar>
to org.apache.carbondata/carbondata-cli/1.6.0-SNAPSHOT/carbondata-cli-1.6.0-SNAPSHOT.jar
[Fast Archiver] No artifacts from carbondata-master-spark-2.1 » Apache CarbonData :: CLI
#3419 to compare, so performing full copy of artifacts
[JENKINS] Archiving <https://builds.apache.org/job/carbondata-master-spark-2.1/ws/datamap/bloom/pom.xml>
to org.apache.carbondata/carbondata-bloom/1.6.0-SNAPSHOT/carbondata-bloom-1.6.0-SNAPSHOT.pom
[JENKINS] Archiving <https://builds.apache.org/job/carbondata-master-spark-2.1/ws/datamap/bloom/target/carbondata-bloom-1.6.0-SNAPSHOT.jar>
to org.apache.carbondata/carbondata-bloom/1.6.0-SNAPSHOT/carbondata-bloom-1.6.0-SNAPSHOT.jar
[Fast Archiver] No artifacts from carbondata-master-spark-2.1 » Apache CarbonData :: Bloom
Index DataMap #3419 to compare, so performing full copy of artifacts
[JENKINS] Archiving <https://builds.apache.org/job/carbondata-master-spark-2.1/ws/assembly/pom.xml>
to org.apache.carbondata/carbondata-assembly/1.6.0-SNAPSHOT/carbondata-assembly-1.6.0-SNAPSHOT.pom
[Fast Archiver] No artifacts from carbondata-master-spark-2.1 » Apache CarbonData :: Assembly
#3419 to compare, so performing full copy of artifacts
[JENKINS] Archiving <https://builds.apache.org/job/carbondata-master-spark-2.1/ws/pom.xml>
to org.apache.carbondata/carbondata-parent/1.6.0-SNAPSHOT/carbondata-parent-1.6.0-SNAPSHOT.pom
[Fast Archiver] No artifacts from carbondata-master-spark-2.1 » Apache CarbonData :: Parent
#3419 to compare, so performing full copy of artifacts
[JENKINS] Archiving <https://builds.apache.org/job/carbondata-master-spark-2.1/ws/core/pom.xml>
to org.apache.carbondata/carbondata-core/1.6.0-SNAPSHOT/carbondata-core-1.6.0-SNAPSHOT.pom
[JENKINS] Archiving <https://builds.apache.org/job/carbondata-master-spark-2.1/ws/core/target/carbondata-core-1.6.0-SNAPSHOT.jar>
to org.apache.carbondata/carbondata-core/1.6.0-SNAPSHOT/carbondata-core-1.6.0-SNAPSHOT.jar
[Fast Archiver] No artifacts from carbondata-master-spark-2.1 » Apache CarbonData :: Core
#3419 to compare, so performing full copy of artifacts
[JENKINS] Archiving <https://builds.apache.org/job/carbondata-master-spark-2.1/ws/hadoop/pom.xml>
to org.apache.carbondata/carbondata-hadoop/1.6.0-SNAPSHOT/carbondata-hadoop-1.6.0-SNAPSHOT.pom
[JENKINS] Archiving <https://builds.apache.org/job/carbondata-master-spark-2.1/ws/hadoop/target/carbondata-hadoop-1.6.0-SNAPSHOT.jar>
to org.apache.carbondata/carbondata-hadoop/1.6.0-SNAPSHOT/carbondata-hadoop-1.6.0-SNAPSHOT.jar
[Fast Archiver] No artifacts from carbondata-master-spark-2.1 » Apache CarbonData :: Hadoop
#3419 to compare, so performing full copy of artifacts
[JENKINS] Archiving <https://builds.apache.org/job/carbondata-master-spark-2.1/ws/integration/spark-datasource/pom.xml>
to org.apache.carbondata/carbondata-spark-datasource/1.6.0-SNAPSHOT/carbondata-spark-datasource-1.6.0-SNAPSHOT.pom
[JENKINS] Archiving <https://builds.apache.org/job/carbondata-master-spark-2.1/ws/integration/spark-datasource/target/carbondata-spark-datasource-1.6.0-SNAPSHOT.jar>
to org.apache.carbondata/carbondata-spark-datasource/1.6.0-SNAPSHOT/carbondata-spark-datasource-1.6.0-SNAPSHOT.jar
[Fast Archiver] No artifacts from carbondata-master-spark-2.1 » Apache CarbonData :: Spark
Datasource #3419 to compare, so performing full copy of artifacts
[JENKINS] Archiving <https://builds.apache.org/job/carbondata-master-spark-2.1/ws/integration/presto/pom.xml>
to org.apache.carbondata/carbondata-presto/1.6.0-SNAPSHOT/carbondata-presto-1.6.0-SNAPSHOT.pom
[Fast Archiver] No artifacts from carbondata-master-spark-2.1 » Apache CarbonData :: presto
#3419 to compare, so performing full copy of artifacts
[JENKINS] Archiving <https://builds.apache.org/job/carbondata-master-spark-2.1/ws/integration/spark-common-test/pom.xml>
to org.apache.carbondata/carbondata-spark-common-test/1.6.0-SNAPSHOT/carbondata-spark-common-test-1.6.0-SNAPSHOT.pom
[JENKINS] Archiving <https://builds.apache.org/job/carbondata-master-spark-2.1/ws/integration/spark-common-test/target/carbondata-spark-common-test-1.6.0-SNAPSHOT.jar>
to org.apache.carbondata/carbondata-spark-common-test/1.6.0-SNAPSHOT/carbondata-spark-common-test-1.6.0-SNAPSHOT.jar
[Fast Archiver] No artifacts from carbondata-master-spark-2.1 » Apache CarbonData :: Spark
Common Test #3419 to compare, so performing full copy of artifacts
[JENKINS] Archiving <https://builds.apache.org/job/carbondata-master-spark-2.1/ws/store/sdk/pom.xml>
to org.apache.carbondata/carbondata-store-sdk/1.6.0-SNAPSHOT/carbondata-store-sdk-1.6.0-SNAPSHOT.pom
[JENKINS] Archiving <https://builds.apache.org/job/carbondata-master-spark-2.1/ws/store/sdk/target/carbondata-store-sdk-1.6.0-SNAPSHOT.jar>
to org.apache.carbondata/carbondata-store-sdk/1.6.0-SNAPSHOT/carbondata-store-sdk-1.6.0-SNAPSHOT.jar
[Fast Archiver] No artifacts from carbondata-master-spark-2.1 » Apache CarbonData :: Store
SDK #3419 to compare, so performing full copy of artifacts
Sending e-mails to: commits@carbondata.apache.org
Sending e-mails to: commits@carbondata.apache.org
Sending e-mails to: commits@carbondata.apache.org
channel stopped
Not sending mail to unregistered user kunalkapoor642@gmail.com

Mime
View raw message