carbondata-commits mailing list archives

Site index · List index
Message view « Date » · « Thread »
Top « Date » · « Thread »
From Apache Jenkins Server <jenk...@builds.apache.org>
Subject Build failed in Jenkins: carbondata-master-spark-2.1 #3528
Date Fri, 17 May 2019 08:20:45 GMT
See <https://builds.apache.org/job/carbondata-master-spark-2.1/3528/display/redirect>

------------------------------------------
[...truncated 2.95 MB...]
	at org.scalatest.tools.Runner$.doRunRunRunDaDoRunRun(Runner.scala:2557)
	at org.scalatest.tools.Runner$$anonfun$runOptionallyWithPassFailReporter$2.apply(Runner.scala:1044)
	at org.scalatest.tools.Runner$$anonfun$runOptionallyWithPassFailReporter$2.apply(Runner.scala:1043)
	at org.scalatest.tools.Runner$.withClassLoaderAndDispatchReporter(Runner.scala:2722)
	at org.scalatest.tools.Runner$.runOptionallyWithPassFailReporter(Runner.scala:1043)
	at org.scalatest.tools.Runner$.main(Runner.scala:860)
	at org.scalatest.tools.Runner.main(Runner.scala)

2) Error injecting constructor, java.io.UncheckedIOException: java.net.BindException:
Address already in use
  at io.airlift.http.server.HttpServerInfo.<init>(HttpServerInfo.java:46)
  at io.airlift.http.server.testing.TestingHttpServerModule.configure(TestingHttpServerModule.java:63)
  while locating io.airlift.http.server.HttpServerInfo
    for the 1st parameter of io.airlift.http.server.LocalAnnouncementHttpServerInfo.<init>(LocalAnnouncementHttpServerInfo.java:31)
  while locating io.airlift.http.server.LocalAnnouncementHttpServerInfo
  while locating io.airlift.discovery.client.AnnouncementHttpServerInfo
    for the 1st parameter of io.airlift.discovery.client.DiscoveryBinder$HttpAnnouncementProvider.setAnnouncementHttpServerInfo(DiscoveryBinder.java:122)
  at io.airlift.discovery.client.DiscoveryBinder.bindServiceAnnouncement(DiscoveryBinder.java:79)
(via modules: com.facebook.presto.server.ServerMainModule -> com.facebook.presto.server.CoordinatorModule)
Caused by: java.io.UncheckedIOException: java.net.BindException: Address already in use
	at io.airlift.http.server.HttpServerInfo.createChannel(HttpServerInfo.java:162)
	at io.airlift.http.server.HttpServerInfo.<init>(HttpServerInfo.java:48)
	at io.airlift.http.server.HttpServerInfo$$FastClassByGuice$$bd4c327f.newInstance(<generated>)
	at com.google.inject.internal.DefaultConstructionProxyFactory$FastClassProxy.newInstance(DefaultConstructionProxyFactory.java:89)
	at com.google.inject.internal.ConstructorInjector.provision(ConstructorInjector.java:114)
	at com.google.inject.internal.ConstructorInjector.construct(ConstructorInjector.java:91)
	at com.google.inject.internal.ConstructorBindingImpl$Factory.get(ConstructorBindingImpl.java:306)
	at com.google.inject.internal.ProviderToInternalFactoryAdapter.get(ProviderToInternalFactoryAdapter.java:40)
	at com.google.inject.internal.SingletonScope$1.get(SingletonScope.java:148)
	at com.google.inject.internal.InternalFactoryToProviderAdapter.get(InternalFactoryToProviderAdapter.java:39)
	at com.google.inject.internal.SingleParameterInjector.inject(SingleParameterInjector.java:42)
	at com.google.inject.internal.SingleParameterInjector.getAll(SingleParameterInjector.java:65)
	at com.google.inject.internal.ConstructorInjector.provision(ConstructorInjector.java:113)
	at com.google.inject.internal.ConstructorInjector.construct(ConstructorInjector.java:91)
	at com.google.inject.internal.ConstructorBindingImpl$Factory.get(ConstructorBindingImpl.java:306)
	at com.google.inject.internal.FactoryProxy.get(FactoryProxy.java:62)
	at com.google.inject.internal.SingleParameterInjector.inject(SingleParameterInjector.java:42)
	at com.google.inject.internal.SingleParameterInjector.getAll(SingleParameterInjector.java:65)
	at com.google.inject.internal.SingleMethodInjector.inject(SingleMethodInjector.java:82)
	at com.google.inject.internal.MembersInjectorImpl.injectMembers(MembersInjectorImpl.java:147)
	at com.google.inject.internal.MembersInjectorImpl.injectAndNotify(MembersInjectorImpl.java:101)
	at com.google.inject.internal.Initializer$InjectableReference.get(Initializer.java:245)
	at com.google.inject.internal.Initializer.injectAll(Initializer.java:140)
	at com.google.inject.internal.InternalInjectorCreator.injectDynamically(InternalInjectorCreator.java:176)
	at com.google.inject.internal.InternalInjectorCreator.build(InternalInjectorCreator.java:109)
	at com.google.inject.Guice.createInjector(Guice.java:87)
	at io.airlift.bootstrap.Bootstrap.initialize(Bootstrap.java:242)
	at com.facebook.presto.server.testing.TestingPrestoServer.<init>(TestingPrestoServer.java:269)
	at com.facebook.presto.tests.DistributedQueryRunner.createTestingPrestoServer(DistributedQueryRunner.java:201)
	at com.facebook.presto.tests.DistributedQueryRunner.<init>(DistributedQueryRunner.java:142)
	at com.facebook.presto.tests.DistributedQueryRunner.<init>(DistributedQueryRunner.java:105)
	at org.apache.carbondata.presto.server.PrestoServer.queryRunner$lzycompute(PrestoServer.scala:49)
	at org.apache.carbondata.presto.server.PrestoServer.queryRunner(PrestoServer.scala:49)
	at org.apache.carbondata.presto.server.PrestoServer.createQueryRunner(PrestoServer.scala:96)
	at org.apache.carbondata.presto.server.PrestoServer.startServer(PrestoServer.scala:76)
	at org.apache.carbondata.presto.integrationtest.PrestoTestNonTransactionalTableFiles.beforeAll(PrestoTestNonTransactionalTableFiles.scala:60)
	at org.scalatest.BeforeAndAfterAll$class.beforeAll(BeforeAndAfterAll.scala:187)
	at org.apache.carbondata.presto.integrationtest.PrestoTestNonTransactionalTableFiles.beforeAll(PrestoTestNonTransactionalTableFiles.scala:38)
	at org.scalatest.BeforeAndAfterAll$class.run(BeforeAndAfterAll.scala:253)
	at org.apache.carbondata.presto.integrationtest.PrestoTestNonTransactionalTableFiles.run(PrestoTestNonTransactionalTableFiles.scala:38)
	at org.scalatest.Suite$class.callExecuteOnSuite$1(Suite.scala:1492)
	at org.scalatest.Suite$$anonfun$runNestedSuites$1.apply(Suite.scala:1528)
	at org.scalatest.Suite$$anonfun$runNestedSuites$1.apply(Suite.scala:1526)
	at scala.collection.IndexedSeqOptimized$class.foreach(IndexedSeqOptimized.scala:33)
	at scala.collection.mutable.ArrayOps$ofRef.foreach(ArrayOps.scala:186)
	at org.scalatest.Suite$class.runNestedSuites(Suite.scala:1526)
	at org.scalatest.tools.DiscoverySuite.runNestedSuites(DiscoverySuite.scala:29)
	at org.scalatest.Suite$class.run(Suite.scala:1421)
	at org.scalatest.tools.DiscoverySuite.run(DiscoverySuite.scala:29)
	at org.scalatest.tools.SuiteRunner.run(SuiteRunner.scala:55)
	at org.scalatest.tools.Runner$$anonfun$doRunRunRunDaDoRunRun$3.apply(Runner.scala:2563)
	at org.scalatest.tools.Runner$$anonfun$doRunRunRunDaDoRunRun$3.apply(Runner.scala:2557)
	at scala.collection.immutable.List.foreach(List.scala:381)
	at org.scalatest.tools.Runner$.doRunRunRunDaDoRunRun(Runner.scala:2557)
	at org.scalatest.tools.Runner$$anonfun$runOptionallyWithPassFailReporter$2.apply(Runner.scala:1044)
	at org.scalatest.tools.Runner$$anonfun$runOptionallyWithPassFailReporter$2.apply(Runner.scala:1043)
	at org.scalatest.tools.Runner$.withClassLoaderAndDispatchReporter(Runner.scala:2722)
	at org.scalatest.tools.Runner$.runOptionallyWithPassFailReporter(Runner.scala:1043)
	at org.scalatest.tools.Runner$.main(Runner.scala:860)
	at org.scalatest.tools.Runner.main(Runner.scala)
Caused by: java.net.BindException: Address already in use
	at sun.nio.ch.Net.bind0(Native Method)
	at sun.nio.ch.Net.bind(Net.java:433)
	at sun.nio.ch.Net.bind(Net.java:425)
	at sun.nio.ch.ServerSocketChannelImpl.bind(ServerSocketChannelImpl.java:223)
	at sun.nio.ch.ServerSocketAdaptor.bind(ServerSocketAdaptor.java:74)
	at io.airlift.http.server.HttpServerInfo.createChannel(HttpServerInfo.java:158)
	... 59 more

3) Error injecting constructor, java.io.UncheckedIOException: java.net.BindException:
Address already in use
  at io.airlift.http.server.HttpServerInfo.<init>(HttpServerInfo.java:46)
  at io.airlift.http.server.testing.TestingHttpServerModule.configure(TestingHttpServerModule.java:63)
  while locating io.airlift.http.server.HttpServerInfo
    for the 1st parameter of io.airlift.http.server.LocalAnnouncementHttpServerInfo.<init>(LocalAnnouncementHttpServerInfo.java:31)
  while locating io.airlift.http.server.LocalAnnouncementHttpServerInfo
  while locating io.airlift.discovery.client.AnnouncementHttpServerInfo
    for the 1st parameter of io.airlift.discovery.client.DiscoveryBinder$HttpAnnouncementProvider.setAnnouncementHttpServerInfo(DiscoveryBinder.java:122)
  at io.airlift.discovery.client.DiscoveryBinder.bindServiceAnnouncement(DiscoveryBinder.java:79)
Caused by: java.io.UncheckedIOException (same stack trace as error #2)
3 errors
  at com.google.inject.internal.Errors.throwCreationExceptionIfErrorsExist(Errors.java:543)
  at com.google.inject.internal.InternalInjectorCreator.injectDynamically(InternalInjectorCreator.java:178)
  at com.google.inject.internal.InternalInjectorCreator.build(InternalInjectorCreator.java:109)
  at com.google.inject.Guice.createInjector(Guice.java:87)
  at io.airlift.bootstrap.Bootstrap.initialize(Bootstrap.java:242)
  at com.facebook.presto.server.testing.TestingPrestoServer.<init>(TestingPrestoServer.java:269)
  at com.facebook.presto.tests.DistributedQueryRunner.createTestingPrestoServer(DistributedQueryRunner.java:201)
  at com.facebook.presto.tests.DistributedQueryRunner.<init>(DistributedQueryRunner.java:142)
  at com.facebook.presto.tests.DistributedQueryRunner.<init>(DistributedQueryRunner.java:105)
  at org.apache.carbondata.presto.server.PrestoServer.queryRunner$lzycompute(PrestoServer.scala:49)
  ...
Run completed in 30 seconds, 172 milliseconds.
Total number of tests run: 0
Suites: completed 1, aborted 3
Tests: succeeded 0, failed 0, canceled 0, ignored 0, pending 0
*** 3 SUITES ABORTED ***
[JENKINS] Recording test results
[INFO] ------------------------------------------------------------------------
[INFO] Reactor Summary:
[INFO] 
[INFO] Apache CarbonData :: Parent ........................ SUCCESS [ 15.997 s]
[INFO] Apache CarbonData :: Common ........................ SUCCESS [ 25.191 s]
[INFO] Apache CarbonData :: Core .......................... SUCCESS [03:26 min]
[INFO] Apache CarbonData :: Processing .................... SUCCESS [ 43.993 s]
[INFO] Apache CarbonData :: Hadoop ........................ SUCCESS [ 32.844 s]
[INFO] Apache CarbonData :: Streaming ..................... SUCCESS [ 42.874 s]
[INFO] Apache CarbonData :: Store SDK ..................... SUCCESS [ 58.360 s]
[INFO] Apache CarbonData :: Spark Datasource .............. SUCCESS [04:15 min]
[INFO] Apache CarbonData :: Spark Common .................. SUCCESS [01:59 min]
[INFO] Apache CarbonData :: CLI ........................... SUCCESS [05:00 min]
[INFO] Apache CarbonData :: Lucene Index DataMap .......... SUCCESS [ 23.637 s]
[INFO] Apache CarbonData :: Bloom Index DataMap ........... SUCCESS [ 19.240 s]
[INFO] Apache CarbonData :: Spark2 ........................ SUCCESS [22:47 min]
[INFO] Apache CarbonData :: Spark Common Test ............. SUCCESS [02:42 min]
[INFO] Apache CarbonData :: DataMap Examples .............. SUCCESS [ 14.579 s]
[INFO] Apache CarbonData :: Assembly ...................... SUCCESS [ 20.550 s]
[INFO] Apache CarbonData :: Hive .......................... SUCCESS [ 50.026 s]
[INFO] Apache CarbonData :: presto ........................ FAILURE [01:47 min]
[INFO] Apache CarbonData :: Examples ...................... SKIPPED
[INFO] ------------------------------------------------------------------------
[INFO] BUILD FAILURE
[INFO] ------------------------------------------------------------------------
[INFO] Total time: 49:06 min
[INFO] Finished at: 2019-05-17T08:20:18+00:00
[INFO] Final Memory: 213M/1965M
[INFO] ------------------------------------------------------------------------
Waiting for Jenkins to finish collecting data
[ERROR] Failed to execute goal org.scalatest:scalatest-maven-plugin:1.0:test (test) on project
carbondata-presto: There are test failures -> [Help 1]
org.apache.maven.lifecycle.LifecycleExecutionException: Failed to execute goal org.scalatest:scalatest-maven-plugin:1.0:test
(test) on project carbondata-presto: There are test failures
	at org.apache.maven.lifecycle.internal.MojoExecutor.execute(MojoExecutor.java:212)
	at org.apache.maven.lifecycle.internal.MojoExecutor.execute(MojoExecutor.java:153)
	at org.apache.maven.lifecycle.internal.MojoExecutor.execute(MojoExecutor.java:145)
	at org.apache.maven.lifecycle.internal.LifecycleModuleBuilder.buildProject(LifecycleModuleBuilder.java:116)
	at org.apache.maven.lifecycle.internal.LifecycleModuleBuilder.buildProject(LifecycleModuleBuilder.java:80)
	at org.apache.maven.lifecycle.internal.builder.singlethreaded.SingleThreadedBuilder.build(SingleThreadedBuilder.java:51)
	at org.apache.maven.lifecycle.internal.LifecycleStarter.execute(LifecycleStarter.java:128)
	at org.apache.maven.DefaultMaven.doExecute(DefaultMaven.java:307)
	at org.apache.maven.DefaultMaven.doExecute(DefaultMaven.java:193)
	at org.apache.maven.DefaultMaven.execute(DefaultMaven.java:106)
	at org.jvnet.hudson.maven3.launcher.Maven33Launcher.main(Maven33Launcher.java:129)
	at sun.reflect.NativeMethodAccessorImpl.invoke0(Native Method)
	at sun.reflect.NativeMethodAccessorImpl.invoke(NativeMethodAccessorImpl.java:62)
	at sun.reflect.DelegatingMethodAccessorImpl.invoke(DelegatingMethodAccessorImpl.java:43)
	at java.lang.reflect.Method.invoke(Method.java:498)
	at org.codehaus.plexus.classworlds.launcher.Launcher.launchStandard(Launcher.java:330)
	at org.codehaus.plexus.classworlds.launcher.Launcher.launch(Launcher.java:238)
	at jenkins.maven3.agent.Maven33Main.launch(Maven33Main.java:176)
	at sun.reflect.NativeMethodAccessorImpl.invoke0(Native Method)
	at sun.reflect.NativeMethodAccessorImpl.invoke(NativeMethodAccessorImpl.java:62)
	at sun.reflect.DelegatingMethodAccessorImpl.invoke(DelegatingMethodAccessorImpl.java:43)
	at java.lang.reflect.Method.invoke(Method.java:498)
	at hudson.maven.Maven3Builder.call(Maven3Builder.java:139)
	at hudson.maven.Maven3Builder.call(Maven3Builder.java:70)
	at hudson.remoting.UserRequest.perform(UserRequest.java:212)
	at hudson.remoting.UserRequest.perform(UserRequest.java:54)
	at hudson.remoting.Request$2.run(Request.java:369)
	at hudson.remoting.InterceptingExecutorService$1.call(InterceptingExecutorService.java:72)
	at java.util.concurrent.FutureTask.run(FutureTask.java:266)
	at java.util.concurrent.ThreadPoolExecutor.runWorker(ThreadPoolExecutor.java:1149)
	at java.util.concurrent.ThreadPoolExecutor$Worker.run(ThreadPoolExecutor.java:624)
	at java.lang.Thread.run(Thread.java:748)
Caused by: org.apache.maven.plugin.MojoFailureException: There are test failures
	at org.scalatest.tools.maven.TestMojo.execute(TestMojo.java:107)
	at org.apache.maven.plugin.DefaultBuildPluginManager.executeMojo(DefaultBuildPluginManager.java:134)
	at org.apache.maven.lifecycle.internal.MojoExecutor.execute(MojoExecutor.java:207)
	... 31 more
[ERROR] 
[ERROR] Re-run Maven using the -X switch to enable full debug logging.
[ERROR] 
[ERROR] For more information about the errors and possible solutions, please read the following
articles:
[ERROR] [Help 1] http://cwiki.apache.org/confluence/display/MAVEN/MojoFailureException
[ERROR] 
[ERROR] After correcting the problems, you can resume the build with the command
[ERROR]   mvn <goals> -rf :carbondata-presto
[JENKINS] Archiving <https://builds.apache.org/job/carbondata-master-spark-2.1/ws/processing/pom.xml>
to org.apache.carbondata/carbondata-processing/1.6.0-SNAPSHOT/carbondata-processing-1.6.0-SNAPSHOT.pom
[JENKINS] Archiving <https://builds.apache.org/job/carbondata-master-spark-2.1/ws/processing/target/carbondata-processing-1.6.0-SNAPSHOT.jar>
to org.apache.carbondata/carbondata-processing/1.6.0-SNAPSHOT/carbondata-processing-1.6.0-SNAPSHOT.jar
[Fast Archiver] No artifacts from carbondata-master-spark-2.1 » Apache CarbonData :: Processing
#3529 to compare, so performing full copy of artifacts
[JENKINS] Archiving <https://builds.apache.org/job/carbondata-master-spark-2.1/ws/datamap/examples/pom.xml>
to org.apache.carbondata/carbondata-datamap-examples/1.6.0-SNAPSHOT/carbondata-datamap-examples-1.6.0-SNAPSHOT.pom
[JENKINS] Archiving <https://builds.apache.org/job/carbondata-master-spark-2.1/ws/datamap/examples/target/carbondata-datamap-examples-1.6.0-SNAPSHOT.jar>
to org.apache.carbondata/carbondata-datamap-examples/1.6.0-SNAPSHOT/carbondata-datamap-examples-1.6.0-SNAPSHOT.jar
[Fast Archiver] No artifacts from carbondata-master-spark-2.1 » Apache CarbonData :: DataMap
Examples #3529 to compare, so performing full copy of artifacts
[JENKINS] Archiving <https://builds.apache.org/job/carbondata-master-spark-2.1/ws/streaming/pom.xml>
to org.apache.carbondata/carbondata-streaming/1.6.0-SNAPSHOT/carbondata-streaming-1.6.0-SNAPSHOT.pom
[JENKINS] Archiving <https://builds.apache.org/job/carbondata-master-spark-2.1/ws/streaming/target/carbondata-streaming-1.6.0-SNAPSHOT.jar>
to org.apache.carbondata/carbondata-streaming/1.6.0-SNAPSHOT/carbondata-streaming-1.6.0-SNAPSHOT.jar
[Fast Archiver] No artifacts from carbondata-master-spark-2.1 » Apache CarbonData :: Streaming
#3529 to compare, so performing full copy of artifacts
[JENKINS] Archiving <https://builds.apache.org/job/carbondata-master-spark-2.1/ws/integration/spark-common/pom.xml>
to org.apache.carbondata/carbondata-spark-common/1.6.0-SNAPSHOT/carbondata-spark-common-1.6.0-SNAPSHOT.pom
[JENKINS] Archiving <https://builds.apache.org/job/carbondata-master-spark-2.1/ws/integration/spark-common/target/carbondata-spark-common-1.6.0-SNAPSHOT.jar>
to org.apache.carbondata/carbondata-spark-common/1.6.0-SNAPSHOT/carbondata-spark-common-1.6.0-SNAPSHOT.jar
[Fast Archiver] No artifacts from carbondata-master-spark-2.1 » Apache CarbonData :: Spark
Common #3529 to compare, so performing full copy of artifacts
[JENKINS] Archiving <https://builds.apache.org/job/carbondata-master-spark-2.1/ws/datamap/lucene/pom.xml>
to org.apache.carbondata/carbondata-lucene/1.6.0-SNAPSHOT/carbondata-lucene-1.6.0-SNAPSHOT.pom
[JENKINS] Archiving <https://builds.apache.org/job/carbondata-master-spark-2.1/ws/datamap/lucene/target/carbondata-lucene-1.6.0-SNAPSHOT.jar>
to org.apache.carbondata/carbondata-lucene/1.6.0-SNAPSHOT/carbondata-lucene-1.6.0-SNAPSHOT.jar
[Fast Archiver] No artifacts from carbondata-master-spark-2.1 » Apache CarbonData :: Lucene
Index DataMap #3529 to compare, so performing full copy of artifacts
[JENKINS] Archiving <https://builds.apache.org/job/carbondata-master-spark-2.1/ws/integration/hive/pom.xml>
to org.apache.carbondata/carbondata-hive/1.6.0-SNAPSHOT/carbondata-hive-1.6.0-SNAPSHOT.pom
[JENKINS] Archiving <https://builds.apache.org/job/carbondata-master-spark-2.1/ws/integration/hive/target/carbondata-hive-1.6.0-SNAPSHOT.jar>
to org.apache.carbondata/carbondata-hive/1.6.0-SNAPSHOT/carbondata-hive-1.6.0-SNAPSHOT.jar
[Fast Archiver] No artifacts from carbondata-master-spark-2.1 » Apache CarbonData :: Hive
#3529 to compare, so performing full copy of artifacts
[JENKINS] Archiving <https://builds.apache.org/job/carbondata-master-spark-2.1/ws/examples/spark2/pom.xml>
to org.apache.carbondata/carbondata-examples/1.6.0-SNAPSHOT/carbondata-examples-1.6.0-SNAPSHOT.pom
[JENKINS] Archiving <https://builds.apache.org/job/carbondata-master-spark-2.1/ws/common/pom.xml>
to org.apache.carbondata/carbondata-common/1.6.0-SNAPSHOT/carbondata-common-1.6.0-SNAPSHOT.pom
[JENKINS] Archiving <https://builds.apache.org/job/carbondata-master-spark-2.1/ws/common/target/carbondata-common-1.6.0-SNAPSHOT.jar>
to org.apache.carbondata/carbondata-common/1.6.0-SNAPSHOT/carbondata-common-1.6.0-SNAPSHOT.jar
[Fast Archiver] No artifacts from carbondata-master-spark-2.1 » Apache CarbonData :: Common
#3529 to compare, so performing full copy of artifacts
[JENKINS] Archiving <https://builds.apache.org/job/carbondata-master-spark-2.1/ws/integration/spark2/pom.xml>
to org.apache.carbondata/carbondata-spark2/1.6.0-SNAPSHOT/carbondata-spark2-1.6.0-SNAPSHOT.pom
[JENKINS] Archiving <https://builds.apache.org/job/carbondata-master-spark-2.1/ws/integration/spark2/target/carbondata-spark2-1.6.0-SNAPSHOT.jar>
to org.apache.carbondata/carbondata-spark2/1.6.0-SNAPSHOT/carbondata-spark2-1.6.0-SNAPSHOT.jar
[Fast Archiver] No artifacts from carbondata-master-spark-2.1 » Apache CarbonData :: Spark2
#3529 to compare, so performing full copy of artifacts
[JENKINS] Archiving <https://builds.apache.org/job/carbondata-master-spark-2.1/ws/tools/cli/pom.xml>
to org.apache.carbondata/carbondata-cli/1.6.0-SNAPSHOT/carbondata-cli-1.6.0-SNAPSHOT.pom
[JENKINS] Archiving <https://builds.apache.org/job/carbondata-master-spark-2.1/ws/tools/cli/target/carbondata-cli-1.6.0-SNAPSHOT.jar>
to org.apache.carbondata/carbondata-cli/1.6.0-SNAPSHOT/carbondata-cli-1.6.0-SNAPSHOT.jar
[Fast Archiver] No artifacts from carbondata-master-spark-2.1 » Apache CarbonData :: CLI
#3529 to compare, so performing full copy of artifacts
[JENKINS] Archiving <https://builds.apache.org/job/carbondata-master-spark-2.1/ws/datamap/bloom/pom.xml>
to org.apache.carbondata/carbondata-bloom/1.6.0-SNAPSHOT/carbondata-bloom-1.6.0-SNAPSHOT.pom
[JENKINS] Archiving <https://builds.apache.org/job/carbondata-master-spark-2.1/ws/datamap/bloom/target/carbondata-bloom-1.6.0-SNAPSHOT.jar>
to org.apache.carbondata/carbondata-bloom/1.6.0-SNAPSHOT/carbondata-bloom-1.6.0-SNAPSHOT.jar
[Fast Archiver] No artifacts from carbondata-master-spark-2.1 » Apache CarbonData :: Bloom
Index DataMap #3529 to compare, so performing full copy of artifacts
[JENKINS] Archiving <https://builds.apache.org/job/carbondata-master-spark-2.1/ws/assembly/pom.xml>
to org.apache.carbondata/carbondata-assembly/1.6.0-SNAPSHOT/carbondata-assembly-1.6.0-SNAPSHOT.pom
[Fast Archiver] No artifacts from carbondata-master-spark-2.1 » Apache CarbonData :: Assembly
#3529 to compare, so performing full copy of artifacts
[JENKINS] Archiving <https://builds.apache.org/job/carbondata-master-spark-2.1/ws/pom.xml>
to org.apache.carbondata/carbondata-parent/1.6.0-SNAPSHOT/carbondata-parent-1.6.0-SNAPSHOT.pom
[Fast Archiver] No artifacts from carbondata-master-spark-2.1 » Apache CarbonData :: Parent
#3529 to compare, so performing full copy of artifacts
[JENKINS] Archiving <https://builds.apache.org/job/carbondata-master-spark-2.1/ws/core/pom.xml>
to org.apache.carbondata/carbondata-core/1.6.0-SNAPSHOT/carbondata-core-1.6.0-SNAPSHOT.pom
[JENKINS] Archiving <https://builds.apache.org/job/carbondata-master-spark-2.1/ws/core/target/carbondata-core-1.6.0-SNAPSHOT.jar>
to org.apache.carbondata/carbondata-core/1.6.0-SNAPSHOT/carbondata-core-1.6.0-SNAPSHOT.jar
[Fast Archiver] No artifacts from carbondata-master-spark-2.1 » Apache CarbonData :: Core
#3529 to compare, so performing full copy of artifacts
[JENKINS] Archiving <https://builds.apache.org/job/carbondata-master-spark-2.1/ws/hadoop/pom.xml>
to org.apache.carbondata/carbondata-hadoop/1.6.0-SNAPSHOT/carbondata-hadoop-1.6.0-SNAPSHOT.pom
[JENKINS] Archiving <https://builds.apache.org/job/carbondata-master-spark-2.1/ws/hadoop/target/carbondata-hadoop-1.6.0-SNAPSHOT.jar>
to org.apache.carbondata/carbondata-hadoop/1.6.0-SNAPSHOT/carbondata-hadoop-1.6.0-SNAPSHOT.jar
[Fast Archiver] No artifacts from carbondata-master-spark-2.1 » Apache CarbonData :: Hadoop
#3529 to compare, so performing full copy of artifacts
[JENKINS] Archiving <https://builds.apache.org/job/carbondata-master-spark-2.1/ws/integration/spark-datasource/pom.xml>
to org.apache.carbondata/carbondata-spark-datasource/1.6.0-SNAPSHOT/carbondata-spark-datasource-1.6.0-SNAPSHOT.pom
[JENKINS] Archiving <https://builds.apache.org/job/carbondata-master-spark-2.1/ws/integration/spark-datasource/target/carbondata-spark-datasource-1.6.0-SNAPSHOT.jar>
to org.apache.carbondata/carbondata-spark-datasource/1.6.0-SNAPSHOT/carbondata-spark-datasource-1.6.0-SNAPSHOT.jar
[Fast Archiver] No artifacts from carbondata-master-spark-2.1 » Apache CarbonData :: Spark
Datasource #3529 to compare, so performing full copy of artifacts
[JENKINS] Archiving <https://builds.apache.org/job/carbondata-master-spark-2.1/ws/integration/presto/pom.xml>
to org.apache.carbondata/carbondata-presto/1.6.0-SNAPSHOT/carbondata-presto-1.6.0-SNAPSHOT.pom
[JENKINS] Archiving <https://builds.apache.org/job/carbondata-master-spark-2.1/ws/integration/spark-common-test/pom.xml>
to org.apache.carbondata/carbondata-spark-common-test/1.6.0-SNAPSHOT/carbondata-spark-common-test-1.6.0-SNAPSHOT.pom
[JENKINS] Archiving <https://builds.apache.org/job/carbondata-master-spark-2.1/ws/integration/spark-common-test/target/carbondata-spark-common-test-1.6.0-SNAPSHOT.jar>
to org.apache.carbondata/carbondata-spark-common-test/1.6.0-SNAPSHOT/carbondata-spark-common-test-1.6.0-SNAPSHOT.jar
[Fast Archiver] No artifacts from carbondata-master-spark-2.1 » Apache CarbonData :: Spark
Common Test #3529 to compare, so performing full copy of artifacts
[JENKINS] Archiving <https://builds.apache.org/job/carbondata-master-spark-2.1/ws/store/sdk/pom.xml>
to org.apache.carbondata/carbondata-store-sdk/1.6.0-SNAPSHOT/carbondata-store-sdk-1.6.0-SNAPSHOT.pom
[JENKINS] Archiving <https://builds.apache.org/job/carbondata-master-spark-2.1/ws/store/sdk/target/carbondata-store-sdk-1.6.0-SNAPSHOT.jar>
to org.apache.carbondata/carbondata-store-sdk/1.6.0-SNAPSHOT/carbondata-store-sdk-1.6.0-SNAPSHOT.jar
[Fast Archiver] No artifacts from carbondata-master-spark-2.1 » Apache CarbonData :: Store
SDK #3529 to compare, so performing full copy of artifacts
Sending e-mails to: commits@carbondata.apache.org
Sending e-mails to: commits@carbondata.apache.org
Sending e-mails to: commits@carbondata.apache.org ravi.pesala@gmail.com
Sending e-mails to: commits@carbondata.apache.org
channel stopped
Not sending mail to unregistered user kunalkapoor642@gmail.com

Mime
View raw message