carbondata-commits mailing list archives

Site index · List index
Message view « Date » · « Thread »
Top « Date » · « Thread »
From Apache Jenkins Server <jenk...@builds.apache.org>
Subject Build failed in Jenkins: carbondata-master-spark-2.1 » Apache CarbonData :: Examples #3566
Date Mon, 03 Jun 2019 09:41:28 GMT
See <https://builds.apache.org/job/carbondata-master-spark-2.1/org.apache.carbondata$carbondata-examples/3566/display/redirect>

------------------------------------------
[...truncated 277.67 KB...]
|31.127208480565372|2017-01-01 00:00:...|
|31.035714285714285|2003-01-01 00:00:...|
|29.097014925373134|2005-01-01 00:00:...|
|29.647727272727273|2014-01-01 00:00:...|
|30.673003802281368|2016-01-01 00:00:...|
|30.076045627376427|2011-01-01 00:00:...|
| 28.46887966804979|2015-01-01 00:00:...|
| 30.94980694980695|2009-01-01 00:00:...|
|29.014545454545456|2002-01-01 00:00:...|
| 30.17479674796748|2004-01-01 00:00:...|
|28.540425531914895|2000-01-01 00:00:...|
| 30.31923076923077|2008-01-01 00:00:...|
|28.004273504273506|2012-01-01 00:00:...|
| 27.78688524590164|2007-01-01 00:00:...|
|29.780269058295964|2013-01-01 00:00:...|
+------------------+--------------------+
only showing top 20 rows

2019-06-03 09:39:59 AUDIT audit:72 - {"time":"June 3, 2019 2:39:59 AM PDT","username":"jenkins","opName":"DROP
TABLE","opId":"16190826926914202","opStatus":"START"}
2019-06-03 09:39:59 AUDIT audit:93 - {"time":"June 3, 2019 2:39:59 AM PDT","username":"jenkins","opName":"DROP
TABLE","opId":"16190826926914202","opStatus":"SUCCESS","opTime":"222 ms","table":"default.timeseriestable","extraInfo":{}}
- TimeSeriesPreAggregateTableExample
2019-06-03 09:39:59 AUDIT audit:72 - {"time":"June 3, 2019 2:39:59 AM PDT","username":"jenkins","opName":"CREATE
TABLE","opId":"16190827241024870","opStatus":"START"}
2019-06-03 09:39:59 AUDIT audit:93 - {"time":"June 3, 2019 2:39:59 AM PDT","username":"jenkins","opName":"CREATE
TABLE","opId":"16190827241024870","opStatus":"SUCCESS","opTime":"88 ms","table":"default.persontable","extraInfo":{"bad_record_path":"","streaming":"false","local_dictionary_enable":"true","external":"false","sort_columns":"","comment":""}}
2019-06-03 09:39:59 AUDIT audit:72 - {"time":"June 3, 2019 2:39:59 AM PDT","username":"jenkins","opName":"LOAD
DATA OVERWRITE","opId":"16190827331654574","opStatus":"START"}
2019-06-03 09:40:00 AUDIT audit:93 - {"time":"June 3, 2019 2:40:00 AM PDT","username":"jenkins","opName":"LOAD
DATA OVERWRITE","opId":"16190827331654574","opStatus":"SUCCESS","opTime":"681 ms","table":"default.personTable","extraInfo":{"SegmentId":"0","DataSize":"771.50KB","IndexSize":"720.0B"}}
2019-06-03 09:40:00 AUDIT audit:72 - {"time":"June 3, 2019 2:40:00 AM PDT","username":"jenkins","opName":"CREATE
DATAMAP","opId":"16190828017879509","opStatus":"START"}
2019-06-03 09:40:02 AUDIT audit:93 - {"time":"June 3, 2019 2:40:02 AM PDT","username":"jenkins","opName":"CREATE
DATAMAP","opId":"16190828017879509","opStatus":"SUCCESS","opTime":"2160 ms","table":"default.persontable","extraInfo":{"provider":"lucene","dmName":"dm","index_columns":"id
, name"}}
+--------+
|count(1)|
+--------+
|       8|
+--------+

+--------+
|count(1)|
+--------+
|       8|
+--------+

time for query on table with lucene datamap table:0.271
time for query on table without lucene datamap table:0.218
+-----------------+-------------+
|               id|         name|
+-----------------+-------------+
|which test1 good2|who and name2|
|which test1 good9|who and name4|
|which test1 good6|who and name5|
|which test1 good2|who and name2|
|which test1 good9|who and name4|
|which test1 good6|who and name5|
+-----------------+-------------+

+-----------------+-------------+
|               id|         name|
+-----------------+-------------+
|which test1 good1|who and name2|
|which test1 good2|who and name2|
|which test1 good9|who and name4|
|which test1 good6|who and name5|
|which test1 good1|who and name2|
|which test1 good2|who and name2|
|which test1 good9|who and name4|
|which test1 good6|who and name5|
+-----------------+-------------+

2019-06-03 09:40:03 AUDIT audit:72 - {"time":"June 3, 2019 2:40:03 AM PDT","username":"jenkins","opName":"DROP
TABLE","opId":"16190830993253919","opStatus":"START"}
2019-06-03 09:40:03 AUDIT audit:93 - {"time":"June 3, 2019 2:40:03 AM PDT","username":"jenkins","opName":"DROP
TABLE","opId":"16190830993253919","opStatus":"SUCCESS","opTime":"107 ms","table":"default.persontable","extraInfo":{}}
- LuceneDataMapExample
2019-06-03 09:40:03 AUDIT audit:72 - {"time":"June 3, 2019 2:40:03 AM PDT","username":"jenkins","opName":"CREATE
TABLE","opId":"16190831115332402","opStatus":"START"}
2019-06-03 09:40:03 AUDIT audit:93 - {"time":"June 3, 2019 2:40:03 AM PDT","username":"jenkins","opName":"CREATE
TABLE","opId":"16190831115332402","opStatus":"SUCCESS","opTime":"71 ms","table":"default.origin_table","extraInfo":{"bad_record_path":"","local_dictionary_enable":"true","external":"false","sort_columns":"","comment":""}}
2019-06-03 09:40:03 AUDIT audit:72 - {"time":"June 3, 2019 2:40:03 AM PDT","username":"jenkins","opName":"LOAD
DATA","opId":"16190831192345008","opStatus":"START"}
2019-06-03 09:40:03 ERROR DataLoadExecutor:55 - Data Load is partially success for table origin_table
2019-06-03 09:40:03 AUDIT audit:93 - {"time":"June 3, 2019 2:40:03 AM PDT","username":"jenkins","opName":"LOAD
DATA","opId":"16190831192345008","opStatus":"SUCCESS","opTime":"200 ms","table":"default.origin_table","extraInfo":{"SegmentId":"0","DataSize":"2.85KB","IndexSize":"1.43KB"}}
2019-06-03 09:40:03 AUDIT audit:72 - {"time":"June 3, 2019 2:40:03 AM PDT","username":"jenkins","opName":"LOAD
DATA","opId":"16190831397993052","opStatus":"START"}
2019-06-03 09:40:04 ERROR DataLoadExecutor:55 - Data Load is partially success for table origin_table
2019-06-03 09:40:04 AUDIT audit:93 - {"time":"June 3, 2019 2:40:04 AM PDT","username":"jenkins","opName":"LOAD
DATA","opId":"16190831397993052","opStatus":"SUCCESS","opTime":"197 ms","table":"default.origin_table","extraInfo":{"SegmentId":"1","DataSize":"2.85KB","IndexSize":"1.43KB"}}
2019-06-03 09:40:04 AUDIT audit:72 - {"time":"June 3, 2019 2:40:04 AM PDT","username":"jenkins","opName":"LOAD
DATA","opId":"16190831600609075","opStatus":"START"}
2019-06-03 09:40:04 ERROR DataLoadExecutor:55 - Data Load is partially success for table origin_table
2019-06-03 09:40:04 AUDIT audit:93 - {"time":"June 3, 2019 2:40:04 AM PDT","username":"jenkins","opName":"LOAD
DATA","opId":"16190831600609075","opStatus":"SUCCESS","opTime":"191 ms","table":"default.origin_table","extraInfo":{"SegmentId":"2","DataSize":"2.85KB","IndexSize":"1.43KB"}}
2019-06-03 09:40:04 AUDIT audit:72 - {"time":"June 3, 2019 2:40:04 AM PDT","username":"jenkins","opName":"LOAD
DATA","opId":"16190831798289192","opStatus":"START"}
2019-06-03 09:40:04 ERROR DataLoadExecutor:55 - Data Load is partially success for table origin_table
2019-06-03 09:40:04 AUDIT audit:93 - {"time":"June 3, 2019 2:40:04 AM PDT","username":"jenkins","opName":"LOAD
DATA","opId":"16190831798289192","opStatus":"SUCCESS","opTime":"206 ms","table":"default.origin_table","extraInfo":{"SegmentId":"3","DataSize":"2.85KB","IndexSize":"1.43KB"}}
+--------+
|count(1)|
+--------+
|      40|
+--------+

2019-06-03 09:40:04 AUDIT audit:72 - {"time":"June 3, 2019 2:40:04 AM PDT","username":"jenkins","opName":"CREATE
TABLE","opId":"16190832075195054","opStatus":"START"}
2019-06-03 09:40:04 AUDIT audit:93 - {"time":"June 3, 2019 2:40:04 AM PDT","username":"jenkins","opName":"CREATE
TABLE","opId":"16190832075195054","opStatus":"SUCCESS","opTime":"59 ms","table":"default.external_table","extraInfo":{"bad_record_path":"","_filelevelformat":"false","local_dictionary_enable":"true","external":"true","_external":"true","sort_columns":"","comment":""}}
+--------+
|count(1)|
+--------+
|      40|
+--------+

2019-06-03 09:40:04 AUDIT audit:72 - {"time":"June 3, 2019 2:40:04 AM PDT","username":"jenkins","opName":"LOAD
DATA","opId":"16190832194770498","opStatus":"START"}
2019-06-03 09:40:04 ERROR DataLoadExecutor:55 - Data Load is partially success for table origin_table
2019-06-03 09:40:04 AUDIT audit:93 - {"time":"June 3, 2019 2:40:04 AM PDT","username":"jenkins","opName":"LOAD
DATA","opId":"16190832194770498","opStatus":"SUCCESS","opTime":"163 ms","table":"default.origin_table","extraInfo":{"SegmentId":"4","DataSize":"2.85KB","IndexSize":"1.43KB"}}
2019-06-03 09:40:04 AUDIT audit:72 - {"time":"June 3, 2019 2:40:04 AM PDT","username":"jenkins","opName":"LOAD
DATA","opId":"16190832363260895","opStatus":"START"}
2019-06-03 09:40:04 ERROR DataLoadExecutor:55 - Data Load is partially success for table origin_table
2019-06-03 09:40:05 AUDIT audit:93 - {"time":"June 3, 2019 2:40:05 AM PDT","username":"jenkins","opName":"LOAD
DATA","opId":"16190832363260895","opStatus":"SUCCESS","opTime":"172 ms","table":"default.origin_table","extraInfo":{"SegmentId":"5","DataSize":"2.85KB","IndexSize":"1.43KB"}}
+--------+
|count(1)|
+--------+
|      60|
+--------+

2019-06-03 09:40:05 AUDIT audit:72 - {"time":"June 3, 2019 2:40:05 AM PDT","username":"jenkins","opName":"DROP
TABLE","opId":"16190832588433431","opStatus":"START"}
2019-06-03 09:40:05 AUDIT audit:93 - {"time":"June 3, 2019 2:40:05 AM PDT","username":"jenkins","opName":"DROP
TABLE","opId":"16190832588433431","opStatus":"SUCCESS","opTime":"92 ms","table":"default.origin_table","extraInfo":{}}
- ExternalTableExample

Data:
0	robot0	0	0	9223372036854775807	0.0	true	2019-03-01	2019-02-12 03:03:34.0	12.35	varchar	
Hello World From Carbon 
1	robot1	1	1	9223372036854775806	0.5	true	2019-03-01	2019-02-12 03:03:34.0	12.35	varchar	
Hello World From Carbon 
2	robot2	2	2	9223372036854775805	1.0	true	2019-03-01	2019-02-12 03:03:34.0	12.35	varchar	
Hello World From Carbon 
3	robot3	3	3	9223372036854775804	1.5	true	2019-03-01	2019-02-12 03:03:34.0	12.35	varchar	
Hello World From Carbon 
4	robot4	4	4	9223372036854775803	2.0	true	2019-03-01	2019-02-12 03:03:34.0	12.35	varchar	
Hello World From Carbon 
5	robot5	5	5	9223372036854775802	2.5	true	2019-03-01	2019-02-12 03:03:34.0	12.35	varchar	
Hello World From Carbon 
6	robot6	6	6	9223372036854775801	3.0	true	2019-03-01	2019-02-12 03:03:34.0	12.35	varchar	
Hello World From Carbon 
7	robot7	7	7	9223372036854775800	3.5	true	2019-03-01	2019-02-12 03:03:34.0	12.35	varchar	
Hello World From Carbon 
8	robot8	8	8	9223372036854775799	4.0	true	2019-03-01	2019-02-12 03:03:34.0	12.35	varchar	
Hello World From Carbon 
9	robot9	9	9	9223372036854775798	4.5	true	2019-03-01	2019-02-12 03:03:34.0	12.35	varchar	
Hello World From Carbon 

Data:
0	robot0	2019-03-01	2019-02-12 03:03:34.0	varchar	Hello World From Carbon 	0	0	9223372036854775807
0.0	true	12.35	
1	robot1	2019-03-01	2019-02-12 03:03:34.0	varchar	Hello World From Carbon 	1	1	9223372036854775806
0.5	true	12.35	
2	robot2	2019-03-01	2019-02-12 03:03:34.0	varchar	Hello World From Carbon 	2	2	9223372036854775805
1.0	true	12.35	
3	robot3	2019-03-01	2019-02-12 03:03:34.0	varchar	Hello World From Carbon 	3	3	9223372036854775804
1.5	true	12.35	
4	robot4	2019-03-01	2019-02-12 03:03:34.0	varchar	Hello World From Carbon 	4	4	9223372036854775803
2.0	true	12.35	
5	robot5	2019-03-01	2019-02-12 03:03:34.0	varchar	Hello World From Carbon 	5	5	9223372036854775802
2.5	true	12.35	
6	robot6	2019-03-01	2019-02-12 03:03:34.0	varchar	Hello World From Carbon 	6	6	9223372036854775801
3.0	true	12.35	
7	robot7	2019-03-01	2019-02-12 03:03:34.0	varchar	Hello World From Carbon 	7	7	9223372036854775800
3.5	true	12.35	
8	robot8	2019-03-01	2019-02-12 03:03:34.0	varchar	Hello World From Carbon 	8	8	9223372036854775799
4.0	true	12.35	
9	robot9	2019-03-01	2019-02-12 03:03:34.0	varchar	Hello World From Carbon 	9	9	9223372036854775798
4.5	true	12.35	
- CarbonReaderExample
2019-06-03 09:40:05 AUDIT audit:72 - {"time":"June 3, 2019 2:40:05 AM PDT","username":"jenkins","opName":"CREATE
TABLE","opId":"16190832929245708","opStatus":"START"}
2019-06-03 09:40:06 AUDIT audit:93 - {"time":"June 3, 2019 2:40:06 AM PDT","username":"jenkins","opName":"CREATE
TABLE","opId":"16190832929245708","opStatus":"SUCCESS","opTime":"1366 ms","table":"default.hive_carbon_example","extraInfo":{"bad_record_path":"","local_dictionary_enable":"true","external":"false","sort_columns":"","comment":""}}
2019-06-03 09:40:06 AUDIT audit:72 - {"time":"June 3, 2019 2:40:06 AM PDT","username":"jenkins","opName":"LOAD
DATA","opId":"16190834321301827","opStatus":"START"}
2019-06-03 09:40:06 AUDIT audit:93 - {"time":"June 3, 2019 2:40:06 AM PDT","username":"jenkins","opName":"LOAD
DATA","opId":"16190834321301827","opStatus":"SUCCESS","opTime":"183 ms","table":"default.hive_carbon_example","extraInfo":{"SegmentId":"0","DataSize":"924.0B","IndexSize":"551.0B"}}
2019-06-03 09:40:06 AUDIT audit:72 - {"time":"June 3, 2019 2:40:06 AM PDT","username":"jenkins","opName":"LOAD
DATA","opId":"16190834513404623","opStatus":"START"}
2019-06-03 09:40:07 AUDIT audit:93 - {"time":"June 3, 2019 2:40:07 AM PDT","username":"jenkins","opName":"LOAD
DATA","opId":"16190834513404623","opStatus":"SUCCESS","opTime":"181 ms","table":"default.hive_carbon_example","extraInfo":{"SegmentId":"1","DataSize":"924.0B","IndexSize":"551.0B"}}
+---+---------+--------+
| id|     name|  salary|
+---+---------+--------+
|  1|  'liang'|200000.0|
|  2|'anubhav'| 20000.0|
|  1|  'liang'|200000.0|
|  2|'anubhav'| 20000.0|
+---+---------+--------+

OK
******Total Number Of Rows Fetched ****** 0
- HiveExample *** FAILED ***
  java.lang.AssertionError: assertion failed
  at scala.Predef$.assert(Predef.scala:156)
  at org.apache.carbondata.examples.HiveExample$.readFromHive(HiveExample.scala:153)
  at org.apache.carbondata.examplesCI.RunExamples$$anonfun$20.apply$mcV$sp(RunExamples.scala:131)
  at org.apache.carbondata.examplesCI.RunExamples$$anonfun$20.apply(RunExamples.scala:129)
  at org.apache.carbondata.examplesCI.RunExamples$$anonfun$20.apply(RunExamples.scala:129)
  at org.scalatest.Transformer$$anonfun$apply$1.apply$mcV$sp(Transformer.scala:22)
  at org.scalatest.OutcomeOf$class.outcomeOf(OutcomeOf.scala:85)
  at org.scalatest.OutcomeOf$.outcomeOf(OutcomeOf.scala:104)
  at org.scalatest.Transformer.apply(Transformer.scala:22)
  at org.scalatest.Transformer.apply(Transformer.scala:20)
  ...
Exception encountered when invoking run on a nested suite - Cannot call methods on a
stopped SparkContext.
This stopped SparkContext was created at:

org.apache.spark.sql.test.util.QueryTest.<init>(QueryTest.scala:115)
org.apache.carbondata.examplesCI.RunExamples.<init>(RunExamples.scala:35)
sun.reflect.NativeConstructorAccessorImpl.newInstance0(Native Method)
sun.reflect.NativeConstructorAccessorImpl.newInstance(NativeConstructorAccessorImpl.java:62)
sun.reflect.DelegatingConstructorAccessorImpl.newInstance(DelegatingConstructorAccessorImpl.java:45)
java.lang.reflect.Constructor.newInstance(Constructor.java:423)
java.lang.Class.newInstance(Class.java:442)
org.scalatest.tools.DiscoverySuite$.getSuiteInstance(DiscoverySuite.scala:69)
org.scalatest.tools.DiscoverySuite$$anonfun$1.apply(DiscoverySuite.scala:38)
org.scalatest.tools.DiscoverySuite$$anonfun$1.apply(DiscoverySuite.scala:37)
scala.collection.TraversableLike$$anonfun$map$1.apply(TraversableLike.scala:234)
scala.collection.TraversableLike$$anonfun$map$1.apply(TraversableLike.scala:234)
scala.collection.Iterator$class.foreach(Iterator.scala:893)
scala.collection.AbstractIterator.foreach(Iterator.scala:1336)
scala.collection.IterableLike$class.foreach(IterableLike.scala:72)
scala.collection.AbstractIterable.foreach(Iterable.scala:54)
scala.collection.TraversableLike$class.map(TraversableLike.scala:234)
scala.collection.AbstractTraversable.map(Traversable.scala:104)
org.scalatest.tools.DiscoverySuite.<init>(DiscoverySuite.scala:37)
org.scalatest.tools.Runner$.genDiscoSuites$1(Runner.scala:2390)

The currently active SparkContext was created at:

(No active SparkContext.)
          *** ABORTED ***
  java.lang.IllegalStateException: Cannot call methods on a stopped SparkContext.
This stopped SparkContext was created at:

org.apache.spark.sql.test.util.QueryTest.<init>(QueryTest.scala:115)
org.apache.carbondata.examplesCI.RunExamples.<init>(RunExamples.scala:35)
sun.reflect.NativeConstructorAccessorImpl.newInstance0(Native Method)
sun.reflect.NativeConstructorAccessorImpl.newInstance(NativeConstructorAccessorImpl.java:62)
sun.reflect.DelegatingConstructorAccessorImpl.newInstance(DelegatingConstructorAccessorImpl.java:45)
java.lang.reflect.Constructor.newInstance(Constructor.java:423)
java.lang.Class.newInstance(Class.java:442)
org.scalatest.tools.DiscoverySuite$.getSuiteInstance(DiscoverySuite.scala:69)
org.scalatest.tools.DiscoverySuite$$anonfun$1.apply(DiscoverySuite.scala:38)
org.scalatest.tools.DiscoverySuite$$anonfun$1.apply(DiscoverySuite.scala:37)
scala.collection.TraversableLike$$anonfun$map$1.apply(TraversableLike.scala:234)
scala.collection.TraversableLike$$anonfun$map$1.apply(TraversableLike.scala:234)
scala.collection.Iterator$class.foreach(Iterator.scala:893)
scala.collection.AbstractIterator.foreach(Iterator.scala:1336)
scala.collection.IterableLike$class.foreach(IterableLike.scala:72)
scala.collection.AbstractIterable.foreach(Iterable.scala:54)
scala.collection.TraversableLike$class.map(TraversableLike.scala:234)
scala.collection.AbstractTraversable.map(Traversable.scala:104)
org.scalatest.tools.DiscoverySuite.<init>(DiscoverySuite.scala:37)
org.scalatest.tools.Runner$.genDiscoSuites$1(Runner.scala:2390)

The currently active SparkContext was created at:

(No active SparkContext.)
  at org.apache.spark.SparkContext.assertNotStopped(SparkContext.scala:100)
  at org.apache.spark.SparkContext$$anonfun$parallelize$1.apply(SparkContext.scala:716)
  at org.apache.spark.SparkContext$$anonfun$parallelize$1.apply(SparkContext.scala:715)
  at org.apache.spark.rdd.RDDOperationScope$.withScope(RDDOperationScope.scala:151)
  at org.apache.spark.rdd.RDDOperationScope$.withScope(RDDOperationScope.scala:112)
  at org.apache.spark.SparkContext.withScope(SparkContext.scala:701)
  at org.apache.spark.SparkContext.parallelize(SparkContext.scala:715)
  at org.apache.spark.sql.execution.command.ExecutedCommandExec.doExecute(commands.scala:74)
  at org.apache.spark.sql.execution.SparkPlan$$anonfun$execute$1.apply(SparkPlan.scala:114)
  at org.apache.spark.sql.execution.SparkPlan$$anonfun$execute$1.apply(SparkPlan.scala:114)
  ...
Run completed in 2 minutes, 40 seconds.
Total number of tests run: 20
Suites: completed 1, aborted 1
Tests: succeeded 19, failed 1, canceled 0, ignored 0, pending 0
*** 1 SUITE ABORTED ***
*** 1 TEST FAILED ***
[JENKINS] Recording test results

Mime
View raw message